hadoop-mapreduce-dev mailing list archives

Site index · List index
Message view « Date » · « Thread »
Top « Date » · « Thread »
From Apache Jenkins Server <jenk...@builds.apache.org>
Subject Hadoop-Mapreduce-trunk - Build # 801 - Still Failing
Date Tue, 30 Aug 2011 15:06:58 GMT
See https://builds.apache.org/job/Hadoop-Mapreduce-trunk/801/

###################################################################################
########################## LAST 60 LINES OF THE CONSOLE ###########################
[...truncated 18279 lines...]
    [junit] Tests run: 5, Failures: 0, Errors: 0, Time elapsed: 7.27 sec
    [junit] Running org.apache.hadoop.record.TestRecordMR
    [junit] Tests run: 1, Failures: 0, Errors: 0, Time elapsed: 4 sec
    [junit] Running org.apache.hadoop.record.TestRecordWritable
    [junit] Tests run: 1, Failures: 0, Errors: 0, Time elapsed: 2.698 sec
    [junit] Running org.apache.hadoop.security.TestMapredGroupMappingServiceRefresh
    [junit] Tests run: 2, Failures: 0, Errors: 0, Time elapsed: 7.659 sec
    [junit] Running org.apache.hadoop.security.authorize.TestServiceLevelAuthorization
    [junit] Tests run: 2, Failures: 0, Errors: 0, Time elapsed: 65.669 sec
    [junit] Running org.apache.hadoop.tools.TestCopyFiles
    [junit] Tests run: 17, Failures: 0, Errors: 0, Time elapsed: 90.499 sec
    [junit] Running org.apache.hadoop.tools.TestDistCh
    [junit] Tests run: 1, Failures: 0, Errors: 0, Time elapsed: 17.705 sec
    [junit] Running org.apache.hadoop.tools.TestHadoopArchives
    [junit] Tests run: 1, Failures: 0, Errors: 0, Time elapsed: 18.956 sec
    [junit] Running org.apache.hadoop.tools.TestHarFileSystem
    [junit] Tests run: 4, Failures: 0, Errors: 0, Time elapsed: 96.839 sec
    [junit] Running org.apache.hadoop.tools.rumen.TestConcurrentRead
    [junit] Tests run: 1, Failures: 0, Errors: 0, Time elapsed: 1.356 sec
    [junit] Running org.apache.hadoop.tools.rumen.TestHistograms
    [junit] Tests run: 1, Failures: 0, Errors: 0, Time elapsed: 0.725 sec
    [junit] Running org.apache.hadoop.tools.rumen.TestParsedLine
    [junit] Tests run: 6, Failures: 0, Errors: 0, Time elapsed: 0.077 sec
    [junit] Running org.apache.hadoop.tools.rumen.TestPiecewiseLinearInterpolation
    [junit] Tests run: 1, Failures: 0, Errors: 0, Time elapsed: 1.157 sec
    [junit] Running org.apache.hadoop.tools.rumen.TestRandomSeedGenerator
    [junit] Tests run: 1, Failures: 0, Errors: 0, Time elapsed: 0.16 sec
    [junit] Running org.apache.hadoop.tools.rumen.TestRumenFolder
    [junit] Tests run: 2, Failures: 0, Errors: 0, Time elapsed: 2.831 sec
    [junit] Running org.apache.hadoop.tools.rumen.TestRumenJobTraces
    [junit] Tests run: 13, Failures: 0, Errors: 0, Time elapsed: 14.839 sec
    [junit] Running org.apache.hadoop.tools.rumen.TestZombieJob
    [junit] Tests run: 5, Failures: 0, Errors: 0, Time elapsed: 1.801 sec
    [junit] Running org.apache.hadoop.util.TestReflectionUtils
    [junit] Tests run: 1, Failures: 0, Errors: 0, Time elapsed: 0.267 sec
    [junit] Running org.apache.hadoop.util.TestRunJar
    [junit] Tests run: 1, Failures: 0, Errors: 0, Time elapsed: 0.223 sec

checkfailure:
    [touch] Creating /home/jenkins/jenkins-slave/workspace/Hadoop-Mapreduce-trunk/trunk/hadoop-mapreduce-project/build/test/testsfailed

run-test-mapred-all-withtestcaseonly:

run-test-mapred:

BUILD FAILED
/home/jenkins/jenkins-slave/workspace/Hadoop-Mapreduce-trunk/trunk/hadoop-mapreduce-project/build.xml:848:
Tests failed!

Total time: 115 minutes 48 seconds
Build step 'Execute shell' marked build as failure
[FINDBUGS] Skipping publisher since build result is FAILURE
Updating MAPREDUCE-2897
Updating MAPREDUCE-2886
Updating MAPREDUCE-2904
Updating HDFS-1217
Updating HADOOP-7589
Updating MAPREDUCE-2737
Email was triggered for: Failure
Sending email for trigger: Failure



###################################################################################
############################## FAILED TESTS (if any) ##############################
No tests ran.

Mime
View raw message