hadoop-mapreduce-dev mailing list archives

Site index · List index
Message view « Date » · « Thread »
Top « Date » · « Thread »
From Apache Jenkins Server <jenk...@builds.apache.org>
Subject Hadoop-Mapreduce-trunk-Commit - Build # 798 - Still Failing
Date Thu, 25 Aug 2011 22:33:47 GMT
See https://builds.apache.org/job/Hadoop-Mapreduce-trunk-Commit/798/

###################################################################################
########################## LAST 60 LINES OF THE CONSOLE ###########################
[...truncated 1711 lines...]
[jsp-compile] log4j:WARN See http://logging.apache.org/log4j/1.2/faq.html#noconfig for more
info.
    [javac] Compiling 1 source file to /home/jenkins/jenkins-slave/workspace/Hadoop-Mapreduce-trunk-Commit/trunk/hadoop-mapreduce-project/build/classes

clover.setup:

clover.info:
     [echo] 
     [echo]      Clover not found. Code coverage reports disabled.
     [echo]   

clover:

check-c++-makefiles:

create-c++-pipes-makefile:

ivy-download:
      [get] Getting: http://repo2.maven.org/maven2/org/apache/ivy/ivy/2.2.0/ivy-2.2.0.jar
      [get] To: /home/jenkins/jenkins-slave/workspace/Hadoop-Mapreduce-trunk-Commit/trunk/hadoop-mapreduce-project/ivy/ivy-2.2.0.jar
      [get] Not modified - so not downloaded

ivy-init-dirs:

ivy-probe-antlib:

ivy-init-antlib:

ivy-init:
[ivy:configure] :: loading settings :: file = /home/jenkins/jenkins-slave/workspace/Hadoop-Mapreduce-trunk-Commit/trunk/hadoop-mapreduce-project/ivy/ivysettings.xml

ivy-resolve-common:

ivy-retrieve-common:
[ivy:cachepath] DEPRECATED: 'ivy.conf.file' is deprecated, use 'ivy.settings.file' instead
[ivy:cachepath] :: loading settings :: file = /home/jenkins/jenkins-slave/workspace/Hadoop-Mapreduce-trunk-Commit/trunk/hadoop-mapreduce-project/ivy/ivysettings.xml

ivy-resolve-mapred:

ivy-retrieve-mapred:

init:
    [touch] Creating /tmp/null1274969381
   [delete] Deleting: /tmp/null1274969381
    [unzip] Expanding: /home/jenkins/jenkins-slave/workspace/Hadoop-Mapreduce-trunk-Commit/trunk/hadoop-mapreduce-project/build/ivy/lib/Hadoop/common/hadoop-hdfs-0.24.0-SNAPSHOT.jar
into /home/jenkins/jenkins-slave/workspace/Hadoop-Mapreduce-trunk-Commit/trunk/hadoop-mapreduce-project/build

check-c++-configure:

create-c++-pipes-configure:
     [exec] configure: error: cannot find install-sh, install.sh, or shtool in config "/home/jenkins/jenkins-slave/workspace/Hadoop-Mapreduce-trunk-Commit/trunk/hadoop-mapreduce-project/src/c++/pipes"/config

BUILD FAILED
/home/jenkins/jenkins-slave/workspace/Hadoop-Mapreduce-trunk-Commit/trunk/hadoop-mapreduce-project/build.xml:1949:
exec returned: 1

Total time: 13 seconds
Build step 'Execute shell' marked build as failure
Updating MAPREDUCE-2881
Updating HADOOP-7578
Email was triggered for: Failure
Sending email for trigger: Failure



###################################################################################
############################## FAILED TESTS (if any) ##############################
No tests ran.

Mime
View raw message