hadoop-mapreduce-dev mailing list archives

Site index · List index
Message view « Date » · « Thread »
Top « Date » · « Thread »
From Apache Jenkins Server <jenk...@builds.apache.org>
Subject Hadoop-Mapreduce-trunk - Build # 798 - Still Failing
Date Sat, 27 Aug 2011 17:50:11 GMT
See https://builds.apache.org/job/Hadoop-Mapreduce-trunk/798/

###################################################################################
########################## LAST 60 LINES OF THE CONSOLE ###########################
[...truncated 18258 lines...]
    [junit] Tests run: 1, Failures: 0, Errors: 0, Time elapsed: 9.685 sec
    [junit] Running org.apache.hadoop.mapreduce.security.token.delegation.TestDelegationToken
    [junit] Tests run: 1, Failures: 0, Errors: 0, Time elapsed: 2.785 sec
    [junit] Running org.apache.hadoop.mapreduce.util.TestMRAsyncDiskService
    [junit] Tests run: 6, Failures: 0, Errors: 0, Time elapsed: 0.673 sec
    [junit] Running org.apache.hadoop.mapreduce.util.TestProcfsBasedProcessTree
    [junit] Tests run: 5, Failures: 0, Errors: 0, Time elapsed: 7.278 sec
    [junit] Running org.apache.hadoop.record.TestRecordMR
    [junit] Tests run: 1, Failures: 0, Errors: 0, Time elapsed: 4.005 sec
    [junit] Running org.apache.hadoop.record.TestRecordWritable
    [junit] Tests run: 1, Failures: 0, Errors: 0, Time elapsed: 2.459 sec
    [junit] Running org.apache.hadoop.security.TestMapredGroupMappingServiceRefresh
    [junit] Tests run: 2, Failures: 0, Errors: 0, Time elapsed: 7.61 sec
    [junit] Running org.apache.hadoop.security.authorize.TestServiceLevelAuthorization
    [junit] Tests run: 2, Failures: 0, Errors: 0, Time elapsed: 58.897 sec
    [junit] Running org.apache.hadoop.tools.TestCopyFiles
    [junit] Tests run: 17, Failures: 0, Errors: 0, Time elapsed: 91.12 sec
    [junit] Running org.apache.hadoop.tools.TestDistCh
    [junit] Tests run: 1, Failures: 0, Errors: 0, Time elapsed: 21.636 sec
    [junit] Running org.apache.hadoop.tools.TestHadoopArchives
    [junit] Tests run: 1, Failures: 0, Errors: 0, Time elapsed: 18.89 sec
    [junit] Running org.apache.hadoop.tools.TestHarFileSystem
    [junit] Tests run: 4, Failures: 0, Errors: 0, Time elapsed: 97.619 sec
    [junit] Running org.apache.hadoop.tools.rumen.TestConcurrentRead
    [junit] Tests run: 1, Failures: 0, Errors: 0, Time elapsed: 1.406 sec
    [junit] Running org.apache.hadoop.tools.rumen.TestHistograms
    [junit] Tests run: 1, Failures: 0, Errors: 0, Time elapsed: 0.716 sec
    [junit] Running org.apache.hadoop.tools.rumen.TestParsedLine
    [junit] Tests run: 6, Failures: 0, Errors: 0, Time elapsed: 0.077 sec
    [junit] Running org.apache.hadoop.tools.rumen.TestPiecewiseLinearInterpolation
    [junit] Tests run: 1, Failures: 0, Errors: 0, Time elapsed: 1.29 sec
    [junit] Running org.apache.hadoop.tools.rumen.TestRandomSeedGenerator
    [junit] Tests run: 1, Failures: 0, Errors: 0, Time elapsed: 0.16 sec
    [junit] Running org.apache.hadoop.tools.rumen.TestRumenFolder
    [junit] Tests run: 2, Failures: 0, Errors: 0, Time elapsed: 2.795 sec
    [junit] Running org.apache.hadoop.tools.rumen.TestRumenJobTraces
    [junit] Tests run: 13, Failures: 0, Errors: 0, Time elapsed: 15.155 sec
    [junit] Running org.apache.hadoop.tools.rumen.TestZombieJob
    [junit] Tests run: 5, Failures: 0, Errors: 0, Time elapsed: 1.814 sec
    [junit] Running org.apache.hadoop.util.TestReflectionUtils
    [junit] Tests run: 1, Failures: 0, Errors: 0, Time elapsed: 0.267 sec
    [junit] Running org.apache.hadoop.util.TestRunJar
    [junit] Tests run: 1, Failures: 0, Errors: 0, Time elapsed: 0.223 sec

checkfailure:
    [touch] Creating /home/jenkins/jenkins-slave/workspace/Hadoop-Mapreduce-trunk/trunk/hadoop-mapreduce-project/build/test/testsfailed

run-test-mapred-all-withtestcaseonly:

run-test-mapred:

BUILD FAILED
/home/jenkins/jenkins-slave/workspace/Hadoop-Mapreduce-trunk/trunk/hadoop-mapreduce-project/build.xml:848:
Tests failed!

Total time: 115 minutes 0 seconds
Build step 'Execute shell' marked build as failure
[FINDBUGS] Skipping publisher since build result is FAILURE
Email was triggered for: Failure
Sending email for trigger: Failure



###################################################################################
############################## FAILED TESTS (if any) ##############################
No tests ran.

Mime
View raw message