hadoop-mapreduce-dev mailing list archives

Site index · List index
Message view « Date » · « Thread »
Top « Date » · « Thread »
From Apache Jenkins Server <jenk...@builds.apache.org>
Subject Hadoop-Mapreduce-trunk-Commit - Build # 783 - Still Failing
Date Thu, 25 Aug 2011 02:35:03 GMT
See https://builds.apache.org/job/Hadoop-Mapreduce-trunk-Commit/783/

###################################################################################
########################## LAST 60 LINES OF THE CONSOLE ###########################
[...truncated 7362 lines...]
[INFO] Apache Hadoop Project POM ......................... SUCCESS [1.582s]
[INFO] Apache Hadoop Annotations ......................... SUCCESS [5.683s]
[INFO] Apache Hadoop Project Dist POM .................... SUCCESS [0.182s]
[INFO] Apache Hadoop Assemblies .......................... SUCCESS [0.083s]
[INFO] Apache Hadoop Alfredo ............................. SUCCESS [1.952s]
[INFO] Apache Hadoop Common .............................. SUCCESS [18.472s]
[INFO] Apache Hadoop Common Project ...................... SUCCESS [0.004s]
[INFO] Apache Hadoop HDFS ................................ SUCCESS [16.248s]
[INFO] Apache Hadoop HDFS Project ........................ SUCCESS [0.004s]
[INFO] hadoop-yarn-api ................................... SUCCESS [6.643s]
[INFO] hadoop-yarn-common ................................ SUCCESS [9.883s]
[INFO] hadoop-yarn-server-common ......................... SUCCESS [3.636s]
[INFO] hadoop-yarn-server-nodemanager .................... SUCCESS [10.725s]
[INFO] hadoop-yarn-server-resourcemanager ................ SUCCESS [5.564s]
[INFO] hadoop-yarn-server-tests .......................... SUCCESS [0.903s]
[INFO] hadoop-yarn-server ................................ SUCCESS [0.057s]
[INFO] hadoop-yarn ....................................... SUCCESS [0.067s]
[INFO] hadoop-mapreduce-client-core ...................... SUCCESS [7.187s]
[INFO] hadoop-mapreduce-client-common .................... SUCCESS [5.273s]
[INFO] hadoop-mapreduce-client-shuffle ................... SUCCESS [3.273s]
[INFO] hadoop-mapreduce-client-app ....................... SUCCESS [5.365s]
[INFO] hadoop-mapreduce-client-hs ........................ SUCCESS [2.010s]
[INFO] hadoop-mapreduce-client-jobclient ................. SUCCESS [2.018s]
[INFO] hadoop-mapreduce-client ........................... SUCCESS [0.051s]
[INFO] hadoop-mapreduce .................................. SUCCESS [0.061s]
[INFO] Apache Hadoop Main ................................ SUCCESS [0.005s]
[INFO] ------------------------------------------------------------------------
[INFO] BUILD SUCCESS
[INFO] ------------------------------------------------------------------------
[INFO] Total time: 1:47.490s
[INFO] Finished at: Thu Aug 25 02:35:01 UTC 2011
[INFO] Final Memory: 87M/713M
[INFO] ------------------------------------------------------------------------
+ cd /home/jenkins/jenkins-slave/workspace/Hadoop-Mapreduce-trunk-Commit/trunk/hadoop-mapreduce
+ /home/jenkins/tools/maven/latest/bin/mvn clean install -Dcontainer-executor.conf.dir=/grid/0/gs/conf/current
-DskipTests=true
[INFO] Scanning for projects...
[INFO] ------------------------------------------------------------------------
[INFO] BUILD FAILURE
[INFO] ------------------------------------------------------------------------
[INFO] Total time: 0.107s
[INFO] Finished at: Thu Aug 25 02:35:03 UTC 2011
[INFO] Final Memory: 1M/61M
[INFO] ------------------------------------------------------------------------
[ERROR] The goal you specified requires a project to execute but there is no POM in this directory
(/home/jenkins/jenkins-slave/workspace/Hadoop-Mapreduce-trunk-Commit/trunk/hadoop-mapreduce).
Please verify you invoked Maven from the correct directory. -> [Help 1]
[ERROR] 
[ERROR] To see the full stack trace of the errors, re-run Maven with the -e switch.
[ERROR] Re-run Maven using the -X switch to enable full debug logging.
[ERROR] 
[ERROR] For more information about the errors and possible solutions, please read the following
articles:
[ERROR] [Help 1] http://cwiki.apache.org/confluence/display/MAVEN/MissingProjectException
+ /home/jenkins/tools/ant/latest/bin/ant -Dversion=0.23.0-SNAPSHOT -Dresolvers=internal -Declipse.home=/home/jenkins/tools/eclipse/latest
-Dfindbugs.home=/home/jenkins/tools/findbugs/latest -Dforrest.home=/home/jenkins/tools/forrest/latest
-Dcompile.c++=true -Dcompile.native=true binary
Buildfile: build.xml does not exist!
Build failed
+ /home/jenkins/tools/ant/latest/bin/ant -Dversion=0.23.0-SNAPSHOT -Dresolvers=internal -Dtest.junit.output.format=xml
-Dtest.output=yes -Dcompile.c++=yes -Dcompile.native=true checkstyle create-c++-configure
run-commit-test
Buildfile: build.xml does not exist!
Build failed
Build step 'Execute shell' marked build as failure
Email was triggered for: Failure
Sending email for trigger: Failure



###################################################################################
############################## FAILED TESTS (if any) ##############################
No tests ran.

Mime
View raw message