hadoop-mapreduce-dev mailing list archives

Site index · List index
Message view « Date » · « Thread »
Top « Date » · « Thread »
From Apache Jenkins Server <jenk...@builds.apache.org>
Subject Hadoop-Mapreduce-trunk - Build # 799 - Still Failing
Date Sun, 28 Aug 2011 15:06:19 GMT
See https://builds.apache.org/job/Hadoop-Mapreduce-trunk/799/

###################################################################################
########################## LAST 60 LINES OF THE CONSOLE ###########################
[...truncated 18272 lines...]
    [junit] Running org.apache.hadoop.mapreduce.util.TestMRAsyncDiskService
    [junit] Tests run: 6, Failures: 0, Errors: 0, Time elapsed: 0.668 sec
    [junit] Running org.apache.hadoop.mapreduce.util.TestProcfsBasedProcessTree
    [junit] Tests run: 5, Failures: 0, Errors: 0, Time elapsed: 7.274 sec
    [junit] Running org.apache.hadoop.record.TestRecordMR
    [junit] Tests run: 1, Failures: 0, Errors: 0, Time elapsed: 4.007 sec
    [junit] Running org.apache.hadoop.record.TestRecordWritable
    [junit] Tests run: 1, Failures: 0, Errors: 0, Time elapsed: 2.859 sec
    [junit] Running org.apache.hadoop.security.TestMapredGroupMappingServiceRefresh
    [junit] Tests run: 2, Failures: 0, Errors: 0, Time elapsed: 7.713 sec
    [junit] Running org.apache.hadoop.security.authorize.TestServiceLevelAuthorization
    [junit] Tests run: 2, Failures: 0, Errors: 0, Time elapsed: 62.757 sec
    [junit] Running org.apache.hadoop.tools.TestCopyFiles
    [junit] Tests run: 17, Failures: 0, Errors: 0, Time elapsed: 89.316 sec
    [junit] Running org.apache.hadoop.tools.TestDistCh
    [junit] Tests run: 1, Failures: 0, Errors: 0, Time elapsed: 20.636 sec
    [junit] Running org.apache.hadoop.tools.TestHadoopArchives
    [junit] Tests run: 1, Failures: 0, Errors: 0, Time elapsed: 18.919 sec
    [junit] Running org.apache.hadoop.tools.TestHarFileSystem
    [junit] Tests run: 4, Failures: 0, Errors: 0, Time elapsed: 98.539 sec
    [junit] Running org.apache.hadoop.tools.rumen.TestConcurrentRead
    [junit] Tests run: 1, Failures: 0, Errors: 0, Time elapsed: 1.376 sec
    [junit] Running org.apache.hadoop.tools.rumen.TestHistograms
    [junit] Tests run: 1, Failures: 0, Errors: 0, Time elapsed: 0.725 sec
    [junit] Running org.apache.hadoop.tools.rumen.TestParsedLine
    [junit] Tests run: 6, Failures: 0, Errors: 0, Time elapsed: 0.076 sec
    [junit] Running org.apache.hadoop.tools.rumen.TestPiecewiseLinearInterpolation
    [junit] Tests run: 1, Failures: 0, Errors: 0, Time elapsed: 1.162 sec
    [junit] Running org.apache.hadoop.tools.rumen.TestRandomSeedGenerator
    [junit] Tests run: 1, Failures: 0, Errors: 0, Time elapsed: 0.16 sec
    [junit] Running org.apache.hadoop.tools.rumen.TestRumenFolder
    [junit] Tests run: 2, Failures: 0, Errors: 0, Time elapsed: 2.816 sec
    [junit] Running org.apache.hadoop.tools.rumen.TestRumenJobTraces
    [junit] Tests run: 13, Failures: 0, Errors: 0, Time elapsed: 15.452 sec
    [junit] Running org.apache.hadoop.tools.rumen.TestZombieJob
    [junit] Tests run: 5, Failures: 0, Errors: 0, Time elapsed: 1.844 sec
    [junit] Running org.apache.hadoop.util.TestReflectionUtils
    [junit] Tests run: 1, Failures: 0, Errors: 0, Time elapsed: 0.268 sec
    [junit] Running org.apache.hadoop.util.TestRunJar
    [junit] Tests run: 1, Failures: 0, Errors: 0, Time elapsed: 0.223 sec

checkfailure:
    [touch] Creating /home/jenkins/jenkins-slave/workspace/Hadoop-Mapreduce-trunk/trunk/hadoop-mapreduce-project/build/test/testsfailed

run-test-mapred-all-withtestcaseonly:

run-test-mapred:

BUILD FAILED
/home/jenkins/jenkins-slave/workspace/Hadoop-Mapreduce-trunk/trunk/hadoop-mapreduce-project/build.xml:848:
Tests failed!

Total time: 115 minutes 10 seconds
Build step 'Execute shell' marked build as failure
[FINDBUGS] Skipping publisher since build result is FAILURE
Updating MAPREDUCE-2893
Updating MAPREDUCE-2891
Updating HDFS-2289
Email was triggered for: Failure
Sending email for trigger: Failure



###################################################################################
############################## FAILED TESTS (if any) ##############################
No tests ran.

Mime
View raw message