hadoop-mapreduce-dev mailing list archives

Site index · List index
Message view « Date » · « Thread »
Top « Date » · « Thread »
From Apache Jenkins Server <jenk...@builds.apache.org>
Subject Hadoop-Mapreduce-trunk-Commit - Build # 782 - Still Failing
Date Thu, 25 Aug 2011 00:22:32 GMT
See https://builds.apache.org/job/Hadoop-Mapreduce-trunk-Commit/782/

###################################################################################
########################## LAST 60 LINES OF THE CONSOLE ###########################
[...truncated 6615 lines...]
[INFO] hadoop-yarn-server-common ......................... SKIPPED
[INFO] hadoop-yarn-server-nodemanager .................... SKIPPED
[INFO] hadoop-yarn-server-resourcemanager ................ SKIPPED
[INFO] hadoop-yarn-server-tests .......................... SKIPPED
[INFO] hadoop-yarn-server ................................ SKIPPED
[INFO] hadoop-yarn ....................................... SKIPPED
[INFO] hadoop-mapreduce-client-core ...................... SKIPPED
[INFO] hadoop-mapreduce-client-common .................... SKIPPED
[INFO] hadoop-mapreduce-client-shuffle ................... SKIPPED
[INFO] hadoop-mapreduce-client-app ....................... SKIPPED
[INFO] hadoop-mapreduce-client-hs ........................ SKIPPED
[INFO] hadoop-mapreduce-client-jobclient ................. SKIPPED
[INFO] hadoop-mapreduce-client ........................... SKIPPED
[INFO] hadoop-mapreduce .................................. SKIPPED
[INFO] Apache Hadoop Main ................................ SKIPPED
[INFO] ------------------------------------------------------------------------
[INFO] BUILD FAILURE
[INFO] ------------------------------------------------------------------------
[INFO] Total time: 45.938s
[INFO] Finished at: Thu Aug 25 00:22:29 UTC 2011
[INFO] Final Memory: 59M/754M
[INFO] ------------------------------------------------------------------------
[ERROR] Failed to execute goal org.codehaus.mojo:exec-maven-plugin:1.2:exec (generate-sources)
on project hadoop-yarn-api: Command execution failed. Process exited with an error: 1(Exit
value: 1) -> [Help 1]
[ERROR] 
[ERROR] To see the full stack trace of the errors, re-run Maven with the -e switch.
[ERROR] Re-run Maven using the -X switch to enable full debug logging.
[ERROR] 
[ERROR] For more information about the errors and possible solutions, please read the following
articles:
[ERROR] [Help 1] http://cwiki.apache.org/confluence/display/MAVEN/MojoExecutionException
[ERROR] 
[ERROR] After correcting the problems, you can resume the build with the command
[ERROR]   mvn <goals> -rf :hadoop-yarn-api
+ cd /home/jenkins/jenkins-slave/workspace/Hadoop-Mapreduce-trunk-Commit/trunk/hadoop-mapreduce
+ /home/jenkins/tools/maven/latest/bin/mvn clean install -Dcontainer-executor.conf.dir=/grid/0/gs/conf/current
-DskipTests=true
[INFO] Scanning for projects...
[INFO] ------------------------------------------------------------------------
[INFO] BUILD FAILURE
[INFO] ------------------------------------------------------------------------
[INFO] Total time: 0.106s
[INFO] Finished at: Thu Aug 25 00:22:31 UTC 2011
[INFO] Final Memory: 1M/61M
[INFO] ------------------------------------------------------------------------
[ERROR] The goal you specified requires a project to execute but there is no POM in this directory
(/home/jenkins/jenkins-slave/workspace/Hadoop-Mapreduce-trunk-Commit/trunk/hadoop-mapreduce).
Please verify you invoked Maven from the correct directory. -> [Help 1]
[ERROR] 
[ERROR] To see the full stack trace of the errors, re-run Maven with the -e switch.
[ERROR] Re-run Maven using the -X switch to enable full debug logging.
[ERROR] 
[ERROR] For more information about the errors and possible solutions, please read the following
articles:
[ERROR] [Help 1] http://cwiki.apache.org/confluence/display/MAVEN/MissingProjectException
+ /home/jenkins/tools/ant/latest/bin/ant -Dversion=0.23.0-SNAPSHOT -Dresolvers=internal -Declipse.home=/home/jenkins/tools/eclipse/latest
-Dfindbugs.home=/home/jenkins/tools/findbugs/latest -Dforrest.home=/home/jenkins/tools/forrest/latest
-Dcompile.c++=true -Dcompile.native=true binary
Buildfile: build.xml does not exist!
Build failed
+ /home/jenkins/tools/ant/latest/bin/ant -Dversion=0.23.0-SNAPSHOT -Dresolvers=internal -Dtest.junit.output.format=xml
-Dtest.output=yes -Dcompile.c++=yes -Dcompile.native=true checkstyle create-c++-configure
run-commit-test
Buildfile: build.xml does not exist!
Build failed
Build step 'Execute shell' marked build as failure
Updating HADOOP-7560
Email was triggered for: Failure
Sending email for trigger: Failure



###################################################################################
############################## FAILED TESTS (if any) ##############################
No tests ran.

Mime
View raw message