hadoop-mapreduce-dev mailing list archives

Site index · List index
Message view « Date » · « Thread »
Top « Date » · « Thread »
From Apache Jenkins Server <jenk...@builds.apache.org>
Subject Hadoop-Mapreduce-trunk-Commit - Build # 795 - Still Failing
Date Thu, 25 Aug 2011 20:31:06 GMT
See https://builds.apache.org/job/Hadoop-Mapreduce-trunk-Commit/795/

###################################################################################
########################## LAST 60 LINES OF THE CONSOLE ###########################
[...truncated 28535 lines...]
[ivy:configure] :: Ivy 2.1.0 - 20090925235825 :: http://ant.apache.org/ivy/ ::
[ivy:configure] :: loading settings :: file = /home/jenkins/jenkins-slave/workspace/Hadoop-Mapreduce-trunk-Commit/trunk/hadoop-mapreduce-project/ivy/ivysettings.xml

ivy-resolve-checkstyle:

ivy-retrieve-checkstyle:
[ivy:cachepath] DEPRECATED: 'ivy.conf.file' is deprecated, use 'ivy.settings.file' instead
[ivy:cachepath] :: loading settings :: file = /home/jenkins/jenkins-slave/workspace/Hadoop-Mapreduce-trunk-Commit/trunk/hadoop-mapreduce-project/ivy/ivysettings.xml

check-for-checkstyle:

checkstyle:
[checkstyle] Running Checkstyle 4.2 on 72 files
     [xslt] Processing /home/jenkins/jenkins-slave/workspace/Hadoop-Mapreduce-trunk-Commit/trunk/hadoop-mapreduce-project/build/test/checkstyle-errors.xml
to /home/jenkins/jenkins-slave/workspace/Hadoop-Mapreduce-trunk-Commit/trunk/hadoop-mapreduce-project/build/test/checkstyle-errors.html
     [xslt] Loading stylesheet /home/jenkins/jenkins-slave/workspace/Hadoop-Mapreduce-trunk-Commit/trunk/hadoop-mapreduce-project/src/test/checkstyle-noframes-sorted.xsl

ivy-download:
      [get] Getting: http://repo2.maven.org/maven2/org/apache/ivy/ivy/2.1.0/ivy-2.1.0.jar
      [get] To: /home/jenkins/jenkins-slave/workspace/Hadoop-Mapreduce-trunk-Commit/trunk/hadoop-mapreduce-project/ivy/ivy-2.1.0.jar
      [get] Not modified - so not downloaded

ivy-init-dirs:

ivy-probe-antlib:

ivy-init-antlib:

ivy-init:

ivy-resolve-common:

ivy-retrieve-common:

ivy-resolve-mapred:

ivy-retrieve-mapred:

init:
    [touch] Creating /tmp/null1547101907
   [delete] Deleting: /tmp/null1547101907
    [unzip] Expanding: /home/jenkins/jenkins-slave/workspace/Hadoop-Mapreduce-trunk-Commit/trunk/hadoop-mapreduce-project/build/ivy/lib/Hadoop/common/hadoop-hdfs-0.23.0-SNAPSHOT.jar
into /home/jenkins/jenkins-slave/workspace/Hadoop-Mapreduce-trunk-Commit/trunk/hadoop-mapreduce-project/build

check-c++-configure:

create-c++-utils-configure:
     [exec] Can't exec "libtoolize": No such file or directory at /usr/bin/autoreconf line
189.
     [exec] Use of uninitialized value in pattern match (m//) at /usr/bin/autoreconf line
189.
     [exec] configure.ac:39: error: possibly undefined macro: AC_PROG_LIBTOOL
     [exec]       If this token and others are legitimate, please use m4_pattern_allow.
     [exec]       See the Autoconf documentation.
     [exec] autoreconf: /usr/bin/autoconf failed with exit status: 1

BUILD FAILED
/home/jenkins/jenkins-slave/workspace/Hadoop-Mapreduce-trunk-Commit/trunk/hadoop-mapreduce-project/build.xml:1872:
exec returned: 1

Total time: 11 seconds
Build step 'Execute shell' marked build as failure
Email was triggered for: Failure
Sending email for trigger: Failure



###################################################################################
############################## FAILED TESTS (if any) ##############################
No tests ran.

Mime
View raw message