hadoop-mapreduce-dev mailing list archives

Site index · List index
Message view « Date » · « Thread »
Top « Date » · « Thread »
From Apache Jenkins Server <jenk...@builds.apache.org>
Subject Hadoop-Mapreduce-trunk - Build # 802 - Still Failing
Date Wed, 31 Aug 2011 15:07:06 GMT
See https://builds.apache.org/job/Hadoop-Mapreduce-trunk/802/

###################################################################################
########################## LAST 60 LINES OF THE CONSOLE ###########################
[...truncated 18281 lines...]
    [junit] Tests run: 5, Failures: 0, Errors: 0, Time elapsed: 7.274 sec
    [junit] Running org.apache.hadoop.record.TestRecordMR
    [junit] Tests run: 1, Failures: 0, Errors: 0, Time elapsed: 4.001 sec
    [junit] Running org.apache.hadoop.record.TestRecordWritable
    [junit] Tests run: 1, Failures: 0, Errors: 0, Time elapsed: 2.419 sec
    [junit] Running org.apache.hadoop.security.TestMapredGroupMappingServiceRefresh
    [junit] Tests run: 2, Failures: 0, Errors: 0, Time elapsed: 7.844 sec
    [junit] Running org.apache.hadoop.security.authorize.TestServiceLevelAuthorization
    [junit] Tests run: 2, Failures: 0, Errors: 0, Time elapsed: 63.363 sec
    [junit] Running org.apache.hadoop.tools.TestCopyFiles
    [junit] Tests run: 17, Failures: 0, Errors: 0, Time elapsed: 92.346 sec
    [junit] Running org.apache.hadoop.tools.TestDistCh
    [junit] Tests run: 1, Failures: 0, Errors: 0, Time elapsed: 15.713 sec
    [junit] Running org.apache.hadoop.tools.TestHadoopArchives
    [junit] Tests run: 1, Failures: 0, Errors: 0, Time elapsed: 19.224 sec
    [junit] Running org.apache.hadoop.tools.TestHarFileSystem
    [junit] Tests run: 4, Failures: 0, Errors: 0, Time elapsed: 106.816 sec
    [junit] Running org.apache.hadoop.tools.rumen.TestConcurrentRead
    [junit] Tests run: 1, Failures: 0, Errors: 0, Time elapsed: 1.396 sec
    [junit] Running org.apache.hadoop.tools.rumen.TestHistograms
    [junit] Tests run: 1, Failures: 0, Errors: 0, Time elapsed: 0.719 sec
    [junit] Running org.apache.hadoop.tools.rumen.TestParsedLine
    [junit] Tests run: 6, Failures: 0, Errors: 0, Time elapsed: 0.077 sec
    [junit] Running org.apache.hadoop.tools.rumen.TestPiecewiseLinearInterpolation
    [junit] Tests run: 1, Failures: 0, Errors: 0, Time elapsed: 1.302 sec
    [junit] Running org.apache.hadoop.tools.rumen.TestRandomSeedGenerator
    [junit] Tests run: 1, Failures: 0, Errors: 0, Time elapsed: 0.161 sec
    [junit] Running org.apache.hadoop.tools.rumen.TestRumenFolder
    [junit] Tests run: 2, Failures: 0, Errors: 0, Time elapsed: 2.809 sec
    [junit] Running org.apache.hadoop.tools.rumen.TestRumenJobTraces
    [junit] Tests run: 13, Failures: 0, Errors: 0, Time elapsed: 14.87 sec
    [junit] Running org.apache.hadoop.tools.rumen.TestZombieJob
    [junit] Tests run: 5, Failures: 0, Errors: 0, Time elapsed: 1.821 sec
    [junit] Running org.apache.hadoop.util.TestReflectionUtils
    [junit] Tests run: 1, Failures: 0, Errors: 0, Time elapsed: 0.268 sec
    [junit] Running org.apache.hadoop.util.TestRunJar
    [junit] Tests run: 1, Failures: 0, Errors: 0, Time elapsed: 0.223 sec

checkfailure:
    [touch] Creating /home/jenkins/jenkins-slave/workspace/Hadoop-Mapreduce-trunk/trunk/hadoop-mapreduce-project/build/test/testsfailed

run-test-mapred-all-withtestcaseonly:

run-test-mapred:

BUILD FAILED
/home/jenkins/jenkins-slave/workspace/Hadoop-Mapreduce-trunk/trunk/hadoop-mapreduce-project/build.xml:848:
Tests failed!

Total time: 115 minutes 41 seconds
Build step 'Execute shell' marked build as failure
[FINDBUGS] Skipping publisher since build result is FAILURE
Updating HADOOP-6889
Updating HADOOP-7576
Updating MAPREDUCE-2916
Updating MAPREDUCE-2652
Updating HDFS-1330
Updating HADOOP-7593
Email was triggered for: Failure
Sending email for trigger: Failure



###################################################################################
############################## FAILED TESTS (if any) ##############################
No tests ran.

Mime
View raw message