hadoop-mapreduce-dev mailing list archives

Site index · List index
Message view « Date » · « Thread »
Top « Date » · « Thread »
From Apache Jenkins Server <jenk...@builds.apache.org>
Subject Hadoop-Mapreduce-trunk - Build # 736 - Still Failing
Date Wed, 13 Jul 2011 14:39:28 GMT
See https://builds.apache.org/job/Hadoop-Mapreduce-trunk/736/

###################################################################################
########################## LAST 60 LINES OF THE CONSOLE ###########################
[...truncated 233489 lines...]
    [junit] 0: -9223372036854775808--9223372036854775807
    [junit] map attempts to success -- 0.6567164179104478, 0.3283582089552239, 0.014925373134328358,

    [junit] ===============
    [junit] 2011-07-13 14:33:22,437 WARN  rumen.ZombieJob (ZombieJob.java:sanitizeLoggedTask(330))
- Task task_200904211745_0004_r_000025 has nulll TaskStatus
    [junit] 2011-07-13 14:33:22,438 WARN  rumen.ZombieJob (ZombieJob.java:sanitizeLoggedTask(330))
- Task task_200904211745_0004_r_000028 has nulll TaskStatus
    [junit] 2011-07-13 14:33:22,438 WARN  rumen.ZombieJob (ZombieJob.java:sanitizeLoggedTask(330))
- Task task_200904211745_0004_r_000029 has nulll TaskStatus
    [junit] 2011-07-13 14:33:22,438 WARN  rumen.ZombieJob (ZombieJob.java:sanitizeLoggedTask(330))
- Task task_200904211745_0004_r_000030 has nulll TaskStatus
    [junit] 2011-07-13 14:33:22,439 WARN  rumen.ZombieJob (ZombieJob.java:sanitizeLoggedTask(330))
- Task task_200904211745_0004_r_000031 has nulll TaskStatus
    [junit] 2011-07-13 14:33:22,439 WARN  rumen.ZombieJob (ZombieJob.java:sanitizeLoggedTask(330))
- Task task_200904211745_0004_r_000032 has nulll TaskStatus
    [junit] 2011-07-13 14:33:22,439 WARN  rumen.ZombieJob (ZombieJob.java:sanitizeLoggedTask(330))
- Task task_200904211745_0004_r_000033 has nulll TaskStatus
    [junit] 2011-07-13 14:33:22,440 WARN  rumen.ZombieJob (ZombieJob.java:sanitizeLoggedTask(330))
- Task task_200904211745_0004_r_000034 has nulll TaskStatus
    [junit] 2011-07-13 14:33:22,440 WARN  rumen.ZombieJob (ZombieJob.java:sanitizeLoggedTask(330))
- Task task_200904211745_0004_r_000035 has nulll TaskStatus
    [junit] 2011-07-13 14:33:22,440 WARN  rumen.ZombieJob (ZombieJob.java:sanitizeLoggedTask(330))
- Task task_200904211745_0004_r_000036 has nulll TaskStatus
    [junit] 2011-07-13 14:33:22,441 WARN  rumen.ZombieJob (ZombieJob.java:sanitizeLoggedTask(330))
- Task task_200904211745_0004_r_000037 has nulll TaskStatus
    [junit] 2011-07-13 14:33:22,441 WARN  rumen.ZombieJob (ZombieJob.java:sanitizeLoggedTask(330))
- Task task_200904211745_0004_r_000038 has nulll TaskStatus
    [junit] 2011-07-13 14:33:22,442 WARN  rumen.ZombieJob (ZombieJob.java:sanitizeLoggedTask(330))
- Task task_200904211745_0004_r_000039 has nulll TaskStatus
    [junit] 2011-07-13 14:33:22,442 WARN  rumen.ZombieJob (ZombieJob.java:sanitizeLoggedTask(330))
- Task task_200904211745_0004_r_000040 has nulll TaskStatus
    [junit] 2011-07-13 14:33:22,442 WARN  rumen.ZombieJob (ZombieJob.java:sanitizeLoggedTask(330))
- Task task_200904211745_0004_r_000041 has nulll TaskStatus
    [junit] 2011-07-13 14:33:22,443 WARN  rumen.ZombieJob (ZombieJob.java:sanitizeLoggedTask(330))
- Task task_200904211745_0004_r_000042 has nulll TaskStatus
    [junit] 2011-07-13 14:33:22,443 WARN  rumen.ZombieJob (ZombieJob.java:sanitizeLoggedTask(330))
- Task task_200904211745_0004_r_000043 has nulll TaskStatus
    [junit] 2011-07-13 14:33:22,443 WARN  rumen.ZombieJob (ZombieJob.java:sanitizeLoggedTask(330))
- Task task_200904211745_0004_r_000044 has nulll TaskStatus
    [junit] 2011-07-13 14:33:22,444 WARN  rumen.ZombieJob (ZombieJob.java:sanitizeLoggedTask(330))
- Task task_200904211745_0004_r_000045 has nulll TaskStatus
    [junit] 2011-07-13 14:33:22,444 WARN  rumen.ZombieJob (ZombieJob.java:sanitizeLoggedTask(330))
- Task task_200904211745_0004_r_000046 has nulll TaskStatus
    [junit] generated failed map runtime distribution
    [junit] 100000: 18592--18592
    [junit]    0.1:18592
    [junit]    0.5:18592
    [junit]    0.9:18592
    [junit] Tests run: 5, Failures: 0, Errors: 0, Time elapsed: 3.129 sec
    [junit] Running org.apache.hadoop.util.TestReflectionUtils
    [junit] Tests run: 1, Failures: 0, Errors: 0, Time elapsed: 0.351 sec
    [junit] Running org.apache.hadoop.util.TestRunJar
    [junit] Creating file/grid/0/hudson/hudson-slave/workspace/Hadoop-Mapreduce-trunk/trunk/build/test/data/out
    [junit] Tests run: 1, Failures: 0, Errors: 0, Time elapsed: 0.331 sec

checkfailure:
    [touch] Creating /grid/0/hudson/hudson-slave/workspace/Hadoop-Mapreduce-trunk/trunk/build/test/testsfailed

run-test-mapred-all-withtestcaseonly:

run-test-mapred:

BUILD FAILED
/grid/0/hudson/hudson-slave/workspace/Hadoop-Mapreduce-trunk/trunk/build.xml:848: Tests failed!

Total time: 90 minutes 41 seconds
[FINDBUGS] Skipping publisher since build result is FAILURE
Archiving artifacts
Publishing Clover coverage report...
No Clover report will be published due to a Build Failure
Recording test results
Publishing Javadoc
Recording fingerprints
Updating MAPREDUCE-2400
Updating MAPREDUCE-2680
Updating MAPREDUCE-2682
Updating MAPREDUCE-2679
Email was triggered for: Failure
Sending email for trigger: Failure



###################################################################################
############################## FAILED TESTS (if any) ##############################
2 tests failed.
FAILED:  org.apache.hadoop.fs.TestFileSystem.testCommandFormat

Error Message:
Too many arguments: expected 2 but got 3

Stack Trace:
org.apache.hadoop.fs.shell.CommandFormat$TooManyArgumentsException: Too many arguments: expected
2 but got 3
	at org.apache.hadoop.fs.shell.CommandFormat.parse(CommandFormat.java:113)
	at org.apache.hadoop.fs.shell.CommandFormat.parse(CommandFormat.java:77)
	at org.apache.hadoop.fs.TestFileSystem.__CLR3_0_2b0mwvrw4n(TestFileSystem.java:97)
	at org.apache.hadoop.fs.TestFileSystem.testCommandFormat(TestFileSystem.java:92)


FAILED:  org.apache.hadoop.cli.TestMRCLI.testAll

Error Message:
One of the tests failed. See the Detailed results to identify the command that failed

Stack Trace:
junit.framework.AssertionFailedError: One of the tests failed. See the Detailed results to
identify the command that failed
	at org.apache.hadoop.cli.CLITestHelper.displayResults(CLITestHelper.java:264)
	at org.apache.hadoop.cli.CLITestHelper.tearDown(CLITestHelper.java:126)
	at org.apache.hadoop.cli.TestHDFSCLI.tearDown(TestHDFSCLI.java:81)
	at org.apache.hadoop.cli.TestMRCLI.tearDown(TestMRCLI.java:56)




Mime
View raw message