hadoop-mapreduce-dev mailing list archives

Site index · List index
Message view « Date » · « Thread »
Top « Date » · « Thread »
From Apache Jenkins Server <jenk...@builds.apache.org>
Subject Hadoop-Mapreduce-trunk-Commit - Build # 757 - Failure
Date Wed, 27 Jul 2011 06:39:13 GMT
See https://builds.apache.org/job/Hadoop-Mapreduce-trunk-Commit/757/

###################################################################################
########################## LAST 60 LINES OF THE CONSOLE ###########################
[...truncated 8846 lines...]
[ivy:resolve] 	commons-lang#commons-lang;2.4 by [commons-lang#commons-lang;2.5] in [test]
[ivy:resolve] 	commons-logging#commons-logging;1.1 by [commons-logging#commons-logging;1.1.1]
in [test]
[ivy:resolve] 	org.slf4j#slf4j-api;1.5.2 by [org.slf4j#slf4j-api;1.5.11] in [test]
[ivy:resolve] 	org.apache.mina#mina-core;2.0.0-M4 by [org.apache.mina#mina-core;2.0.0-M5]
in [test]
[ivy:resolve] 	org.apache.ftpserver#ftplet-api;1.0.0-M2 by [org.apache.ftpserver#ftplet-api;1.0.0]
in [test]
[ivy:resolve] 	org.apache.ftpserver#ftpserver-core;1.0.0-M2 by [org.apache.ftpserver#ftpserver-core;1.0.0]
in [test]
[ivy:resolve] 	org.apache.mina#mina-core;2.0.0-M2 by [org.apache.mina#mina-core;2.0.0-M5]
in [test]
	---------------------------------------------------------------------
	|                  |            modules            ||   artifacts   |
	|       conf       | number| search|dwnlded|evicted|| number|dwnlded|
	---------------------------------------------------------------------
	|       test       |   59  |   4   |   0   |   11  ||   48  |   0   |
	---------------------------------------------------------------------

ivy-retrieve-test:
[ivy:retrieve] :: retrieving :: org.apache.hadoop#raid [sync]
[ivy:retrieve] 	confs: [test]
[ivy:retrieve] 	48 artifacts copied, 0 already retrieved (21496kB/81ms)

compile-test:
     [echo] contrib: raid
    [javac] Compiling 20 source files to /grid/0/hudson/hudson-slave/workspace/Hadoop-Mapreduce-trunk-Commit/trunk/build/contrib/raid/test
    [javac] /grid/0/hudson/hudson-slave/workspace/Hadoop-Mapreduce-trunk-Commit/trunk/src/contrib/raid/src/test/org/apache/hadoop/hdfs/server/namenode/NameNodeRaidTestUtil.java:46:
cannot find symbol
    [javac] symbol  : variable datanodeMap
    [javac] location: class org.apache.hadoop.hdfs.server.namenode.FSNamesystem
    [javac]     return namesystem.datanodeMap;
    [javac]                      ^
    [javac] Note: Some input files use or override a deprecated API.
    [javac] Note: Recompile with -Xlint:deprecation for details.
    [javac] 1 error

BUILD FAILED
/grid/0/hudson/hudson-slave/workspace/Hadoop-Mapreduce-trunk-Commit/trunk/build.xml:1189:
The following error occurred while executing this line:
/grid/0/hudson/hudson-slave/workspace/Hadoop-Mapreduce-trunk-Commit/trunk/src/contrib/build.xml:39:
The following error occurred while executing this line:
/grid/0/hudson/hudson-slave/workspace/Hadoop-Mapreduce-trunk-Commit/trunk/src/contrib/build-contrib.xml:227:
Compile failed; see the compiler error output for details.

Total time: 6 minutes 16 seconds


======================================================================
======================================================================
STORE: saving artifacts
======================================================================
======================================================================


mv: cannot stat `build/*.tar.gz': No such file or directory
mv: cannot stat `build/test/findbugs': No such file or directory
Build Failed
[FINDBUGS] Skipping publisher since build result is FAILURE
Archiving artifacts
Publishing Clover coverage report...
No Clover report will be published due to a Build Failure
Recording test results
Publishing Javadoc
Recording fingerprints
Updating MAPREDUCE-2723
Email was triggered for: Failure
Sending email for trigger: Failure



###################################################################################
############################## FAILED TESTS (if any) ##############################
No tests ran.

Mime
View raw message