hadoop-mapreduce-dev mailing list archives

Site index · List index
Message view « Date » · « Thread »
Top « Date » · « Thread »
From Apache Jenkins Server <jenk...@builds.apache.org>
Subject Hadoop-Mapreduce-trunk-Commit - Build # 745 - Still Failing
Date Wed, 13 Jul 2011 23:41:19 GMT
See https://builds.apache.org/job/Hadoop-Mapreduce-trunk-Commit/745/

###################################################################################
########################## LAST 60 LINES OF THE CONSOLE ###########################
[...truncated 2653 lines...]
    [javac]                                                  ^
    [javac] /grid/0/hudson/hudson-slave/workspace/Hadoop-Mapreduce-trunk-Commit/trunk/src/java/org/apache/hadoop/mapred/MapTask.java:165:
warning: [unchecked] unchecked conversion
    [javac] found   : org.apache.hadoop.mapred.RecordReader
    [javac] required: org.apache.hadoop.mapred.RecordReader<K,V>
    [javac]       rawIn = job.getInputFormat().getRecordReader(reporter.getInputSplit(),
    [javac]                                                   ^
    [javac] /grid/0/hudson/hudson-slave/workspace/Hadoop-Mapreduce-trunk-Commit/trunk/src/java/org/apache/hadoop/mapred/MapTask.java:445:
cannot find symbol
    [javac] symbol  : variable FileInputFormatCounter
    [javac] location: class org.apache.hadoop.mapred.MapTask.NewTrackingRecordReader<K,V>
    [javac]           .getCounter(FileInputFormatCounter.BYTES_READ);
    [javac]                       ^
    [javac] /grid/0/hudson/hudson-slave/workspace/Hadoop-Mapreduce-trunk-Commit/trunk/src/java/org/apache/hadoop/mapred/MapTask.java:572:
cannot find symbol
    [javac] symbol  : variable FileOutputFormatCounter
    [javac] location: class org.apache.hadoop.mapred.MapTask.NewDirectOutputCollector<K,V>
    [javac]           .getCounter(FileOutputFormatCounter.BYTES_WRITTEN);
    [javac]                       ^
    [javac] /grid/0/hudson/hudson-slave/workspace/Hadoop-Mapreduce-trunk-Commit/trunk/src/java/org/apache/hadoop/mapred/MapTask.java:756:
cannot find symbol
    [javac] symbol  : variable FileOutputFormatCounter
    [javac] location: class org.apache.hadoop.mapred.MapTask.DirectMapOutputCollector<K,V>
    [javac]           .getCounter(FileOutputFormatCounter.BYTES_WRITTEN);
    [javac]                       ^
    [javac] /grid/0/hudson/hudson-slave/workspace/Hadoop-Mapreduce-trunk-Commit/trunk/src/java/org/apache/hadoop/mapred/ReduceTask.java:101:
cannot find symbol
    [javac] symbol  : variable FileOutputFormatCounter
    [javac] location: class org.apache.hadoop.mapred.ReduceTask
    [javac]     getCounters().findCounter(FileOutputFormatCounter.BYTES_WRITTEN);
    [javac]                               ^
    [javac] Note: Some input files use or override a deprecated API.
    [javac] Note: Recompile with -Xlint:deprecation for details.
    [javac] 10 errors
    [javac] 1 warning

BUILD FAILED
/grid/0/hudson/hudson-slave/workspace/Hadoop-Mapreduce-trunk-Commit/trunk/build.xml:412: Compile
failed; see the compiler error output for details.

Total time: 16 seconds


======================================================================
======================================================================
STORE: saving artifacts
======================================================================
======================================================================


mv: cannot stat `build/*.tar.gz': No such file or directory
mv: cannot stat `build/*.jar': No such file or directory
mv: cannot stat `build/test/findbugs': No such file or directory
mv: cannot stat `build/docs/api': No such file or directory
Build Failed
[FINDBUGS] Skipping publisher since build result is FAILURE
Archiving artifacts
Publishing Clover coverage report...
No Clover report will be published due to a Build Failure
Recording test results
Publishing Javadoc
Recording fingerprints
Updating MAPREDUCE-2365
Email was triggered for: Failure
Sending email for trigger: Failure



###################################################################################
############################## FAILED TESTS (if any) ##############################
No tests ran.

Mime
View raw message