hadoop-mapreduce-dev mailing list archives

Site index · List index
Message view « Date » · « Thread »
Top « Date » · « Thread »
From Apache Jenkins Server <jenk...@builds.apache.org>
Subject Hadoop-Mapreduce-trunk-Commit - Build # 750 - Failure
Date Tue, 19 Jul 2011 16:08:36 GMT
See https://builds.apache.org/job/Hadoop-Mapreduce-trunk-Commit/750/

###################################################################################
########################## LAST 60 LINES OF THE CONSOLE ###########################
[...truncated 8868 lines...]
    [javac] /grid/0/hudson/hudson-slave/workspace/Hadoop-Mapreduce-trunk-Commit/trunk/src/contrib/raid/src/test/org/apache/hadoop/hdfs/server/blockmanagement/TestBlockPlacementPolicyRaid.java:85:
blockManager is not public in org.apache.hadoop.hdfs.server.namenode.FSNamesystem; cannot
be accessed from outside package
    [javac]     policy = (BlockPlacementPolicyRaid) namesystem.blockManager.replicator;
    [javac]                                                   ^
    [javac] /grid/0/hudson/hudson-slave/workspace/Hadoop-Mapreduce-trunk-Commit/trunk/src/contrib/raid/src/test/org/apache/hadoop/hdfs/server/blockmanagement/TestBlockPlacementPolicyRaid.java:272:
cannot find symbol
    [javac] symbol  : variable clusterMap
    [javac] location: class org.apache.hadoop.hdfs.server.namenode.FSNamesystem
    [javac]           conf, namesystem, namesystem.clusterMap));
    [javac]                                       ^
    [javac] /grid/0/hudson/hudson-slave/workspace/Hadoop-Mapreduce-trunk-Commit/trunk/src/contrib/raid/src/test/org/apache/hadoop/hdfs/server/blockmanagement/TestBlockPlacementPolicyRaid.java:317:
blockManager is not public in org.apache.hadoop.hdfs.server.namenode.FSNamesystem; cannot
be accessed from outside package
    [javac]       namesystem.blockManager.replicator = policy;
    [javac]                 ^
    [javac] /grid/0/hudson/hudson-slave/workspace/Hadoop-Mapreduce-trunk-Commit/trunk/src/contrib/raid/src/test/org/apache/hadoop/hdfs/server/blockmanagement/TestBlockPlacementPolicyRaid.java:317:
cannot assign a value to final variable replicator
    [javac]       namesystem.blockManager.replicator = policy;
    [javac]                              ^
    [javac] /grid/0/hudson/hudson-slave/workspace/Hadoop-Mapreduce-trunk-Commit/trunk/src/contrib/raid/src/test/org/apache/hadoop/hdfs/server/blockmanagement/TestBlockPlacementPolicyRaid.java:337:
cannot find symbol
    [javac] symbol  : variable clusterMap
    [javac] location: class org.apache.hadoop.hdfs.server.namenode.FSNamesystem
    [javac]           conf, namesystem, namesystem.clusterMap));
    [javac]                                       ^
    [javac] /grid/0/hudson/hudson-slave/workspace/Hadoop-Mapreduce-trunk-Commit/trunk/src/contrib/raid/src/test/org/apache/hadoop/hdfs/server/blockmanagement/TestBlockPlacementPolicyRaid.java:454:
cannot find symbol
    [javac] symbol  : variable clusterMap
    [javac] location: class org.apache.hadoop.hdfs.server.namenode.FSNamesystem
    [javac]       policy.initialize(conf, namesystem, namesystem.clusterMap);
    [javac]                                                     ^
    [javac] /grid/0/hudson/hudson-slave/workspace/Hadoop-Mapreduce-trunk-Commit/trunk/src/contrib/raid/src/test/org/apache/hadoop/hdfs/server/blockmanagement/TestBlockPlacementPolicyRaid.java:501:
blockManager is not public in org.apache.hadoop.hdfs.server.namenode.FSNamesystem; cannot
be accessed from outside package
    [javac]     INodeFile inode = namesystem.blockManager.blocksMap.getINode(block
    [javac]                                 ^
    [javac] Note: Some input files use or override a deprecated API.
    [javac] Note: Recompile with -Xlint:deprecation for details.
    [javac] 8 errors

BUILD FAILED
/grid/0/hudson/hudson-slave/workspace/Hadoop-Mapreduce-trunk-Commit/trunk/build.xml:1189:
The following error occurred while executing this line:
/grid/0/hudson/hudson-slave/workspace/Hadoop-Mapreduce-trunk-Commit/trunk/src/contrib/build.xml:39:
The following error occurred while executing this line:
/grid/0/hudson/hudson-slave/workspace/Hadoop-Mapreduce-trunk-Commit/trunk/src/contrib/build-contrib.xml:227:
Compile failed; see the compiler error output for details.

Total time: 5 minutes 38 seconds


======================================================================
======================================================================
STORE: saving artifacts
======================================================================
======================================================================


mv: cannot stat `build/*.tar.gz': No such file or directory
mv: cannot stat `build/test/findbugs': No such file or directory
Build Failed
[FINDBUGS] Skipping publisher since build result is FAILURE
Archiving artifacts
Publishing Clover coverage report...
No Clover report will be published due to a Build Failure
Recording test results
Publishing Javadoc
Recording fingerprints
Updating MAPREDUCE-2711
Email was triggered for: Failure
Sending email for trigger: Failure



###################################################################################
############################## FAILED TESTS (if any) ##############################
No tests ran.

Mime
View raw message