hadoop-mapreduce-dev mailing list archives

Site index · List index
Message view « Date » · « Thread »
Top « Date » · « Thread »
From Apache Jenkins Server <jenk...@builds.apache.org>
Subject Hadoop-Mapreduce-trunk - Build # 749 - Still Failing
Date Tue, 26 Jul 2011 13:17:29 GMT
See https://builds.apache.org/job/Hadoop-Mapreduce-trunk/749/

###################################################################################
########################## LAST 60 LINES OF THE CONSOLE ###########################
[...truncated 5079 lines...]
[ivy:resolve] 	==== maven2: tried
[ivy:resolve] 	  http://repo1.maven.org/maven2/org/apache/hadoop/hadoop-common/0.23.0-SNAPSHOT/hadoop-common-0.23.0-SNAPSHOT.pom
[ivy:resolve] 	  -- artifact org.apache.hadoop#hadoop-common;0.23.0-SNAPSHOT!hadoop-common.jar:
[ivy:resolve] 	  http://repo1.maven.org/maven2/org/apache/hadoop/hadoop-common/0.23.0-SNAPSHOT/hadoop-common-0.23.0-SNAPSHOT.jar
[ivy:resolve] 		module not found: org.apache.hadoop#hadoop-common-test;0.23.0-SNAPSHOT
[ivy:resolve] 	==== apache-snapshot: tried
[ivy:resolve] 	  https://repository.apache.org/content/repositories/snapshots/org/apache/hadoop/hadoop-common-test/0.23.0-SNAPSHOT/hadoop-common-test-0.23.0-SNAPSHOT.pom
[ivy:resolve] 	  -- artifact org.apache.hadoop#hadoop-common-test;0.23.0-SNAPSHOT!hadoop-common-test.jar:
[ivy:resolve] 	  https://repository.apache.org/content/repositories/snapshots/org/apache/hadoop/hadoop-common-test/0.23.0-SNAPSHOT/hadoop-common-test-0.23.0-SNAPSHOT.jar
[ivy:resolve] 	==== maven2: tried
[ivy:resolve] 	  http://repo1.maven.org/maven2/org/apache/hadoop/hadoop-common-test/0.23.0-SNAPSHOT/hadoop-common-test-0.23.0-SNAPSHOT.pom
[ivy:resolve] 	  -- artifact org.apache.hadoop#hadoop-common-test;0.23.0-SNAPSHOT!hadoop-common-test.jar:
[ivy:resolve] 	  http://repo1.maven.org/maven2/org/apache/hadoop/hadoop-common-test/0.23.0-SNAPSHOT/hadoop-common-test-0.23.0-SNAPSHOT.jar
[ivy:resolve] 		module not found: org.apache.hadoop#hadoop-hdfs;0.23.0-SNAPSHOT
[ivy:resolve] 	==== apache-snapshot: tried
[ivy:resolve] 	  https://repository.apache.org/content/repositories/snapshots/org/apache/hadoop/hadoop-hdfs/0.23.0-SNAPSHOT/hadoop-hdfs-0.23.0-SNAPSHOT.pom
[ivy:resolve] 	  -- artifact org.apache.hadoop#hadoop-hdfs;0.23.0-SNAPSHOT!hadoop-hdfs.jar:
[ivy:resolve] 	  https://repository.apache.org/content/repositories/snapshots/org/apache/hadoop/hadoop-hdfs/0.23.0-SNAPSHOT/hadoop-hdfs-0.23.0-SNAPSHOT.jar
[ivy:resolve] 	==== maven2: tried
[ivy:resolve] 	  http://repo1.maven.org/maven2/org/apache/hadoop/hadoop-hdfs/0.23.0-SNAPSHOT/hadoop-hdfs-0.23.0-SNAPSHOT.pom
[ivy:resolve] 	  -- artifact org.apache.hadoop#hadoop-hdfs;0.23.0-SNAPSHOT!hadoop-hdfs.jar:
[ivy:resolve] 	  http://repo1.maven.org/maven2/org/apache/hadoop/hadoop-hdfs/0.23.0-SNAPSHOT/hadoop-hdfs-0.23.0-SNAPSHOT.jar
[ivy:resolve] 		::::::::::::::::::::::::::::::::::::::::::::::
[ivy:resolve] 		::          UNRESOLVED DEPENDENCIES         ::
[ivy:resolve] 		::::::::::::::::::::::::::::::::::::::::::::::
[ivy:resolve] 		:: org.apache.hadoop#hadoop-common;0.23.0-SNAPSHOT: not found
[ivy:resolve] 		:: org.apache.hadoop#hadoop-common-test;0.23.0-SNAPSHOT: not found
[ivy:resolve] 		:: org.apache.hadoop#hadoop-hdfs;0.23.0-SNAPSHOT: not found
[ivy:resolve] 		::::::::::::::::::::::::::::::::::::::::::::::
[ivy:resolve] :::: ERRORS
[ivy:resolve] 	SERVER ERROR: Service Temporarily Unavailable url=https://repository.apache.org/content/repositories/snapshots/org/apache/hadoop/hadoop-common/0.23.0-SNAPSHOT/hadoop-common-0.23.0-20110726.050305-217.pom
[ivy:resolve] 	SERVER ERROR: Service Temporarily Unavailable url=https://repository.apache.org/content/repositories/snapshots/org/apache/hadoop/hadoop-common-test/0.23.0-SNAPSHOT/hadoop-common-test-0.23.0-SNAPSHOT.pom
[ivy:resolve] 	SERVER ERROR: Service Temporarily Unavailable url=https://repository.apache.org/content/repositories/snapshots/org/apache/hadoop/hadoop-common-test/0.23.0-SNAPSHOT/hadoop-common-test-0.23.0-SNAPSHOT.jar
[ivy:resolve] 	SERVER ERROR: Service Temporarily Unavailable url=https://repository.apache.org/content/repositories/snapshots/org/apache/hadoop/hadoop-hdfs/0.23.0-SNAPSHOT/hadoop-hdfs-0.23.0-SNAPSHOT.pom
[ivy:resolve] 	SERVER ERROR: Service Temporarily Unavailable url=https://repository.apache.org/content/repositories/snapshots/org/apache/hadoop/hadoop-hdfs/0.23.0-SNAPSHOT/hadoop-hdfs-0.23.0-SNAPSHOT.jar
[ivy:resolve] 
[ivy:resolve] :: USE VERBOSE OR DEBUG MESSAGE LEVEL FOR MORE DETAILS

BUILD FAILED
/grid/0/hudson/hudson-slave/workspace/Hadoop-Mapreduce-trunk/trunk/build.xml:2271: impossible
to resolve dependencies:
	resolve failed - see output for details

Total time: 14 minutes 58 seconds
+ RESULT=1
+ [ 1 != 0 ]
+ echo Build Failed: remaining tests not run
Build Failed: remaining tests not run
+ exit 1
[FINDBUGS] Skipping publisher since build result is FAILURE
Archiving artifacts
Publishing Clover coverage report...
No Clover report will be published due to a Build Failure
Recording test results
Publishing Javadoc
Recording fingerprints
Updating MAPREDUCE-2602
Updating MAPREDUCE-2622
Email was triggered for: Failure
Sending email for trigger: Failure



###################################################################################
############################## FAILED TESTS (if any) ##############################
No tests ran.

Mime
View raw message