hadoop-mapreduce-dev mailing list archives

Site index · List index
Message view « Date » · « Thread »
Top « Date » · « Thread »
From Apache Jenkins Server <jenk...@builds.apache.org>
Subject Hadoop-Mapreduce-trunk-Commit - Build # 724 - Still Failing
Date Sun, 12 Jun 2011 23:25:58 GMT
See https://builds.apache.org/job/Hadoop-Mapreduce-trunk-Commit/724/

###################################################################################
########################## LAST 60 LINES OF THE CONSOLE ###########################
[...truncated 6226 lines...]
    [javac] symbol  : class DataTransferProtocol
    [javac] location: package org.apache.hadoop.hdfs.protocol
    [javac] import org.apache.hadoop.hdfs.protocol.DataTransferProtocol;
    [javac]                                       ^
    [javac] /grid/0/hudson/hudson-slave/workspace/Hadoop-Mapreduce-trunk-Commit/trunk/src/contrib/raid/src/java/org/apache/hadoop/hdfs/server/datanode/RaidBlockSender.java:250:
cannot find symbol
    [javac] symbol  : class PacketHeader
    [javac] location: class org.apache.hadoop.hdfs.server.datanode.RaidBlockSender
    [javac]     PacketHeader header = new PacketHeader(
    [javac]     ^
    [javac] /grid/0/hudson/hudson-slave/workspace/Hadoop-Mapreduce-trunk-Commit/trunk/src/contrib/raid/src/java/org/apache/hadoop/hdfs/server/datanode/RaidBlockSender.java:250:
cannot find symbol
    [javac] symbol  : class PacketHeader
    [javac] location: class org.apache.hadoop.hdfs.server.datanode.RaidBlockSender
    [javac]     PacketHeader header = new PacketHeader(
    [javac]                               ^
    [javac] /grid/0/hudson/hudson-slave/workspace/Hadoop-Mapreduce-trunk-Commit/trunk/src/contrib/raid/src/java/org/apache/hadoop/hdfs/server/datanode/RaidBlockSender.java:379:
cannot find symbol
    [javac] symbol  : variable PacketHeader
    [javac] location: class org.apache.hadoop.hdfs.server.datanode.RaidBlockSender
    [javac]       int pktSize = PacketHeader.PKT_HEADER_LEN;
    [javac]                     ^
    [javac] /grid/0/hudson/hudson-slave/workspace/Hadoop-Mapreduce-trunk-Commit/trunk/src/contrib/raid/src/java/org/apache/hadoop/raid/BlockFixer.java:784:
package DataTransferProtocol does not exist
    [javac]                                                  DataTransferProtocol.
    [javac]                                                                      ^
    [javac] /grid/0/hudson/hudson-slave/workspace/Hadoop-Mapreduce-trunk-Commit/trunk/src/contrib/raid/src/java/org/apache/hadoop/raid/BlockFixer.java:783:
package DataTransferProtocol does not exist
    [javac]         DataTransferProtocol.Sender.opWriteBlock(out, block.getBlock(), 1,
    [javac]                             ^
    [javac] Note: Some input files use or override a deprecated API.
    [javac] Note: Recompile with -Xlint:deprecation for details.
    [javac] Note: Some input files use unchecked or unsafe operations.
    [javac] Note: Recompile with -Xlint:unchecked for details.
    [javac] 7 errors

BUILD FAILED
/grid/0/hudson/hudson-slave/workspace/Hadoop-Mapreduce-trunk-Commit/trunk/build.xml:450: The
following error occurred while executing this line:
/grid/0/hudson/hudson-slave/workspace/Hadoop-Mapreduce-trunk-Commit/trunk/src/contrib/build.xml:30:
The following error occurred while executing this line:
/grid/0/hudson/hudson-slave/workspace/Hadoop-Mapreduce-trunk-Commit/trunk/src/contrib/build-contrib.xml:194:
Compile failed; see the compiler error output for details.

Total time: 14 minutes 14 seconds


======================================================================
======================================================================
STORE: saving artifacts
======================================================================
======================================================================


mv: cannot stat `build/*.tar.gz': No such file or directory
mv: cannot stat `build/test/findbugs': No such file or directory
mv: cannot stat `build/docs/api': No such file or directory
Build Failed
[FINDBUGS] Skipping publisher since build result is FAILURE
Archiving artifacts
Publishing Clover coverage report...
No Clover report will be published due to a Build Failure
Recording test results
Publishing Javadoc
Recording fingerprints
Email was triggered for: Failure
Sending email for trigger: Failure



###################################################################################
############################## FAILED TESTS (if any) ##############################
No tests ran.

Mime
View raw message