hadoop-mapreduce-dev mailing list archives

Site index · List index
Message view « Date » · « Thread »
Top « Date » · « Thread »
From Apache Jenkins Server <jenk...@builds.apache.org>
Subject Hadoop-Mapreduce-trunk - Build # 717 - Still Failing
Date Fri, 24 Jun 2011 13:04:21 GMT
See https://builds.apache.org/job/Hadoop-Mapreduce-trunk/717/

###################################################################################
########################## LAST 60 LINES OF THE CONSOLE ###########################
[...truncated 4214 lines...]
[ivy:resolve] 	:: evicted modules:
[ivy:resolve] 	commons-logging#commons-logging;1.0.4 by [commons-logging#commons-logging;1.1.1]
in [common]
[ivy:resolve] 	commons-codec#commons-codec;1.2 by [commons-codec#commons-codec;1.4] in [common]
[ivy:resolve] 	commons-logging#commons-logging;1.0.3 by [commons-logging#commons-logging;1.1.1]
in [common]
[ivy:resolve] 	commons-codec#commons-codec;1.3 by [commons-codec#commons-codec;1.4] in [common]
[ivy:resolve] 	commons-lang#commons-lang;2.4 by [commons-lang#commons-lang;2.5] in [common]
[ivy:resolve] 	commons-logging#commons-logging;1.1 by [commons-logging#commons-logging;1.1.1]
in [common]
[ivy:resolve] 	commons-codec#commons-codec;${commons-codec.version} by [commons-codec#commons-codec;1.4]
in [common]
[ivy:resolve] 	org.codehaus.jackson#jackson-mapper-asl;${jackson.version} by [org.codehaus.jackson#jackson-mapper-asl;1.4.2]
in [common]
[ivy:resolve] 	org.codehaus.jackson#jackson-core-asl;${jackson.version} by [org.codehaus.jackson#jackson-core-asl;1.4.2]
in [common]
[ivy:resolve] 	com.thoughtworks.paranamer#paranamer;${paranamer.version} by [com.thoughtworks.paranamer#paranamer;2.2]
in [common]
	---------------------------------------------------------------------
	|                  |            modules            ||   artifacts   |
	|       conf       | number| search|dwnlded|evicted|| number|dwnlded|
	---------------------------------------------------------------------
	|      common      |   53  |   2   |   0   |   10  ||   43  |   0   |
	---------------------------------------------------------------------

ivy-retrieve-common:
[ivy:retrieve] :: retrieving :: org.apache.hadoop#raid [sync]
[ivy:retrieve] 	confs: [common]
[ivy:retrieve] 	43 artifacts copied, 0 already retrieved (18595kB/72ms)
[ivy:cachepath] DEPRECATED: 'ivy.conf.file' is deprecated, use 'ivy.settings.file' instead
[ivy:cachepath] :: loading settings :: file = /grid/0/hudson/hudson-slave/workspace/Hadoop-Mapreduce-trunk/trunk/ivy/ivysettings.xml

compile:
     [echo] contrib: raid
    [javac] Compiling 32 source files to /grid/0/hudson/hudson-slave/workspace/Hadoop-Mapreduce-trunk/trunk/build/contrib/raid/classes
    [javac] /grid/0/hudson/hudson-slave/workspace/Hadoop-Mapreduce-trunk/trunk/src/contrib/raid/src/java/org/apache/hadoop/raid/BlockFixer.java:783:
cannot find symbol
    [javac] symbol  : method opWriteBlock(java.io.DataOutputStream,org.apache.hadoop.hdfs.protocol.ExtendedBlock,int,org.apache.hadoop.hdfs.protocol.datatransfer.BlockConstructionStage,int,long,int,java.lang.String,<nulltype>,org.apache.hadoop.hdfs.protocol.DatanodeInfo[],org.apache.hadoop.security.token.Token<org.apache.hadoop.hdfs.security.token.block.BlockTokenIdentifier>)
    [javac] location: class org.apache.hadoop.hdfs.protocol.datatransfer.Sender
    [javac]         Sender.opWriteBlock(out, block.getBlock(), 1,
    [javac]               ^
    [javac] Note: Some input files use or override a deprecated API.
    [javac] Note: Recompile with -Xlint:deprecation for details.
    [javac] Note: Some input files use unchecked or unsafe operations.
    [javac] Note: Recompile with -Xlint:unchecked for details.
    [javac] 1 error

BUILD FAILED
/grid/0/hudson/hudson-slave/workspace/Hadoop-Mapreduce-trunk/trunk/build.xml:450: The following
error occurred while executing this line:
/grid/0/hudson/hudson-slave/workspace/Hadoop-Mapreduce-trunk/trunk/src/contrib/build.xml:30:
The following error occurred while executing this line:
/grid/0/hudson/hudson-slave/workspace/Hadoop-Mapreduce-trunk/trunk/src/contrib/build-contrib.xml:194:
Compile failed; see the compiler error output for details.

Total time: 3 minutes 11 seconds
+ RESULT=1
+ [ 1 != 0 ]
+ echo Build Failed: remaining tests not run
Build Failed: remaining tests not run
+ exit 1
[FINDBUGS] Skipping publisher since build result is FAILURE
Archiving artifacts
Publishing Clover coverage report...
No Clover report will be published due to a Build Failure
Recording test results
Publishing Javadoc
Recording fingerprints
Email was triggered for: Failure
Sending email for trigger: Failure



###################################################################################
############################## FAILED TESTS (if any) ##############################
No tests ran.

Mime
View raw message