hadoop-mapreduce-dev mailing list archives

Site index · List index
Message view « Date » · « Thread »
Top « Date » · « Thread »
From Apache Jenkins Server <hud...@hudson.apache.org>
Subject Hadoop-Mapreduce-trunk - Build # 698 - Still Failing
Date Thu, 02 Jun 2011 14:40:04 GMT
See https://builds.apache.org/hudson/job/Hadoop-Mapreduce-trunk/698/

###################################################################################
########################## LAST 60 LINES OF THE CONSOLE ###########################
[...truncated 235263 lines...]
    [junit]    0.85:96549
    [junit]    0.9:96658
    [junit]    0.95:96670
    [junit] Failed Reduce CDF --------
    [junit] 0: -9223372036854775808--9223372036854775807
    [junit] map attempts to success -- 0.6567164179104478, 0.3283582089552239, 0.014925373134328358,

    [junit] ===============
    [junit] 2011-06-02 14:35:05,857 WARN  rumen.ZombieJob (ZombieJob.java:sanitizeLoggedTask(330))
- Task task_200904211745_0004_r_000025 has nulll TaskStatus
    [junit] 2011-06-02 14:35:05,857 WARN  rumen.ZombieJob (ZombieJob.java:sanitizeLoggedTask(330))
- Task task_200904211745_0004_r_000028 has nulll TaskStatus
    [junit] 2011-06-02 14:35:05,858 WARN  rumen.ZombieJob (ZombieJob.java:sanitizeLoggedTask(330))
- Task task_200904211745_0004_r_000029 has nulll TaskStatus
    [junit] 2011-06-02 14:35:05,858 WARN  rumen.ZombieJob (ZombieJob.java:sanitizeLoggedTask(330))
- Task task_200904211745_0004_r_000030 has nulll TaskStatus
    [junit] 2011-06-02 14:35:05,858 WARN  rumen.ZombieJob (ZombieJob.java:sanitizeLoggedTask(330))
- Task task_200904211745_0004_r_000031 has nulll TaskStatus
    [junit] 2011-06-02 14:35:05,859 WARN  rumen.ZombieJob (ZombieJob.java:sanitizeLoggedTask(330))
- Task task_200904211745_0004_r_000032 has nulll TaskStatus
    [junit] 2011-06-02 14:35:05,859 WARN  rumen.ZombieJob (ZombieJob.java:sanitizeLoggedTask(330))
- Task task_200904211745_0004_r_000033 has nulll TaskStatus
    [junit] 2011-06-02 14:35:05,859 WARN  rumen.ZombieJob (ZombieJob.java:sanitizeLoggedTask(330))
- Task task_200904211745_0004_r_000034 has nulll TaskStatus
    [junit] 2011-06-02 14:35:05,860 WARN  rumen.ZombieJob (ZombieJob.java:sanitizeLoggedTask(330))
- Task task_200904211745_0004_r_000035 has nulll TaskStatus
    [junit] 2011-06-02 14:35:05,860 WARN  rumen.ZombieJob (ZombieJob.java:sanitizeLoggedTask(330))
- Task task_200904211745_0004_r_000036 has nulll TaskStatus
    [junit] 2011-06-02 14:35:05,860 WARN  rumen.ZombieJob (ZombieJob.java:sanitizeLoggedTask(330))
- Task task_200904211745_0004_r_000037 has nulll TaskStatus
    [junit] 2011-06-02 14:35:05,861 WARN  rumen.ZombieJob (ZombieJob.java:sanitizeLoggedTask(330))
- Task task_200904211745_0004_r_000038 has nulll TaskStatus
    [junit] 2011-06-02 14:35:05,861 WARN  rumen.ZombieJob (ZombieJob.java:sanitizeLoggedTask(330))
- Task task_200904211745_0004_r_000039 has nulll TaskStatus
    [junit] 2011-06-02 14:35:05,861 WARN  rumen.ZombieJob (ZombieJob.java:sanitizeLoggedTask(330))
- Task task_200904211745_0004_r_000040 has nulll TaskStatus
    [junit] 2011-06-02 14:35:05,862 WARN  rumen.ZombieJob (ZombieJob.java:sanitizeLoggedTask(330))
- Task task_200904211745_0004_r_000041 has nulll TaskStatus
    [junit] 2011-06-02 14:35:05,862 WARN  rumen.ZombieJob (ZombieJob.java:sanitizeLoggedTask(330))
- Task task_200904211745_0004_r_000042 has nulll TaskStatus
    [junit] 2011-06-02 14:35:05,862 WARN  rumen.ZombieJob (ZombieJob.java:sanitizeLoggedTask(330))
- Task task_200904211745_0004_r_000043 has nulll TaskStatus
    [junit] 2011-06-02 14:35:05,863 WARN  rumen.ZombieJob (ZombieJob.java:sanitizeLoggedTask(330))
- Task task_200904211745_0004_r_000044 has nulll TaskStatus
    [junit] 2011-06-02 14:35:05,863 WARN  rumen.ZombieJob (ZombieJob.java:sanitizeLoggedTask(330))
- Task task_200904211745_0004_r_000045 has nulll TaskStatus
    [junit] 2011-06-02 14:35:05,863 WARN  rumen.ZombieJob (ZombieJob.java:sanitizeLoggedTask(330))
- Task task_200904211745_0004_r_000046 has nulll TaskStatus
    [junit] generated failed map runtime distribution
    [junit] 100000: 18592--18592
    [junit]    0.1:18592
    [junit]    0.5:18592
    [junit]    0.9:18592
    [junit] Tests run: 5, Failures: 0, Errors: 0, Time elapsed: 3.065 sec
    [junit] Running org.apache.hadoop.util.TestReflectionUtils
    [junit] Tests run: 1, Failures: 0, Errors: 0, Time elapsed: 0.368 sec
    [junit] Running org.apache.hadoop.util.TestRunJar
    [junit] Creating file/grid/0/hudson/hudson-slave/workspace/Hadoop-Mapreduce-trunk/trunk/build/test/data/out
    [junit] Tests run: 1, Failures: 0, Errors: 0, Time elapsed: 0.317 sec

checkfailure:
    [touch] Creating /grid/0/hudson/hudson-slave/workspace/Hadoop-Mapreduce-trunk/trunk/build/test/testsfailed

run-test-mapred-all-withtestcaseonly:

run-test-mapred:

BUILD FAILED
/grid/0/hudson/hudson-slave/workspace/Hadoop-Mapreduce-trunk/trunk/build.xml:847: Tests failed!

Total time: 90 minutes 48 seconds
[FINDBUGS] Skipping publisher since build result is FAILURE
Recording fingerprints
Archiving artifacts
Recording test results
Publishing Javadoc
Publishing Clover coverage report...
No Clover report will be published due to a Build Failure
Email was triggered for: Failure
Sending email for trigger: Failure



###################################################################################
############################## FAILED TESTS (if any) ##############################
1 tests failed.
FAILED:  org.apache.hadoop.cli.TestMRCLI.testAll

Error Message:
One of the tests failed. See the Detailed results to identify the command that failed

Stack Trace:
junit.framework.AssertionFailedError: One of the tests failed. See the Detailed results to
identify the command that failed
	at org.apache.hadoop.cli.CLITestHelper.displayResults(CLITestHelper.java:264)
	at org.apache.hadoop.cli.CLITestHelper.tearDown(CLITestHelper.java:126)
	at org.apache.hadoop.cli.TestHDFSCLI.tearDown(TestHDFSCLI.java:81)
	at org.apache.hadoop.cli.TestMRCLI.tearDown(TestMRCLI.java:56)




Mime
View raw message