hadoop-mapreduce-dev mailing list archives

Site index · List index
Message view « Date » · « Thread »
Top « Date » · « Thread »
From Apache Jenkins Server <hud...@hudson.apache.org>
Subject Hadoop-Mapreduce-trunk - Build # 668 - Still Failing
Date Tue, 03 May 2011 15:06:08 GMT
See https://builds.apache.org/hudson/job/Hadoop-Mapreduce-trunk/668/

###################################################################################
########################## LAST 60 LINES OF THE CONSOLE ###########################
[...truncated 255130 lines...]
[ivy:resolve] :: resolving dependencies :: org.apache.hadoop#vertica;working@h6.grid.sp2.yahoo.net
[ivy:resolve] 	confs: [test]
[ivy:resolve] :: resolution report :: resolve 3ms :: artifacts dl 0ms
	---------------------------------------------------------------------
	|                  |            modules            ||   artifacts   |
	|       conf       | number| search|dwnlded|evicted|| number|dwnlded|
	---------------------------------------------------------------------
	|       test       |   0   |   0   |   0   |   0   ||   0   |   0   |
	---------------------------------------------------------------------

ivy-retrieve-test:
[ivy:retrieve] :: retrieving :: org.apache.hadoop#vertica [sync]
[ivy:retrieve] 	confs: [test]
[ivy:retrieve] 	0 artifacts copied, 0 already retrieved (0kB/7ms)

compile-test:
     [echo] contrib: vertica
    [javac] Compiling 4 source files to /grid/0/hudson/hudson-slave/workspace/Hadoop-Mapreduce-trunk/trunk/build/contrib/vertica/test

test:
     [echo] contrib: vertica
   [delete] Deleting directory /grid/0/hudson/hudson-slave/workspace/Hadoop-Mapreduce-trunk/trunk/build/contrib/vertica/test/logs
    [mkdir] Created dir: /grid/0/hudson/hudson-slave/workspace/Hadoop-Mapreduce-trunk/trunk/build/contrib/vertica/test/logs
    [mkdir] Created dir: /grid/0/hudson/hudson-slave/workspace/Hadoop-Mapreduce-trunk/trunk/build/contrib/vertica/test/data
    [junit] WARNING: multiple versions of ant detected in path for junit 
    [junit]          jar:file:/homes/hudson/tools/ant/latest/lib/ant.jar!/org/apache/tools/ant/Project.class
    [junit]      and jar:file:/homes/hudson/.ivy2/cache/ant/ant/jars/ant-1.6.5.jar!/org/apache/tools/ant/Project.class
    [junit] 11/05/03 15:05:38 INFO vertica.AllTests: Inititializing database with /grid/0/hudson/hudson-slave/workspace/Hadoop-Mapreduce-trunk/trunk/src/contrib/vertica/testdata/vertica_test.sql
    [junit] 11/05/03 15:05:38 WARN vertica.AllTests: No vertica driver found: com.vertica.Driver
- skipping vertica tests
    [junit] Running org.apache.hadoop.vertica.TestExample
    [junit] Tests run: 1, Failures: 0, Errors: 0, Time elapsed: 0.065 sec
    [junit] 11/05/03 15:05:39 INFO vertica.AllTests: Inititializing database with /grid/0/hudson/hudson-slave/workspace/Hadoop-Mapreduce-trunk/trunk/src/contrib/vertica/testdata/vertica_test.sql
    [junit] 11/05/03 15:05:39 WARN vertica.AllTests: No vertica driver found: com.vertica.Driver
- skipping vertica tests
    [junit] 11/05/03 15:05:39 INFO vertica.AllTests: Inititializing database with /grid/0/hudson/hudson-slave/workspace/Hadoop-Mapreduce-trunk/trunk/src/contrib/vertica/testdata/vertica_test.sql
    [junit] 11/05/03 15:05:39 WARN vertica.AllTests: No vertica driver found: com.vertica.Driver
- skipping vertica tests
    [junit] 11/05/03 15:05:39 INFO vertica.AllTests: Inititializing database with /grid/0/hudson/hudson-slave/workspace/Hadoop-Mapreduce-trunk/trunk/src/contrib/vertica/testdata/vertica_test.sql
    [junit] 11/05/03 15:05:39 WARN vertica.AllTests: No vertica driver found: com.vertica.Driver
- skipping vertica tests
    [junit] 11/05/03 15:05:39 INFO vertica.AllTests: Inititializing database with /grid/0/hudson/hudson-slave/workspace/Hadoop-Mapreduce-trunk/trunk/src/contrib/vertica/testdata/vertica_test.sql
    [junit] 11/05/03 15:05:39 WARN vertica.AllTests: No vertica driver found: com.vertica.Driver
- skipping vertica tests
    [junit] 11/05/03 15:05:39 INFO vertica.AllTests: Inititializing database with /grid/0/hudson/hudson-slave/workspace/Hadoop-Mapreduce-trunk/trunk/src/contrib/vertica/testdata/vertica_test.sql
    [junit] 11/05/03 15:05:39 WARN vertica.AllTests: No vertica driver found: com.vertica.Driver
- skipping vertica tests
    [junit] Running org.apache.hadoop.vertica.TestVertica
    [junit] Tests run: 5, Failures: 0, Errors: 0, Time elapsed: 0.066 sec

BUILD FAILED
/grid/0/hudson/hudson-slave/workspace/Hadoop-Mapreduce-trunk/trunk/build.xml:834: The following
error occurred while executing this line:
/grid/0/hudson/hudson-slave/workspace/Hadoop-Mapreduce-trunk/trunk/build.xml:818: The following
error occurred while executing this line:
/grid/0/hudson/hudson-slave/workspace/Hadoop-Mapreduce-trunk/trunk/src/contrib/build.xml:88:
Tests failed!

Total time: 118 minutes 37 seconds
[FINDBUGS] Skipping publisher since build result is FAILURE
Recording fingerprints
Archiving artifacts
Recording test results
Publishing Javadoc
Publishing Clover coverage report...
No Clover report will be published due to a Build Failure
Email was triggered for: Failure
Sending email for trigger: Failure



###################################################################################
############################## FAILED TESTS (if any) ##############################
2 tests failed.
REGRESSION:  org.apache.hadoop.streaming.TestStreamingBadRecords.testNarrowDown

Error Message:
Forked Java VM exited abnormally. Please note the time in the report does not reflect the
time until the VM exit.

Stack Trace:
junit.framework.AssertionFailedError: Forked Java VM exited abnormally. Please note the time
in the report does not reflect the time until the VM exit.


REGRESSION:  org.apache.hadoop.streaming.TestSymLink.testSymLink

Error Message:
Timeout occurred. Please note the time in the report does not reflect the time until the timeout.

Stack Trace:
junit.framework.AssertionFailedError: Timeout occurred. Please note the time in the report
does not reflect the time until the timeout.




Mime
View raw message