hadoop-mapreduce-dev mailing list archives

Site index · List index
Message view « Date » · « Thread »
Top « Date » · « Thread »
From Apache Jenkins Server <hud...@hudson.apache.org>
Subject Hadoop-Mapreduce-trunk-Commit - Build # 653 - Failure
Date Mon, 02 May 2011 09:35:12 GMT
See https://builds.apache.org/hudson/job/Hadoop-Mapreduce-trunk-Commit/653/

###################################################################################
########################## LAST 60 LINES OF THE CONSOLE ###########################
[...truncated 5975 lines...]
    [javac] /grid/0/hudson/hudson-slave/workspace/Hadoop-Mapreduce-trunk-Commit/trunk/src/contrib/raid/src/java/org/apache/hadoop/hdfs/server/namenode/BlockPlacementPolicyRaid.java:128:
cannot find symbol
    [javac] symbol  : constructor LocatedBlock(org.apache.hadoop.hdfs.protocol.Block,org.apache.hadoop.hdfs.server.namenode.DatanodeDescriptor[])
    [javac] location: class org.apache.hadoop.hdfs.protocol.LocatedBlock
    [javac]           add(new LocatedBlock(new Block(), result));
    [javac]               ^
    [javac] /grid/0/hudson/hudson-slave/workspace/Hadoop-Mapreduce-trunk-Commit/trunk/src/contrib/raid/src/java/org/apache/hadoop/raid/BlockFixer.java:378:
incompatible types
    [javac] found   : org.apache.hadoop.hdfs.protocol.ExtendedBlock
    [javac] required: org.apache.hadoop.hdfs.protocol.Block
    [javac]         Block corruptBlock = lb.getBlock();
    [javac]                                         ^
    [javac] /grid/0/hudson/hudson-slave/workspace/Hadoop-Mapreduce-trunk-Commit/trunk/src/contrib/raid/src/java/org/apache/hadoop/raid/BlockFixer.java:449:
incompatible types
    [javac] found   : org.apache.hadoop.hdfs.protocol.ExtendedBlock
    [javac] required: org.apache.hadoop.hdfs.protocol.Block
    [javac]         Block corruptBlock = lb.getBlock();
    [javac]                                         ^
    [javac] /grid/0/hudson/hudson-slave/workspace/Hadoop-Mapreduce-trunk-Commit/trunk/src/contrib/raid/src/java/org/apache/hadoop/raid/BlockFixer.java:515:
incompatible types
    [javac] found   : org.apache.hadoop.hdfs.protocol.ExtendedBlock
    [javac] required: org.apache.hadoop.hdfs.protocol.Block
    [javac]         Block corruptBlock = lb.getBlock();
    [javac]                                         ^
    [javac] /grid/0/hudson/hudson-slave/workspace/Hadoop-Mapreduce-trunk-Commit/trunk/src/contrib/raid/src/java/org/apache/hadoop/raid/BlockFixer.java:776:
cannot find symbol
    [javac] symbol  : constructor RaidBlockSender(org.apache.hadoop.hdfs.protocol.ExtendedBlock,long,int,long,boolean,boolean,boolean,boolean,java.io.DataInputStream,<anonymous
org.apache.hadoop.hdfs.server.datanode.RaidBlockSender.InputStreamFactory>)
    [javac] location: class org.apache.hadoop.hdfs.server.datanode.RaidBlockSender
    [javac]           new RaidBlockSender(block.getBlock(), blockSize, 0, blockSize,
    [javac]           ^
    [javac] Note: Some input files use or override a deprecated API.
    [javac] Note: Recompile with -Xlint:deprecation for details.
    [javac] Note: Some input files use unchecked or unsafe operations.
    [javac] Note: Recompile with -Xlint:unchecked for details.
    [javac] 6 errors

BUILD FAILED
/grid/0/hudson/hudson-slave/workspace/Hadoop-Mapreduce-trunk-Commit/trunk/build.xml:434: The
following error occurred while executing this line:
/grid/0/hudson/hudson-slave/workspace/Hadoop-Mapreduce-trunk-Commit/trunk/src/contrib/build.xml:30:
The following error occurred while executing this line:
/grid/0/hudson/hudson-slave/workspace/Hadoop-Mapreduce-trunk-Commit/trunk/src/contrib/build-contrib.xml:193:
Compile failed; see the compiler error output for details.

Total time: 4 minutes 8 seconds


======================================================================
======================================================================
STORE: saving artifacts
======================================================================
======================================================================


mv: cannot stat `build/*.tar.gz': No such file or directory
mv: cannot stat `build/test/findbugs': No such file or directory
mv: cannot stat `build/docs/api': No such file or directory
Build Failed
[FINDBUGS] Skipping publisher since build result is FAILURE
Recording fingerprints
Archiving artifacts
Recording test results
Publishing Javadoc
Publishing Clover coverage report...
No Clover report will be published due to a Build Failure
Email was triggered for: Failure
Sending email for trigger: Failure



###################################################################################
############################## FAILED TESTS (if any) ##############################
No tests ran.

Mime
View raw message