hadoop-mapreduce-dev mailing list archives

Site index · List index
Message view « Date » · « Thread »
Top « Date » · « Thread »
From Apache Jenkins Server <hud...@hudson.apache.org>
Subject Hadoop-Mapreduce-trunk-Commit - Build # 693 - Still Failing
Date Fri, 20 May 2011 23:04:22 GMT
See https://builds.apache.org/hudson/job/Hadoop-Mapreduce-trunk-Commit/693/

###################################################################################
########################## LAST 60 LINES OF THE CONSOLE ###########################
[...truncated 4642 lines...]
    [javac]         NetworkedJob networkJob = jobClient.new NetworkedJob(jInfo.getStatus());
    [javac]                                             ^
    [javac] /grid/0/hudson/hudson-slave/workspace/Hadoop-Mapreduce-trunk-Commit/trunk/src/test/system/test/org/apache/hadoop/mapred/TestTaskKilling.java:561:
qualified new of static class
    [javac]             (jobClient.new NetworkedJob(jInfo.getStatus())).killTask(
    [javac]              ^
    [javac] /grid/0/hudson/hudson-slave/workspace/Hadoop-Mapreduce-trunk-Commit/trunk/src/test/system/test/org/apache/hadoop/mapred/TestTaskKilling.java:561:
cannot find symbol
    [javac] symbol  : constructor NetworkedJob(org.apache.hadoop.mapred.JobStatus)
    [javac] location: class org.apache.hadoop.mapred.JobClient.NetworkedJob
    [javac]             (jobClient.new NetworkedJob(jInfo.getStatus())).killTask(
    [javac]                        ^
    [javac] /grid/0/hudson/hudson-slave/workspace/Hadoop-Mapreduce-trunk-Commit/trunk/src/test/system/test/org/apache/hadoop/mapred/TestTaskKilling.java:571:
qualified new of static class
    [javac]               (jobClient.new NetworkedJob(jInfo.getStatus())).killTask(
    [javac]                ^
    [javac] /grid/0/hudson/hudson-slave/workspace/Hadoop-Mapreduce-trunk-Commit/trunk/src/test/system/test/org/apache/hadoop/mapred/TestTaskKilling.java:571:
cannot find symbol
    [javac] symbol  : constructor NetworkedJob(org.apache.hadoop.mapred.JobStatus)
    [javac] location: class org.apache.hadoop.mapred.JobClient.NetworkedJob
    [javac]               (jobClient.new NetworkedJob(jInfo.getStatus())).killTask(
    [javac]                          ^
    [javac] /grid/0/hudson/hudson-slave/workspace/Hadoop-Mapreduce-trunk-Commit/trunk/src/test/system/test/org/apache/hadoop/mapred/TestTaskKilling.java:614:
qualified new of static class
    [javac]           jobClient.new NetworkedJob(jInfo.getStatus())
    [javac]           ^
    [javac] /grid/0/hudson/hudson-slave/workspace/Hadoop-Mapreduce-trunk-Commit/trunk/src/test/system/test/org/apache/hadoop/mapred/TestTaskKilling.java:614:
cannot find symbol
    [javac] symbol  : constructor NetworkedJob(org.apache.hadoop.mapred.JobStatus)
    [javac] location: class org.apache.hadoop.mapred.JobClient.NetworkedJob
    [javac]           jobClient.new NetworkedJob(jInfo.getStatus())
    [javac]                     ^
    [javac] Note: Some input files use or override a deprecated API.
    [javac] Note: Recompile with -Xlint:deprecation for details.
    [javac] 10 errors
    [javac] 100 warnings

BUILD FAILED
/grid/0/hudson/hudson-slave/workspace/Hadoop-Mapreduce-trunk-Commit/trunk/src/test/aop/build/aop.xml:204:
The following error occurred while executing this line:
/grid/0/hudson/hudson-slave/workspace/Hadoop-Mapreduce-trunk-Commit/trunk/src/test/aop/build/aop.xml:213:
The following error occurred while executing this line:
/grid/0/hudson/hudson-slave/workspace/Hadoop-Mapreduce-trunk-Commit/trunk/build.xml:615: Compile
failed; see the compiler error output for details.

Total time: 3 minutes 15 seconds


======================================================================
======================================================================
STORE: saving artifacts
======================================================================
======================================================================


mv: cannot stat `build/*.tar.gz': No such file or directory
mv: cannot stat `build/test/findbugs': No such file or directory
mv: cannot stat `build/docs/api': No such file or directory
Build Failed
[FINDBUGS] Skipping publisher since build result is FAILURE
Recording fingerprints
Archiving artifacts
Recording test results
Publishing Javadoc
Publishing Clover coverage report...
No Clover report will be published due to a Build Failure
Email was triggered for: Failure
Sending email for trigger: Failure



###################################################################################
############################## FAILED TESTS (if any) ##############################
No tests ran.

Mime
View raw message