hadoop-mapreduce-dev mailing list archives

Site index · List index
Message view « Date » · « Thread »
Top « Date » · « Thread »
From Apache Jenkins Server <hud...@hudson.apache.org>
Subject Hadoop-Mapreduce-22-branch - Build # 43 - Failure
Date Thu, 28 Apr 2011 12:36:24 GMT
See https://builds.apache.org/hudson/job/Hadoop-Mapreduce-22-branch/43/

###################################################################################
########################## LAST 60 LINES OF THE CONSOLE ###########################
[...truncated 187066 lines...]
    [junit]    0.8:96530
    [junit]    0.85:96549
    [junit]    0.9:96658
    [junit]    0.95:96670
    [junit] Failed Reduce CDF --------
    [junit] 0: -9223372036854775808--9223372036854775807
    [junit] map attempts to success -- 0.6567164179104478, 0.3283582089552239, 0.014925373134328358, 
    [junit] ===============
    [junit] 2011-04-28 12:32:29,088 WARN  rumen.ZombieJob (ZombieJob.java:sanitizeLoggedTask(318)) - Task task_200904211745_0004_r_000025 has nulll TaskStatus
    [junit] 2011-04-28 12:32:29,089 WARN  rumen.ZombieJob (ZombieJob.java:sanitizeLoggedTask(318)) - Task task_200904211745_0004_r_000028 has nulll TaskStatus
    [junit] 2011-04-28 12:32:29,089 WARN  rumen.ZombieJob (ZombieJob.java:sanitizeLoggedTask(318)) - Task task_200904211745_0004_r_000029 has nulll TaskStatus
    [junit] 2011-04-28 12:32:29,089 WARN  rumen.ZombieJob (ZombieJob.java:sanitizeLoggedTask(318)) - Task task_200904211745_0004_r_000030 has nulll TaskStatus
    [junit] 2011-04-28 12:32:29,090 WARN  rumen.ZombieJob (ZombieJob.java:sanitizeLoggedTask(318)) - Task task_200904211745_0004_r_000031 has nulll TaskStatus
    [junit] 2011-04-28 12:32:29,090 WARN  rumen.ZombieJob (ZombieJob.java:sanitizeLoggedTask(318)) - Task task_200904211745_0004_r_000032 has nulll TaskStatus
    [junit] 2011-04-28 12:32:29,090 WARN  rumen.ZombieJob (ZombieJob.java:sanitizeLoggedTask(318)) - Task task_200904211745_0004_r_000033 has nulll TaskStatus
    [junit] 2011-04-28 12:32:29,091 WARN  rumen.ZombieJob (ZombieJob.java:sanitizeLoggedTask(318)) - Task task_200904211745_0004_r_000034 has nulll TaskStatus
    [junit] 2011-04-28 12:32:29,091 WARN  rumen.ZombieJob (ZombieJob.java:sanitizeLoggedTask(318)) - Task task_200904211745_0004_r_000035 has nulll TaskStatus
    [junit] 2011-04-28 12:32:29,092 WARN  rumen.ZombieJob (ZombieJob.java:sanitizeLoggedTask(318)) - Task task_200904211745_0004_r_000036 has nulll TaskStatus
    [junit] 2011-04-28 12:32:29,092 WARN  rumen.ZombieJob (ZombieJob.java:sanitizeLoggedTask(318)) - Task task_200904211745_0004_r_000037 has nulll TaskStatus
    [junit] 2011-04-28 12:32:29,092 WARN  rumen.ZombieJob (ZombieJob.java:sanitizeLoggedTask(318)) - Task task_200904211745_0004_r_000038 has nulll TaskStatus
    [junit] 2011-04-28 12:32:29,093 WARN  rumen.ZombieJob (ZombieJob.java:sanitizeLoggedTask(318)) - Task task_200904211745_0004_r_000039 has nulll TaskStatus
    [junit] 2011-04-28 12:32:29,093 WARN  rumen.ZombieJob (ZombieJob.java:sanitizeLoggedTask(318)) - Task task_200904211745_0004_r_000040 has nulll TaskStatus
    [junit] 2011-04-28 12:32:29,093 WARN  rumen.ZombieJob (ZombieJob.java:sanitizeLoggedTask(318)) - Task task_200904211745_0004_r_000041 has nulll TaskStatus
    [junit] 2011-04-28 12:32:29,094 WARN  rumen.ZombieJob (ZombieJob.java:sanitizeLoggedTask(318)) - Task task_200904211745_0004_r_000042 has nulll TaskStatus
    [junit] 2011-04-28 12:32:29,094 WARN  rumen.ZombieJob (ZombieJob.java:sanitizeLoggedTask(318)) - Task task_200904211745_0004_r_000043 has nulll TaskStatus
    [junit] 2011-04-28 12:32:29,095 WARN  rumen.ZombieJob (ZombieJob.java:sanitizeLoggedTask(318)) - Task task_200904211745_0004_r_000044 has nulll TaskStatus
    [junit] 2011-04-28 12:32:29,095 WARN  rumen.ZombieJob (ZombieJob.java:sanitizeLoggedTask(318)) - Task task_200904211745_0004_r_000045 has nulll TaskStatus
    [junit] 2011-04-28 12:32:29,095 WARN  rumen.ZombieJob (ZombieJob.java:sanitizeLoggedTask(318)) - Task task_200904211745_0004_r_000046 has nulll TaskStatus
    [junit] generated failed map runtime distribution
    [junit] 100000: 18592--18592
    [junit]    0.1:18592
    [junit]    0.5:18592
    [junit]    0.9:18592
    [junit] Tests run: 5, Failures: 0, Errors: 0, Time elapsed: 3.047 sec
    [junit] Running org.apache.hadoop.util.TestReflectionUtils
    [junit] Tests run: 1, Failures: 0, Errors: 0, Time elapsed: 0.366 sec
    [junit] Running org.apache.hadoop.util.TestRunJar
    [junit] Creating file/grid/0/hudson/hudson-slave/workspace/Hadoop-Mapreduce-22-branch/trunk/build/test/data/out
    [junit] Tests run: 1, Failures: 0, Errors: 0, Time elapsed: 0.324 sec

checkfailure:

run-test-mapred-all-withtestcaseonly:

run-test-mapred:

BUILD FAILED
/grid/0/hudson/hudson-slave/workspace/Hadoop-Mapreduce-22-branch/trunk/build.xml:817: Tests failed!

Total time: 117 minutes 51 seconds
[FINDBUGS] Skipping publisher since build result is FAILURE
Recording fingerprints
Archiving artifacts
Recording test results
Publishing Javadoc
Publishing Clover coverage report...
No Clover report will be published due to a Build Failure
Email was triggered for: Failure
Sending email for trigger: Failure



###################################################################################
############################## FAILED TESTS (if any) ##############################
101 tests failed.
REGRESSION:  org.apache.hadoop.cli.TestMRCLI.testAll

Error Message:
One of the tests failed. See the Detailed results to identify the command that failed

Stack Trace:
junit.framework.AssertionFailedError: One of the tests failed. See the Detailed results to identify the command that failed
	at org.apache.hadoop.cli.CLITestHelper.displayResults(CLITestHelper.java:257)
	at org.apache.hadoop.cli.CLITestHelper.tearDown(CLITestHelper.java:119)
	at org.apache.hadoop.cli.TestHDFSCLI.tearDown(TestHDFSCLI.java:81)
	at org.apache.hadoop.cli.TestMRCLI.tearDown(TestMRCLI.java:55)


REGRESSION:  org.apache.hadoop.fs.TestDFSIO.testIOs

Error Message:
chmod: cannot access `/tmp/hadoop-hudson/mapred/staging/hudson-2051021221/.staging/job_local_0001': No such file or directory 

Stack Trace:
org.apache.hadoop.util.Shell$ExitCodeException: chmod: cannot access `/tmp/hadoop-hudson/mapred/staging/hudson-2051021221/.staging/job_local_0001': No such file or directory

	at org.apache.hadoop.util.Shell.runCommand(Shell.java:256)
	at org.apache.hadoop.util.Shell.run(Shell.java:183)
	at org.apache.hadoop.util.Shell$ShellCommandExecutor.execute(Shell.java:376)
	at org.apache.hadoop.util.Shell.execCommand(Shell.java:462)
	at org.apache.hadoop.util.Shell.execCommand(Shell.java:445)
	at org.apache.hadoop.fs.RawLocalFileSystem.execCommand(RawLocalFileSystem.java:560)
	at org.apache.hadoop.fs.RawLocalFileSystem.setPermission(RawLocalFileSystem.java:551)
	at org.apache.hadoop.fs.FilterFileSystem.setPermission(FilterFileSystem.java:343)
	at org.apache.hadoop.fs.FileSystem.mkdirs(FileSystem.java:410)
	at org.apache.hadoop.mapreduce.JobSubmitter.copyAndConfigureFiles(JobSubmitter.java:166)
	at org.apache.hadoop.mapreduce.JobSubmitter.copyAndConfigureFiles(JobSubmitter.java:283)
	at org.apache.hadoop.mapreduce.JobSubmitter.submitJobInternal(JobSubmitter.java:350)
	at org.apache.hadoop.mapreduce.Job$2.run(Job.java:1037)
	at org.apache.hadoop.mapreduce.Job$2.run(Job.java:1034)
	at java.security.AccessController.doPrivileged(Native Method)
	at javax.security.auth.Subject.doAs(Subject.java:396)
	at org.apache.hadoop.security.UserGroupInformation.doAs(UserGroupInformation.java:1142)
	at org.apache.hadoop.mapreduce.Job.submit(Job.java:1034)
	at org.apache.hadoop.mapred.JobClient.submitJob(JobClient.java:536)
	at org.apache.hadoop.mapred.JobClient.runJob(JobClient.java:781)
	at org.apache.hadoop.fs.TestDFSIO.runIOTest(TestDFSIO.java:340)
	at org.apache.hadoop.fs.TestDFSIO.writeTest(TestDFSIO.java:321)
	at org.apache.hadoop.fs.TestDFSIO.testIOs(TestDFSIO.java:188)
	at org.apache.hadoop.fs.TestDFSIO.__CLR3_0_27nynfmhu5(TestDFSIO.java:168)
	at org.apache.hadoop.fs.TestDFSIO.testIOs(TestDFSIO.java:166)


REGRESSION:  org.apache.hadoop.fs.TestFileSystem.testFs

Error Message:
chmod: cannot access `/tmp/hadoop-hudson/mapred/staging/hudson1959288065/.staging/job_local_0001': No such file or directory 

Stack Trace:
org.apache.hadoop.util.Shell$ExitCodeException: chmod: cannot access `/tmp/hadoop-hudson/mapred/staging/hudson1959288065/.staging/job_local_0001': No such file or directory

	at org.apache.hadoop.util.Shell.runCommand(Shell.java:256)
	at org.apache.hadoop.util.Shell.run(Shell.java:183)
	at org.apache.hadoop.util.Shell$ShellCommandExecutor.execute(Shell.java:376)
	at org.apache.hadoop.util.Shell.execCommand(Shell.java:462)
	at org.apache.hadoop.util.Shell.execCommand(Shell.java:445)
	at org.apache.hadoop.fs.RawLocalFileSystem.execCommand(RawLocalFileSystem.java:560)
	at org.apache.hadoop.fs.RawLocalFileSystem.setPermission(RawLocalFileSystem.java:551)
	at org.apache.hadoop.fs.FilterFileSystem.setPermission(FilterFileSystem.java:343)
	at org.apache.hadoop.fs.FileSystem.mkdirs(FileSystem.java:410)
	at org.apache.hadoop.mapreduce.JobSubmitter.copyAndConfigureFiles(JobSubmitter.java:166)
	at org.apache.hadoop.mapreduce.JobSubmitter.copyAndConfigureFiles(JobSubmitter.java:283)
	at org.apache.hadoop.mapreduce.JobSubmitter.submitJobInternal(JobSubmitter.java:350)
	at org.apache.hadoop.mapreduce.Job$2.run(Job.java:1037)
	at org.apache.hadoop.mapreduce.Job$2.run(Job.java:1034)
	at java.security.AccessController.doPrivileged(Native Method)
	at javax.security.auth.Subject.doAs(Subject.java:396)
	at org.apache.hadoop.security.UserGroupInformation.doAs(UserGroupInformation.java:1142)
	at org.apache.hadoop.mapreduce.Job.submit(Job.java:1034)
	at org.apache.hadoop.mapred.JobClient.submitJob(JobClient.java:536)
	at org.apache.hadoop.mapred.JobClient.runJob(JobClient.java:781)
	at org.apache.hadoop.fs.TestFileSystem.writeTest(TestFileSystem.java:237)
	at org.apache.hadoop.fs.TestFileSystem.testFs(TestFileSystem.java:83)
	at org.apache.hadoop.fs.TestFileSystem.__CLR3_0_2jwa3jaf82(TestFileSystem.java:69)
	at org.apache.hadoop.fs.TestFileSystem.testFs(TestFileSystem.java:68)


REGRESSION:  org.apache.hadoop.fs.slive.TestSlive.testMRFlow

Error Message:
null

Stack Trace:
junit.framework.AssertionFailedError: 
	at org.apache.hadoop.fs.slive.TestSlive.__CLR3_0_234abe4gn9(TestSlive.java:409)
	at org.apache.hadoop.fs.slive.TestSlive.testMRFlow(TestSlive.java:405)


REGRESSION:  org.apache.hadoop.mapred.TestCollect.testCollect

Error Message:
chmod: cannot access `/tmp/hadoop-hudson/mapred/staging/hudson526494642/.staging/job_local_0001': No such file or directory 

Stack Trace:
org.apache.hadoop.util.Shell$ExitCodeException: chmod: cannot access `/tmp/hadoop-hudson/mapred/staging/hudson526494642/.staging/job_local_0001': No such file or directory

	at org.apache.hadoop.util.Shell.runCommand(Shell.java:256)
	at org.apache.hadoop.util.Shell.run(Shell.java:183)
	at org.apache.hadoop.util.Shell$ShellCommandExecutor.execute(Shell.java:376)
	at org.apache.hadoop.util.Shell.execCommand(Shell.java:462)
	at org.apache.hadoop.util.Shell.execCommand(Shell.java:445)
	at org.apache.hadoop.fs.RawLocalFileSystem.execCommand(RawLocalFileSystem.java:560)
	at org.apache.hadoop.fs.RawLocalFileSystem.setPermission(RawLocalFileSystem.java:551)
	at org.apache.hadoop.fs.FilterFileSystem.setPermission(FilterFileSystem.java:343)
	at org.apache.hadoop.fs.FileSystem.mkdirs(FileSystem.java:410)
	at org.apache.hadoop.mapreduce.JobSubmitter.copyAndConfigureFiles(JobSubmitter.java:166)
	at org.apache.hadoop.mapreduce.JobSubmitter.copyAndConfigureFiles(JobSubmitter.java:283)
	at org.apache.hadoop.mapreduce.JobSubmitter.submitJobInternal(JobSubmitter.java:350)
	at org.apache.hadoop.mapreduce.Job$2.run(Job.java:1037)
	at org.apache.hadoop.mapreduce.Job$2.run(Job.java:1034)
	at java.security.AccessController.doPrivileged(Native Method)
	at javax.security.auth.Subject.doAs(Subject.java:396)
	at org.apache.hadoop.security.UserGroupInformation.doAs(UserGroupInformation.java:1142)
	at org.apache.hadoop.mapreduce.Job.submit(Job.java:1034)
	at org.apache.hadoop.mapred.JobClient.submitJob(JobClient.java:536)
	at org.apache.hadoop.mapred.JobClient.runJob(JobClient.java:781)
	at org.apache.hadoop.mapred.TestCollect.__CLR3_0_21ivclbqh0(TestCollect.java:133)
	at org.apache.hadoop.mapred.TestCollect.testCollect(TestCollect.java:129)


REGRESSION:  org.apache.hadoop.mapred.TestComparators.testDefaultMRComparator

Error Message:
chmod: cannot access `/tmp/hadoop-hudson/mapred/staging/hudson1521196856/.staging/job_local_0001': No such file or directory 

Stack Trace:
org.apache.hadoop.util.Shell$ExitCodeException: chmod: cannot access `/tmp/hadoop-hudson/mapred/staging/hudson1521196856/.staging/job_local_0001': No such file or directory

	at org.apache.hadoop.util.Shell.runCommand(Shell.java:256)
	at org.apache.hadoop.util.Shell.run(Shell.java:183)
	at org.apache.hadoop.util.Shell$ShellCommandExecutor.execute(Shell.java:376)
	at org.apache.hadoop.util.Shell.execCommand(Shell.java:462)
	at org.apache.hadoop.util.Shell.execCommand(Shell.java:445)
	at org.apache.hadoop.fs.RawLocalFileSystem.execCommand(RawLocalFileSystem.java:560)
	at org.apache.hadoop.fs.RawLocalFileSystem.setPermission(RawLocalFileSystem.java:551)
	at org.apache.hadoop.fs.FilterFileSystem.setPermission(FilterFileSystem.java:343)
	at org.apache.hadoop.fs.FileSystem.mkdirs(FileSystem.java:410)
	at org.apache.hadoop.mapreduce.JobSubmitter.copyAndConfigureFiles(JobSubmitter.java:166)
	at org.apache.hadoop.mapreduce.JobSubmitter.copyAndConfigureFiles(JobSubmitter.java:283)
	at org.apache.hadoop.mapreduce.JobSubmitter.submitJobInternal(JobSubmitter.java:350)
	at org.apache.hadoop.mapreduce.Job$2.run(Job.java:1037)
	at org.apache.hadoop.mapreduce.Job$2.run(Job.java:1034)
	at java.security.AccessController.doPrivileged(Native Method)
	at javax.security.auth.Subject.doAs(Subject.java:396)
	at org.apache.hadoop.security.UserGroupInformation.doAs(UserGroupInformation.java:1142)
	at org.apache.hadoop.mapreduce.Job.submit(Job.java:1034)
	at org.apache.hadoop.mapred.JobClient.submitJob(JobClient.java:536)
	at org.apache.hadoop.mapred.TestComparators.__CLR3_0_2x7bh2pki4(TestComparators.java:345)
	at org.apache.hadoop.mapred.TestComparators.testDefaultMRComparator(TestComparators.java:340)


REGRESSION:  org.apache.hadoop.mapred.TestComparators.testUserMRComparator

Error Message:
chmod: cannot access `/tmp/hadoop-hudson/mapred/staging/hudson767644053/.staging/job_local_0002': No such file or directory 

Stack Trace:
org.apache.hadoop.util.Shell$ExitCodeException: chmod: cannot access `/tmp/hadoop-hudson/mapred/staging/hudson767644053/.staging/job_local_0002': No such file or directory

	at org.apache.hadoop.util.Shell.runCommand(Shell.java:256)
	at org.apache.hadoop.util.Shell.run(Shell.java:183)
	at org.apache.hadoop.util.Shell$ShellCommandExecutor.execute(Shell.java:376)
	at org.apache.hadoop.util.Shell.execCommand(Shell.java:462)
	at org.apache.hadoop.util.Shell.execCommand(Shell.java:445)
	at org.apache.hadoop.fs.RawLocalFileSystem.execCommand(RawLocalFileSystem.java:560)
	at org.apache.hadoop.fs.RawLocalFileSystem.setPermission(RawLocalFileSystem.java:551)
	at org.apache.hadoop.fs.FilterFileSystem.setPermission(FilterFileSystem.java:343)
	at org.apache.hadoop.fs.FileSystem.mkdirs(FileSystem.java:410)
	at org.apache.hadoop.mapreduce.JobSubmitter.copyAndConfigureFiles(JobSubmitter.java:166)
	at org.apache.hadoop.mapreduce.JobSubmitter.copyAndConfigureFiles(JobSubmitter.java:283)
	at org.apache.hadoop.mapreduce.JobSubmitter.submitJobInternal(JobSubmitter.java:350)
	at org.apache.hadoop.mapreduce.Job$2.run(Job.java:1037)
	at org.apache.hadoop.mapreduce.Job$2.run(Job.java:1034)
	at java.security.AccessController.doPrivileged(Native Method)
	at javax.security.auth.Subject.doAs(Subject.java:396)
	at org.apache.hadoop.security.UserGroupInformation.doAs(UserGroupInformation.java:1142)
	at org.apache.hadoop.mapreduce.Job.submit(Job.java:1034)
	at org.apache.hadoop.mapred.JobClient.submitJob(JobClient.java:536)
	at org.apache.hadoop.mapred.TestComparators.__CLR3_0_2ljmb1dkih(TestComparators.java:367)
	at org.apache.hadoop.mapred.TestComparators.testUserMRComparator(TestComparators.java:361)


REGRESSION:  org.apache.hadoop.mapred.TestComparators.testUserValueGroupingComparator

Error Message:
chmod: cannot access `/tmp/hadoop-hudson/mapred/staging/hudson-1300952828/.staging/job_local_0003': No such file or directory 

Stack Trace:
org.apache.hadoop.util.Shell$ExitCodeException: chmod: cannot access `/tmp/hadoop-hudson/mapred/staging/hudson-1300952828/.staging/job_local_0003': No such file or directory

	at org.apache.hadoop.util.Shell.runCommand(Shell.java:256)
	at org.apache.hadoop.util.Shell.run(Shell.java:183)
	at org.apache.hadoop.util.Shell$ShellCommandExecutor.execute(Shell.java:376)
	at org.apache.hadoop.util.Shell.execCommand(Shell.java:462)
	at org.apache.hadoop.util.Shell.execCommand(Shell.java:445)
	at org.apache.hadoop.fs.RawLocalFileSystem.execCommand(RawLocalFileSystem.java:560)
	at org.apache.hadoop.fs.RawLocalFileSystem.setPermission(RawLocalFileSystem.java:551)
	at org.apache.hadoop.fs.FilterFileSystem.setPermission(FilterFileSystem.java:343)
	at org.apache.hadoop.fs.FileSystem.mkdirs(FileSystem.java:410)
	at org.apache.hadoop.mapreduce.JobSubmitter.copyAndConfigureFiles(JobSubmitter.java:166)
	at org.apache.hadoop.mapreduce.JobSubmitter.copyAndConfigureFiles(JobSubmitter.java:283)
	at org.apache.hadoop.mapreduce.JobSubmitter.submitJobInternal(JobSubmitter.java:350)
	at org.apache.hadoop.mapreduce.Job$2.run(Job.java:1037)
	at org.apache.hadoop.mapreduce.Job$2.run(Job.java:1034)
	at java.security.AccessController.doPrivileged(Native Method)
	at javax.security.auth.Subject.doAs(Subject.java:396)
	at org.apache.hadoop.security.UserGroupInformation.doAs(UserGroupInformation.java:1142)
	at org.apache.hadoop.mapreduce.Job.submit(Job.java:1034)
	at org.apache.hadoop.mapred.JobClient.submitJob(JobClient.java:536)
	at org.apache.hadoop.mapred.TestComparators.__CLR3_0_2rqt6a4kiv(TestComparators.java:390)
	at org.apache.hadoop.mapred.TestComparators.testUserValueGroupingComparator(TestComparators.java:384)


REGRESSION:  org.apache.hadoop.mapred.TestComparators.testAllUserComparators

Error Message:
chmod: cannot access `/tmp/hadoop-hudson/mapred/staging/hudson-1094772711/.staging/job_local_0004': No such file or directory 

Stack Trace:
org.apache.hadoop.util.Shell$ExitCodeException: chmod: cannot access `/tmp/hadoop-hudson/mapred/staging/hudson-1094772711/.staging/job_local_0004': No such file or directory

	at org.apache.hadoop.util.Shell.runCommand(Shell.java:256)
	at org.apache.hadoop.util.Shell.run(Shell.java:183)
	at org.apache.hadoop.util.Shell$ShellCommandExecutor.execute(Shell.java:376)
	at org.apache.hadoop.util.Shell.execCommand(Shell.java:462)
	at org.apache.hadoop.util.Shell.execCommand(Shell.java:445)
	at org.apache.hadoop.fs.RawLocalFileSystem.execCommand(RawLocalFileSystem.java:560)
	at org.apache.hadoop.fs.RawLocalFileSystem.setPermission(RawLocalFileSystem.java:551)
	at org.apache.hadoop.fs.FilterFileSystem.setPermission(FilterFileSystem.java:343)
	at org.apache.hadoop.fs.FileSystem.mkdirs(FileSystem.java:410)
	at org.apache.hadoop.mapreduce.JobSubmitter.copyAndConfigureFiles(JobSubmitter.java:166)
	at org.apache.hadoop.mapreduce.JobSubmitter.copyAndConfigureFiles(JobSubmitter.java:283)
	at org.apache.hadoop.mapreduce.JobSubmitter.submitJobInternal(JobSubmitter.java:350)
	at org.apache.hadoop.mapreduce.Job$2.run(Job.java:1037)
	at org.apache.hadoop.mapreduce.Job$2.run(Job.java:1034)
	at java.security.AccessController.doPrivileged(Native Method)
	at javax.security.auth.Subject.doAs(Subject.java:396)
	at org.apache.hadoop.security.UserGroupInformation.doAs(UserGroupInformation.java:1142)
	at org.apache.hadoop.mapreduce.Job.submit(Job.java:1034)
	at org.apache.hadoop.mapred.JobClient.submitJob(JobClient.java:536)
	at org.apache.hadoop.mapred.TestComparators.__CLR3_0_2mq9wl2kj9(TestComparators.java:416)
	at org.apache.hadoop.mapred.TestComparators.testAllUserComparators(TestComparators.java:409)


REGRESSION:  org.apache.hadoop.mapred.TestFieldSelection.testFieldSelection

Error Message:
chmod: cannot access `/tmp/hadoop-hudson/mapred/staging/hudson939303739/.staging/job_local_0001': No such file or directory 

Stack Trace:
org.apache.hadoop.util.Shell$ExitCodeException: chmod: cannot access `/tmp/hadoop-hudson/mapred/staging/hudson939303739/.staging/job_local_0001': No such file or directory

	at org.apache.hadoop.util.Shell.runCommand(Shell.java:256)
	at org.apache.hadoop.util.Shell.run(Shell.java:183)
	at org.apache.hadoop.util.Shell$ShellCommandExecutor.execute(Shell.java:376)
	at org.apache.hadoop.util.Shell.execCommand(Shell.java:462)
	at org.apache.hadoop.util.Shell.execCommand(Shell.java:445)
	at org.apache.hadoop.fs.RawLocalFileSystem.execCommand(RawLocalFileSystem.java:560)
	at org.apache.hadoop.fs.RawLocalFileSystem.setPermission(RawLocalFileSystem.java:551)
	at org.apache.hadoop.fs.FilterFileSystem.setPermission(FilterFileSystem.java:343)
	at org.apache.hadoop.fs.FileSystem.mkdirs(FileSystem.java:410)
	at org.apache.hadoop.mapreduce.JobSubmitter.copyAndConfigureFiles(JobSubmitter.java:166)
	at org.apache.hadoop.mapreduce.JobSubmitter.copyAndConfigureFiles(JobSubmitter.java:283)
	at org.apache.hadoop.mapreduce.JobSubmitter.submitJobInternal(JobSubmitter.java:350)
	at org.apache.hadoop.mapreduce.Job$2.run(Job.java:1037)
	at org.apache.hadoop.mapreduce.Job$2.run(Job.java:1034)
	at java.security.AccessController.doPrivileged(Native Method)
	at javax.security.auth.Subject.doAs(Subject.java:396)
	at org.apache.hadoop.security.UserGroupInformation.doAs(UserGroupInformation.java:1142)
	at org.apache.hadoop.mapreduce.Job.submit(Job.java:1034)
	at org.apache.hadoop.mapred.JobClient.submitJob(JobClient.java:536)
	at org.apache.hadoop.mapred.JobClient.runJob(JobClient.java:781)
	at org.apache.hadoop.mapred.TestFieldSelection.launch(TestFieldSelection.java:81)
	at org.apache.hadoop.mapred.TestFieldSelection.__CLR3_0_2asm65n77n(TestFieldSelection.java:39)
	at org.apache.hadoop.mapred.TestFieldSelection.testFieldSelection(TestFieldSelection.java:38)


REGRESSION:  org.apache.hadoop.mapred.TestFileOutputFormat.testCustomFile

Error Message:
chmod: cannot access `/tmp/hadoop-hudson/mapred/staging/hudson1724336402/.staging/job_local_0001': No such file or directory 

Stack Trace:
org.apache.hadoop.util.Shell$ExitCodeException: chmod: cannot access `/tmp/hadoop-hudson/mapred/staging/hudson1724336402/.staging/job_local_0001': No such file or directory

	at org.apache.hadoop.util.Shell.runCommand(Shell.java:256)
	at org.apache.hadoop.util.Shell.run(Shell.java:183)
	at org.apache.hadoop.util.Shell$ShellCommandExecutor.execute(Shell.java:376)
	at org.apache.hadoop.util.Shell.execCommand(Shell.java:462)
	at org.apache.hadoop.util.Shell.execCommand(Shell.java:445)
	at org.apache.hadoop.fs.RawLocalFileSystem.execCommand(RawLocalFileSystem.java:560)
	at org.apache.hadoop.fs.RawLocalFileSystem.setPermission(RawLocalFileSystem.java:551)
	at org.apache.hadoop.fs.FilterFileSystem.setPermission(FilterFileSystem.java:343)
	at org.apache.hadoop.fs.FileSystem.mkdirs(FileSystem.java:410)
	at org.apache.hadoop.mapreduce.JobSubmitter.copyAndConfigureFiles(JobSubmitter.java:166)
	at org.apache.hadoop.mapreduce.JobSubmitter.copyAndConfigureFiles(JobSubmitter.java:283)
	at org.apache.hadoop.mapreduce.JobSubmitter.submitJobInternal(JobSubmitter.java:350)
	at org.apache.hadoop.mapreduce.Job$2.run(Job.java:1037)
	at org.apache.hadoop.mapreduce.Job$2.run(Job.java:1034)
	at java.security.AccessController.doPrivileged(Native Method)
	at javax.security.auth.Subject.doAs(Subject.java:396)
	at org.apache.hadoop.security.UserGroupInformation.doAs(UserGroupInformation.java:1142)
	at org.apache.hadoop.mapreduce.Job.submit(Job.java:1034)
	at org.apache.hadoop.mapred.JobClient.submitJob(JobClient.java:536)
	at org.apache.hadoop.mapred.TestFileOutputFormat.__CLR3_0_24yakvaeel(TestFileOutputFormat.java:84)
	at org.apache.hadoop.mapred.TestFileOutputFormat.testCustomFile(TestFileOutputFormat.java:38)


REGRESSION:  org.apache.hadoop.mapred.TestJavaSerialization.testMapReduceJob

Error Message:
chmod: cannot access `/tmp/hadoop-hudson/mapred/staging/hudson-1614660907/.staging/job_local_0001': No such file or directory 

Stack Trace:
org.apache.hadoop.util.Shell$ExitCodeException: chmod: cannot access `/tmp/hadoop-hudson/mapred/staging/hudson-1614660907/.staging/job_local_0001': No such file or directory

	at org.apache.hadoop.util.Shell.runCommand(Shell.java:256)
	at org.apache.hadoop.util.Shell.run(Shell.java:183)
	at org.apache.hadoop.util.Shell$ShellCommandExecutor.execute(Shell.java:376)
	at org.apache.hadoop.util.Shell.execCommand(Shell.java:462)
	at org.apache.hadoop.util.Shell.execCommand(Shell.java:445)
	at org.apache.hadoop.fs.RawLocalFileSystem.execCommand(RawLocalFileSystem.java:560)
	at org.apache.hadoop.fs.RawLocalFileSystem.setPermission(RawLocalFileSystem.java:551)
	at org.apache.hadoop.fs.FilterFileSystem.setPermission(FilterFileSystem.java:343)
	at org.apache.hadoop.fs.FileSystem.mkdirs(FileSystem.java:410)
	at org.apache.hadoop.mapreduce.JobSubmitter.copyAndConfigureFiles(JobSubmitter.java:166)
	at org.apache.hadoop.mapreduce.JobSubmitter.copyAndConfigureFiles(JobSubmitter.java:283)
	at org.apache.hadoop.mapreduce.JobSubmitter.submitJobInternal(JobSubmitter.java:350)
	at org.apache.hadoop.mapreduce.Job$2.run(Job.java:1037)
	at org.apache.hadoop.mapreduce.Job$2.run(Job.java:1034)
	at java.security.AccessController.doPrivileged(Native Method)
	at javax.security.auth.Subject.doAs(Subject.java:396)
	at org.apache.hadoop.security.UserGroupInformation.doAs(UserGroupInformation.java:1142)
	at org.apache.hadoop.mapreduce.Job.submit(Job.java:1034)
	at org.apache.hadoop.mapred.JobClient.submitJob(JobClient.java:536)
	at org.apache.hadoop.mapred.JobClient.runJob(JobClient.java:781)
	at org.apache.hadoop.mapred.TestJavaSerialization.__CLR3_0_2nmr1sk97x(TestJavaSerialization.java:116)
	at org.apache.hadoop.mapred.TestJavaSerialization.testMapReduceJob(TestJavaSerialization.java:91)


REGRESSION:  org.apache.hadoop.mapred.TestJavaSerialization.testWriteToSequencefile

Error Message:
chmod: cannot access `/tmp/hadoop-hudson/mapred/staging/hudson1743055090/.staging/job_local_0002': No such file or directory 

Stack Trace:
org.apache.hadoop.util.Shell$ExitCodeException: chmod: cannot access `/tmp/hadoop-hudson/mapred/staging/hudson1743055090/.staging/job_local_0002': No such file or directory

	at org.apache.hadoop.util.Shell.runCommand(Shell.java:256)
	at org.apache.hadoop.util.Shell.run(Shell.java:183)
	at org.apache.hadoop.util.Shell$ShellCommandExecutor.execute(Shell.java:376)
	at org.apache.hadoop.util.Shell.execCommand(Shell.java:462)
	at org.apache.hadoop.util.Shell.execCommand(Shell.java:445)
	at org.apache.hadoop.fs.RawLocalFileSystem.execCommand(RawLocalFileSystem.java:560)
	at org.apache.hadoop.fs.RawLocalFileSystem.setPermission(RawLocalFileSystem.java:551)
	at org.apache.hadoop.fs.FilterFileSystem.setPermission(FilterFileSystem.java:343)
	at org.apache.hadoop.fs.FileSystem.mkdirs(FileSystem.java:410)
	at org.apache.hadoop.mapreduce.JobSubmitter.copyAndConfigureFiles(JobSubmitter.java:166)
	at org.apache.hadoop.mapreduce.JobSubmitter.copyAndConfigureFiles(JobSubmitter.java:283)
	at org.apache.hadoop.mapreduce.JobSubmitter.submitJobInternal(JobSubmitter.java:350)
	at org.apache.hadoop.mapreduce.Job$2.run(Job.java:1037)
	at org.apache.hadoop.mapreduce.Job$2.run(Job.java:1034)
	at java.security.AccessController.doPrivileged(Native Method)
	at javax.security.auth.Subject.doAs(Subject.java:396)
	at org.apache.hadoop.security.UserGroupInformation.doAs(UserGroupInformation.java:1142)
	at org.apache.hadoop.mapreduce.Job.submit(Job.java:1034)
	at org.apache.hadoop.mapred.JobClient.submitJob(JobClient.java:536)
	at org.apache.hadoop.mapred.JobClient.runJob(JobClient.java:781)
	at org.apache.hadoop.mapred.TestJavaSerialization.__CLR3_0_2l3txo98k(TestJavaSerialization.java:162)
	at org.apache.hadoop.mapred.TestJavaSerialization.testWriteToSequencefile(TestJavaSerialization.java:137)


REGRESSION:  org.apache.hadoop.mapred.TestJobCounters.testOldCounterA

Error Message:
chmod: cannot access `/tmp/hadoop-hudson/mapred/staging/hudson-876263670/.staging/job_local_0001': No such file or directory 

Stack Trace:
org.apache.hadoop.util.Shell$ExitCodeException: chmod: cannot access `/tmp/hadoop-hudson/mapred/staging/hudson-876263670/.staging/job_local_0001': No such file or directory

	at org.apache.hadoop.util.Shell.runCommand(Shell.java:256)
	at org.apache.hadoop.util.Shell.run(Shell.java:183)
	at org.apache.hadoop.util.Shell$ShellCommandExecutor.execute(Shell.java:376)
	at org.apache.hadoop.util.Shell.execCommand(Shell.java:462)
	at org.apache.hadoop.util.Shell.execCommand(Shell.java:445)
	at org.apache.hadoop.fs.RawLocalFileSystem.execCommand(RawLocalFileSystem.java:560)
	at org.apache.hadoop.fs.RawLocalFileSystem.setPermission(RawLocalFileSystem.java:551)
	at org.apache.hadoop.fs.FilterFileSystem.setPermission(FilterFileSystem.java:343)
	at org.apache.hadoop.fs.FileSystem.mkdirs(FileSystem.java:410)
	at org.apache.hadoop.mapreduce.JobSubmitter.copyAndConfigureFiles(JobSubmitter.java:166)
	at org.apache.hadoop.mapreduce.JobSubmitter.copyAndConfigureFiles(JobSubmitter.java:283)
	at org.apache.hadoop.mapreduce.JobSubmitter.submitJobInternal(JobSubmitter.java:350)
	at org.apache.hadoop.mapreduce.Job$2.run(Job.java:1037)
	at org.apache.hadoop.mapreduce.Job$2.run(Job.java:1034)
	at java.security.AccessController.doPrivileged(Native Method)
	at javax.security.auth.Subject.doAs(Subject.java:396)
	at org.apache.hadoop.security.UserGroupInformation.doAs(UserGroupInformation.java:1142)
	at org.apache.hadoop.mapreduce.Job.submit(Job.java:1034)
	at org.apache.hadoop.mapred.JobClient.submitJob(JobClient.java:536)
	at org.apache.hadoop.mapred.JobClient.runJob(JobClient.java:781)
	at org.apache.hadoop.mapred.TestJobCounters.__CLR3_0_25rygbli9p(TestJobCounters.java:180)
	at org.apache.hadoop.mapred.TestJobCounters.testOldCounterA(TestJobCounters.java:171)


REGRESSION:  org.apache.hadoop.mapred.TestJobCounters.testOldCounterB

Error Message:
chmod: cannot access `/tmp/hadoop-hudson/mapred/staging/hudson-1228577916/.staging/job_local_0002': No such file or directory 

Stack Trace:
org.apache.hadoop.util.Shell$ExitCodeException: chmod: cannot access `/tmp/hadoop-hudson/mapred/staging/hudson-1228577916/.staging/job_local_0002': No such file or directory

	at org.apache.hadoop.util.Shell.runCommand(Shell.java:256)
	at org.apache.hadoop.util.Shell.run(Shell.java:183)
	at org.apache.hadoop.util.Shell$ShellCommandExecutor.execute(Shell.java:376)
	at org.apache.hadoop.util.Shell.execCommand(Shell.java:462)
	at org.apache.hadoop.util.Shell.execCommand(Shell.java:445)
	at org.apache.hadoop.fs.RawLocalFileSystem.execCommand(RawLocalFileSystem.java:560)
	at org.apache.hadoop.fs.RawLocalFileSystem.setPermission(RawLocalFileSystem.java:551)
	at org.apache.hadoop.fs.FilterFileSystem.setPermission(FilterFileSystem.java:343)
	at org.apache.hadoop.fs.FileSystem.mkdirs(FileSystem.java:410)
	at org.apache.hadoop.mapreduce.JobSubmitter.copyAndConfigureFiles(JobSubmitter.java:166)
	at org.apache.hadoop.mapreduce.JobSubmitter.copyAndConfigureFiles(JobSubmitter.java:283)
	at org.apache.hadoop.mapreduce.JobSubmitter.submitJobInternal(JobSubmitter.java:350)
	at org.apache.hadoop.mapreduce.Job$2.run(Job.java:1037)
	at org.apache.hadoop.mapreduce.Job$2.run(Job.java:1034)
	at java.security.AccessController.doPrivileged(Native Method)
	at javax.security.auth.Subject.doAs(Subject.java:396)
	at org.apache.hadoop.security.UserGroupInformation.doAs(UserGroupInformation.java:1142)
	at org.apache.hadoop.mapreduce.Job.submit(Job.java:1034)
	at org.apache.hadoop.mapred.JobClient.submitJob(JobClient.java:536)
	at org.apache.hadoop.mapred.JobClient.runJob(JobClient.java:781)
	at org.apache.hadoop.mapred.TestJobCounters.__CLR3_0_290yf42ia0(TestJobCounters.java:219)
	at org.apache.hadoop.mapred.TestJobCounters.testOldCounterB(TestJobCounters.java:209)


REGRESSION:  org.apache.hadoop.mapred.TestJobCounters.testOldCounterC

Error Message:
chmod: cannot access `/tmp/hadoop-hudson/mapred/staging/hudson693464570/.staging/job_local_0003': No such file or directory 

Stack Trace:
org.apache.hadoop.util.Shell$ExitCodeException: chmod: cannot access `/tmp/hadoop-hudson/mapred/staging/hudson693464570/.staging/job_local_0003': No such file or directory

	at org.apache.hadoop.util.Shell.runCommand(Shell.java:256)
	at org.apache.hadoop.util.Shell.run(Shell.java:183)
	at org.apache.hadoop.util.Shell$ShellCommandExecutor.execute(Shell.java:376)
	at org.apache.hadoop.util.Shell.execCommand(Shell.java:462)
	at org.apache.hadoop.util.Shell.execCommand(Shell.java:445)
	at org.apache.hadoop.fs.RawLocalFileSystem.execCommand(RawLocalFileSystem.java:560)
	at org.apache.hadoop.fs.RawLocalFileSystem.setPermission(RawLocalFileSystem.java:551)
	at org.apache.hadoop.fs.FilterFileSystem.setPermission(FilterFileSystem.java:343)
	at org.apache.hadoop.fs.FileSystem.mkdirs(FileSystem.java:410)
	at org.apache.hadoop.mapreduce.JobSubmitter.copyAndConfigureFiles(JobSubmitter.java:166)
	at org.apache.hadoop.mapreduce.JobSubmitter.copyAndConfigureFiles(JobSubmitter.java:283)
	at org.apache.hadoop.mapreduce.JobSubmitter.submitJobInternal(JobSubmitter.java:350)
	at org.apache.hadoop.mapreduce.Job$2.run(Job.java:1037)
	at org.apache.hadoop.mapreduce.Job$2.run(Job.java:1034)
	at java.security.AccessController.doPrivileged(Native Method)
	at javax.security.auth.Subject.doAs(Subject.java:396)
	at org.apache.hadoop.security.UserGroupInformation.doAs(UserGroupInformation.java:1142)
	at org.apache.hadoop.mapreduce.Job.submit(Job.java:1034)
	at org.apache.hadoop.mapred.JobClient.submitJob(JobClient.java:536)
	at org.apache.hadoop.mapred.JobClient.runJob(JobClient.java:781)
	at org.apache.hadoop.mapred.TestJobCounters.__CLR3_0_2c9ydwjiab(TestJobCounters.java:244)
	at org.apache.hadoop.mapred.TestJobCounters.testOldCounterC(TestJobCounters.java:236)


REGRESSION:  org.apache.hadoop.mapred.TestJobCounters.testNewCounterA

Error Message:
chmod: cannot access `/tmp/hadoop-hudson/mapred/staging/hudson2018932764/.staging/job_local_0004': No such file or directory 

Stack Trace:
org.apache.hadoop.util.Shell$ExitCodeException: chmod: cannot access `/tmp/hadoop-hudson/mapred/staging/hudson2018932764/.staging/job_local_0004': No such file or directory

	at org.apache.hadoop.util.Shell.runCommand(Shell.java:256)
	at org.apache.hadoop.util.Shell.run(Shell.java:183)
	at org.apache.hadoop.util.Shell$ShellCommandExecutor.execute(Shell.java:376)
	at org.apache.hadoop.util.Shell.execCommand(Shell.java:462)
	at org.apache.hadoop.util.Shell.execCommand(Shell.java:445)
	at org.apache.hadoop.fs.RawLocalFileSystem.execCommand(RawLocalFileSystem.java:560)
	at org.apache.hadoop.fs.RawLocalFileSystem.setPermission(RawLocalFileSystem.java:551)
	at org.apache.hadoop.fs.FilterFileSystem.setPermission(FilterFileSystem.java:343)
	at org.apache.hadoop.fs.FileSystem.mkdirs(FileSystem.java:410)
	at org.apache.hadoop.mapreduce.JobSubmitter.copyAndConfigureFiles(JobSubmitter.java:166)
	at org.apache.hadoop.mapreduce.JobSubmitter.copyAndConfigureFiles(JobSubmitter.java:283)
	at org.apache.hadoop.mapreduce.JobSubmitter.submitJobInternal(JobSubmitter.java:350)
	at org.apache.hadoop.mapreduce.Job$2.run(Job.java:1037)
	at org.apache.hadoop.mapreduce.Job$2.run(Job.java:1034)
	at java.security.AccessController.doPrivileged(Native Method)
	at javax.security.auth.Subject.doAs(Subject.java:396)
	at org.apache.hadoop.security.UserGroupInformation.doAs(UserGroupInformation.java:1142)
	at org.apache.hadoop.mapreduce.Job.submit(Job.java:1034)
	at org.apache.hadoop.mapreduce.Job.waitForCompletion(Job.java:1054)
	at org.apache.hadoop.mapred.TestJobCounters.__CLR3_0_21grq0qiam(TestJobCounters.java:267)
	at org.apache.hadoop.mapred.TestJobCounters.testNewCounterA(TestJobCounters.java:257)


REGRESSION:  org.apache.hadoop.mapred.TestJobCounters.testNewCounterB

Error Message:
chmod: cannot access `/tmp/hadoop-hudson/mapred/staging/hudson-673955207/.staging/job_local_0005': No such file or directory 

Stack Trace:
org.apache.hadoop.util.Shell$ExitCodeException: chmod: cannot access `/tmp/hadoop-hudson/mapred/staging/hudson-673955207/.staging/job_local_0005': No such file or directory

	at org.apache.hadoop.util.Shell.runCommand(Shell.java:256)
	at org.apache.hadoop.util.Shell.run(Shell.java:183)
	at org.apache.hadoop.util.Shell$ShellCommandExecutor.execute(Shell.java:376)
	at org.apache.hadoop.util.Shell.execCommand(Shell.java:462)
	at org.apache.hadoop.util.Shell.execCommand(Shell.java:445)
	at org.apache.hadoop.fs.RawLocalFileSystem.execCommand(RawLocalFileSystem.java:560)
	at org.apache.hadoop.fs.RawLocalFileSystem.setPermission(RawLocalFileSystem.java:551)
	at org.apache.hadoop.fs.FilterFileSystem.setPermission(FilterFileSystem.java:343)
	at org.apache.hadoop.fs.FileSystem.mkdirs(FileSystem.java:410)
	at org.apache.hadoop.mapreduce.JobSubmitter.copyAndConfigureFiles(JobSubmitter.java:166)
	at org.apache.hadoop.mapreduce.JobSubmitter.copyAndConfigureFiles(JobSubmitter.java:283)
	at org.apache.hadoop.mapreduce.JobSubmitter.submitJobInternal(JobSubmitter.java:350)
	at org.apache.hadoop.mapreduce.Job$2.run(Job.java:1037)
	at org.apache.hadoop.mapreduce.Job$2.run(Job.java:1034)
	at java.security.AccessController.doPrivileged(Native Method)
	at javax.security.auth.Subject.doAs(Subject.java:396)
	at org.apache.hadoop.security.UserGroupInformation.doAs(UserGroupInformation.java:1142)
	at org.apache.hadoop.mapreduce.Job.submit(Job.java:1034)
	at org.apache.hadoop.mapreduce.Job.waitForCompletion(Job.java:1054)
	at org.apache.hadoop.mapred.TestJobCounters.__CLR3_0_24prot7iax(TestJobCounters.java:283)
	at org.apache.hadoop.mapred.TestJobCounters.testNewCounterB(TestJobCounters.java:273)


REGRESSION:  org.apache.hadoop.mapred.TestJobCounters.testNewCounterC

Error Message:
chmod: cannot access `/tmp/hadoop-hudson/mapred/staging/hudson-2073410286/.staging/job_local_0006': No such file or directory 

Stack Trace:
org.apache.hadoop.util.Shell$ExitCodeException: chmod: cannot access `/tmp/hadoop-hudson/mapred/staging/hudson-2073410286/.staging/job_local_0006': No such file or directory

	at org.apache.hadoop.util.Shell.runCommand(Shell.java:256)
	at org.apache.hadoop.util.Shell.run(Shell.java:183)
	at org.apache.hadoop.util.Shell$ShellCommandExecutor.execute(Shell.java:376)
	at org.apache.hadoop.util.Shell.execCommand(Shell.java:462)
	at org.apache.hadoop.util.Shell.execCommand(Shell.java:445)
	at org.apache.hadoop.fs.RawLocalFileSystem.execCommand(RawLocalFileSystem.java:560)
	at org.apache.hadoop.fs.RawLocalFileSystem.setPermission(RawLocalFileSystem.java:551)
	at org.apache.hadoop.fs.FilterFileSystem.setPermission(FilterFileSystem.java:343)
	at org.apache.hadoop.fs.FileSystem.mkdirs(FileSystem.java:410)
	at org.apache.hadoop.mapreduce.JobSubmitter.copyAndConfigureFiles(JobSubmitter.java:166)
	at org.apache.hadoop.mapreduce.JobSubmitter.copyAndConfigureFiles(JobSubmitter.java:283)
	at org.apache.hadoop.mapreduce.JobSubmitter.submitJobInternal(JobSubmitter.java:350)
	at org.apache.hadoop.mapreduce.Job$2.run(Job.java:1037)
	at org.apache.hadoop.mapreduce.Job$2.run(Job.java:1034)
	at java.security.AccessController.doPrivileged(Native Method)
	at javax.security.auth.Subject.doAs(Subject.java:396)
	at org.apache.hadoop.security.UserGroupInformation.doAs(UserGroupInformation.java:1142)
	at org.apache.hadoop.mapreduce.Job.submit(Job.java:1034)
	at org.apache.hadoop.mapreduce.Job.waitForCompletion(Job.java:1054)
	at org.apache.hadoop.mapred.TestJobCounters.__CLR3_0_27yrnloib8(TestJobCounters.java:299)
	at org.apache.hadoop.mapred.TestJobCounters.testNewCounterC(TestJobCounters.java:289)


REGRESSION:  org.apache.hadoop.mapred.TestLocalMRNotification.testMR

Error Message:
chmod: cannot access `/tmp/hadoop-hudson/mapred/staging/hudson1576480254/.staging/job_local_0001': No such file or directory 

Stack Trace:
org.apache.hadoop.util.Shell$ExitCodeException: chmod: cannot access `/tmp/hadoop-hudson/mapred/staging/hudson1576480254/.staging/job_local_0001': No such file or directory

	at org.apache.hadoop.util.Shell.runCommand(Shell.java:256)
	at org.apache.hadoop.util.Shell.run(Shell.java:183)
	at org.apache.hadoop.util.Shell$ShellCommandExecutor.execute(Shell.java:376)
	at org.apache.hadoop.util.Shell.execCommand(Shell.java:462)
	at org.apache.hadoop.util.Shell.execCommand(Shell.java:445)
	at org.apache.hadoop.fs.RawLocalFileSystem.execCommand(RawLocalFileSystem.java:560)
	at org.apache.hadoop.fs.RawLocalFileSystem.setPermission(RawLocalFileSystem.java:551)
	at org.apache.hadoop.fs.FilterFileSystem.setPermission(FilterFileSystem.java:343)
	at org.apache.hadoop.fs.FileSystem.mkdirs(FileSystem.java:410)
	at org.apache.hadoop.mapreduce.JobSubmitter.copyAndConfigureFiles(JobSubmitter.java:166)
	at org.apache.hadoop.mapreduce.JobSubmitter.copyAndConfigureFiles(JobSubmitter.java:283)
	at org.apache.hadoop.mapreduce.JobSubmitter.submitJobInternal(JobSubmitter.java:350)
	at org.apache.hadoop.mapreduce.Job$2.run(Job.java:1037)
	at org.apache.hadoop.mapreduce.Job$2.run(Job.java:1034)
	at java.security.AccessController.doPrivileged(Native Method)
	at javax.security.auth.Subject.doAs(Subject.java:396)
	at org.apache.hadoop.security.UserGroupInformation.doAs(UserGroupInformation.java:1142)
	at org.apache.hadoop.mapreduce.Job.submit(Job.java:1034)
	at org.apache.hadoop.mapred.JobClient.submitJob(JobClient.java:536)
	at org.apache.hadoop.mapred.JobClient.runJob(JobClient.java:781)
	at org.apache.hadoop.mapred.NotificationTestCase.launchWordCount(NotificationTestCase.java:220)
	at org.apache.hadoop.mapred.NotificationTestCase.__CLR3_0_2ldwkpund2(NotificationTestCase.java:150)
	at org.apache.hadoop.mapred.NotificationTestCase.testMR(NotificationTestCase.java:149)


REGRESSION:  org.apache.hadoop.mapred.TestMRWithDistributedCache.testLocalJobRunner

Error Message:
chmod: cannot access `/tmp/hadoop-hudson/mapred/staging/hudson-1762291173/.staging/job_local_0001': No such file or directory 

Stack Trace:
org.apache.hadoop.util.Shell$ExitCodeException: chmod: cannot access `/tmp/hadoop-hudson/mapred/staging/hudson-1762291173/.staging/job_local_0001': No such file or directory

	at org.apache.hadoop.util.Shell.runCommand(Shell.java:256)
	at org.apache.hadoop.util.Shell.run(Shell.java:183)
	at org.apache.hadoop.util.Shell$ShellCommandExecutor.execute(Shell.java:376)
	at org.apache.hadoop.util.Shell.execCommand(Shell.java:462)
	at org.apache.hadoop.util.Shell.execCommand(Shell.java:445)
	at org.apache.hadoop.fs.RawLocalFileSystem.execCommand(RawLocalFileSystem.java:560)
	at org.apache.hadoop.fs.RawLocalFileSystem.setPermission(RawLocalFileSystem.java:551)
	at org.apache.hadoop.fs.FilterFileSystem.setPermission(FilterFileSystem.java:343)
	at org.apache.hadoop.fs.FileSystem.mkdirs(FileSystem.java:410)
	at org.apache.hadoop.mapreduce.JobSubmitter.copyAndConfigureFiles(JobSubmitter.java:166)
	at org.apache.hadoop.mapreduce.JobSubmitter.copyAndConfigureFiles(JobSubmitter.java:283)
	at org.apache.hadoop.mapreduce.JobSubmitter.submitJobInternal(JobSubmitter.java:350)
	at org.apache.hadoop.mapreduce.Job$2.run(Job.java:1037)
	at org.apache.hadoop.mapreduce.Job$2.run(Job.java:1034)
	at java.security.AccessController.doPrivileged(Native Method)
	at javax.security.auth.Subject.doAs(Subject.java:396)
	at org.apache.hadoop.security.UserGroupInformation.doAs(UserGroupInformation.java:1142)
	at org.apache.hadoop.mapreduce.Job.submit(Job.java:1034)
	at org.apache.hadoop.mapred.TestMRWithDistributedCache.testWithConf(TestMRWithDistributedCache.java:150)
	at org.apache.hadoop.mapred.TestMRWithDistributedCache.__CLR3_0_2mk2aclszn(TestMRWithDistributedCache.java:159)
	at org.apache.hadoop.mapred.TestMRWithDistributedCache.testLocalJobRunner(TestMRWithDistributedCache.java:155)


REGRESSION:  org.apache.hadoop.mapred.TestMapOutputType.testKeyMismatch

Error Message:
chmod: cannot access `/tmp/hadoop-hudson/mapred/staging/hudson-2026246608/.staging/job_local_0001': No such file or directory 

Stack Trace:
org.apache.hadoop.util.Shell$ExitCodeException: chmod: cannot access `/tmp/hadoop-hudson/mapred/staging/hudson-2026246608/.staging/job_local_0001': No such file or directory

	at org.apache.hadoop.util.Shell.runCommand(Shell.java:256)
	at org.apache.hadoop.util.Shell.run(Shell.java:183)
	at org.apache.hadoop.util.Shell$ShellCommandExecutor.execute(Shell.java:376)
	at org.apache.hadoop.util.Shell.execCommand(Shell.java:462)
	at org.apache.hadoop.util.Shell.execCommand(Shell.java:445)
	at org.apache.hadoop.fs.RawLocalFileSystem.execCommand(RawLocalFileSystem.java:560)
	at org.apache.hadoop.fs.RawLocalFileSystem.setPermission(RawLocalFileSystem.java:551)
	at org.apache.hadoop.fs.FilterFileSystem.setPermission(FilterFileSystem.java:343)
	at org.apache.hadoop.fs.FileSystem.mkdirs(FileSystem.java:410)
	at org.apache.hadoop.mapreduce.JobSubmitter.copyAndConfigureFiles(JobSubmitter.java:166)
	at org.apache.hadoop.mapreduce.JobSubmitter.copyAndConfigureFiles(JobSubmitter.java:283)
	at org.apache.hadoop.mapreduce.JobSubmitter.submitJobInternal(JobSubmitter.java:350)
	at org.apache.hadoop.mapreduce.Job$2.run(Job.java:1037)
	at org.apache.hadoop.mapreduce.Job$2.run(Job.java:1034)
	at java.security.AccessController.doPrivileged(Native Method)
	at javax.security.auth.Subject.doAs(Subject.java:396)
	at org.apache.hadoop.security.UserGroupInformation.doAs(UserGroupInformation.java:1142)
	at org.apache.hadoop.mapreduce.Job.submit(Job.java:1034)
	at org.apache.hadoop.mapred.JobClient.submitJob(JobClient.java:536)
	at org.apache.hadoop.mapred.TestMapOutputType.__CLR3_0_2mrrh6moiz(TestMapOutputType.java:116)
	at org.apache.hadoop.mapred.TestMapOutputType.testKeyMismatch(TestMapOutputType.java:109)


REGRESSION:  org.apache.hadoop.mapred.TestMapOutputType.testValueMismatch

Error Message:
chmod: cannot access `/tmp/hadoop-hudson/mapred/staging/hudson-35481264/.staging/job_local_0002': No such file or directory 

Stack Trace:
org.apache.hadoop.util.Shell$ExitCodeException: chmod: cannot access `/tmp/hadoop-hudson/mapred/staging/hudson-35481264/.staging/job_local_0002': No such file or directory

	at org.apache.hadoop.util.Shell.runCommand(Shell.java:256)
	at org.apache.hadoop.util.Shell.run(Shell.java:183)
	at org.apache.hadoop.util.Shell$ShellCommandExecutor.execute(Shell.java:376)
	at org.apache.hadoop.util.Shell.execCommand(Shell.java:462)
	at org.apache.hadoop.util.Shell.execCommand(Shell.java:445)
	at org.apache.hadoop.fs.RawLocalFileSystem.execCommand(RawLocalFileSystem.java:560)
	at org.apache.hadoop.fs.RawLocalFileSystem.setPermission(RawLocalFileSystem.java:551)
	at org.apache.hadoop.fs.FilterFileSystem.setPermission(FilterFileSystem.java:343)
	at org.apache.hadoop.fs.FileSystem.mkdirs(FileSystem.java:410)
	at org.apache.hadoop.mapreduce.JobSubmitter.copyAndConfigureFiles(JobSubmitter.java:166)
	at org.apache.hadoop.mapreduce.JobSubmitter.copyAndConfigureFiles(JobSubmitter.java:283)
	at org.apache.hadoop.mapreduce.JobSubmitter.submitJobInternal(JobSubmitter.java:350)
	at org.apache.hadoop.mapreduce.Job$2.run(Job.java:1037)
	at org.apache.hadoop.mapreduce.Job$2.run(Job.java:1034)
	at java.security.AccessController.doPrivileged(Native Method)
	at javax.security.auth.Subject.doAs(Subject.java:396)
	at org.apache.hadoop.security.UserGroupInformation.doAs(UserGroupInformation.java:1142)
	at org.apache.hadoop.mapreduce.Job.submit(Job.java:1034)
	at org.apache.hadoop.mapred.JobClient.submitJob(JobClient.java:536)
	at org.apache.hadoop.mapred.TestMapOutputType.__CLR3_0_2a8ghw4ojc(TestMapOutputType.java:133)
	at org.apache.hadoop.mapred.TestMapOutputType.testValueMismatch(TestMapOutputType.java:126)


REGRESSION:  org.apache.hadoop.mapred.TestMapOutputType.testNoMismatch

Error Message:
chmod: cannot access `/tmp/hadoop-hudson/mapred/staging/hudson-364207072/.staging/job_local_0003': No such file or directory 

Stack Trace:
org.apache.hadoop.util.Shell$ExitCodeException: chmod: cannot access `/tmp/hadoop-hudson/mapred/staging/hudson-364207072/.staging/job_local_0003': No such file or directory

	at org.apache.hadoop.util.Shell.runCommand(Shell.java:256)
	at org.apache.hadoop.util.Shell.run(Shell.java:183)
	at org.apache.hadoop.util.Shell$ShellCommandExecutor.execute(Shell.java:376)
	at org.apache.hadoop.util.Shell.execCommand(Shell.java:462)
	at org.apache.hadoop.util.Shell.execCommand(Shell.java:445)
	at org.apache.hadoop.fs.RawLocalFileSystem.execCommand(RawLocalFileSystem.java:560)
	at org.apache.hadoop.fs.RawLocalFileSystem.setPermission(RawLocalFileSystem.java:551)
	at org.apache.hadoop.fs.FilterFileSystem.setPermission(FilterFileSystem.java:343)
	at org.apache.hadoop.fs.FileSystem.mkdirs(FileSystem.java:410)
	at org.apache.hadoop.mapreduce.JobSubmitter.copyAndConfigureFiles(JobSubmitter.java:166)
	at org.apache.hadoop.mapreduce.JobSubmitter.copyAndConfigureFiles(JobSubmitter.java:283)
	at org.apache.hadoop.mapreduce.JobSubmitter.submitJobInternal(JobSubmitter.java:350)
	at org.apache.hadoop.mapreduce.Job$2.run(Job.java:1037)
	at org.apache.hadoop.mapreduce.Job$2.run(Job.java:1034)
	at java.security.AccessController.doPrivileged(Native Method)
	at javax.security.auth.Subject.doAs(Subject.java:396)
	at org.apache.hadoop.security.UserGroupInformation.doAs(UserGroupInformation.java:1142)
	at org.apache.hadoop.mapreduce.Job.submit(Job.java:1034)
	at org.apache.hadoop.mapred.JobClient.submitJob(JobClient.java:536)
	at org.apache.hadoop.mapred.TestMapOutputType.__CLR3_0_2wob20ojp(TestMapOutputType.java:150)
	at org.apache.hadoop.mapred.TestMapOutputType.testNoMismatch(TestMapOutputType.java:143)


REGRESSION:  org.apache.hadoop.mapred.TestMapRed.testMapred

Error Message:
chmod: cannot access `/tmp/hadoop-hudson/mapred/staging/hudson-897937357/.staging/job_local_0001': No such file or directory 

Stack Trace:
org.apache.hadoop.util.Shell$ExitCodeException: chmod: cannot access `/tmp/hadoop-hudson/mapred/staging/hudson-897937357/.staging/job_local_0001': No such file or directory

	at org.apache.hadoop.util.Shell.runCommand(Shell.java:256)
	at org.apache.hadoop.util.Shell.run(Shell.java:183)
	at org.apache.hadoop.util.Shell$ShellCommandExecutor.execute(Shell.java:376)
	at org.apache.hadoop.util.Shell.execCommand(Shell.java:462)
	at org.apache.hadoop.util.Shell.execCommand(Shell.java:445)
	at org.apache.hadoop.fs.RawLocalFileSystem.execCommand(RawLocalFileSystem.java:560)
	at org.apache.hadoop.fs.RawLocalFileSystem.setPermission(RawLocalFileSystem.java:551)
	at org.apache.hadoop.fs.FilterFileSystem.setPermission(FilterFileSystem.java:343)
	at org.apache.hadoop.fs.FileSystem.mkdirs(FileSystem.java:410)
	at org.apache.hadoop.mapreduce.JobSubmitter.copyAndConfigureFiles(JobSubmitter.java:166)
	at org.apache.hadoop.mapreduce.JobSubmitter.copyAndConfigureFiles(JobSubmitter.java:283)
	at org.apache.hadoop.mapreduce.JobSubmitter.submitJobInternal(JobSubmitter.java:350)
	at org.apache.hadoop.mapreduce.Job$2.run(Job.java:1037)
	at org.apache.hadoop.mapreduce.Job$2.run(Job.java:1034)
	at java.security.AccessController.doPrivileged(Native Method)
	at javax.security.auth.Subject.doAs(Subject.java:396)
	at org.apache.hadoop.security.UserGroupInformation.doAs(UserGroupInformation.java:1142)
	at org.apache.hadoop.mapreduce.Job.submit(Job.java:1034)
	at org.apache.hadoop.mapred.JobClient.submitJob(JobClient.java:536)
	at org.apache.hadoop.mapred.JobClient.runJob(JobClient.java:781)
	at org.apache.hadoop.mapred.TestMapRed.launch(TestMapRed.java:522)
	at org.apache.hadoop.mapred.TestMapRed.__CLR3_0_2vmf1hqfke(TestMapRed.java:260)
	at org.apache.hadoop.mapred.TestMapRed.testMapred(TestMapRed.java:259)


REGRESSION:  org.apache.hadoop.mapred.TestMapRed.testNullKeys

Error Message:
chmod: cannot access `/tmp/hadoop-hudson/mapred/staging/hudson-812626770/.staging/job_local_0002': No such file or directory 

Stack Trace:
org.apache.hadoop.util.Shell$ExitCodeException: chmod: cannot access `/tmp/hadoop-hudson/mapred/staging/hudson-812626770/.staging/job_local_0002': No such file or directory

	at org.apache.hadoop.util.Shell.runCommand(Shell.java:256)
	at org.apache.hadoop.util.Shell.run(Shell.java:183)
	at org.apache.hadoop.util.Shell$ShellCommandExecutor.execute(Shell.java:376)
	at org.apache.hadoop.util.Shell.execCommand(Shell.java:462)
	at org.apache.hadoop.util.Shell.execCommand(Shell.java:445)
	at org.apache.hadoop.fs.RawLocalFileSystem.execCommand(RawLocalFileSystem.java:560)
	at org.apache.hadoop.fs.RawLocalFileSystem.setPermission(RawLocalFileSystem.java:551)
	at org.apache.hadoop.fs.FilterFileSystem.setPermission(FilterFileSystem.java:343)
	at org.apache.hadoop.fs.FileSystem.mkdirs(FileSystem.java:410)
	at org.apache.hadoop.mapreduce.JobSubmitter.copyAndConfigureFiles(JobSubmitter.java:166)
	at org.apache.hadoop.mapreduce.JobSubmitter.copyAndConfigureFiles(JobSubmitter.java:283)
	at org.apache.hadoop.mapreduce.JobSubmitter.submitJobInternal(JobSubmitter.java:350)
	at org.apache.hadoop.mapreduce.Job$2.run(Job.java:1037)
	at org.apache.hadoop.mapreduce.Job$2.run(Job.java:1034)
	at java.security.AccessController.doPrivileged(Native Method)
	at javax.security.auth.Subject.doAs(Subject.java:396)
	at org.apache.hadoop.security.UserGroupInformation.doAs(UserGroupInformation.java:1142)
	at org.apache.hadoop.mapreduce.Job.submit(Job.java:1034)
	at org.apache.hadoop.mapred.JobClient.submitJob(JobClient.java:536)
	at org.apache.hadoop.mapred.JobClient.runJob(JobClient.java:781)
	at org.apache.hadoop.mapred.TestMapRed.__CLR3_0_2i5a2rwfl5(TestMapRed.java:355)
	at org.apache.hadoop.mapred.TestMapRed.testNullKeys(TestMapRed.java:324)


REGRESSION:  org.apache.hadoop.mapred.TestMapRed.testCompression

Error Message:
chmod: cannot access `/tmp/hadoop-hudson/mapred/staging/hudson-1356682553/.staging/job_local_0003': No such file or directory 

Stack Trace:
org.apache.hadoop.util.Shell$ExitCodeException: chmod: cannot access `/tmp/hadoop-hudson/mapred/staging/hudson-1356682553/.staging/job_local_0003': No such file or directory

	at org.apache.hadoop.util.Shell.runCommand(Shell.java:256)
	at org.apache.hadoop.util.Shell.run(Shell.java:183)
	at org.apache.hadoop.util.Shell$ShellCommandExecutor.execute(Shell.java:376)
	at org.apache.hadoop.util.Shell.execCommand(Shell.java:462)
	at org.apache.hadoop.util.Shell.execCommand(Shell.java:445)
	at org.apache.hadoop.fs.RawLocalFileSystem.execCommand(RawLocalFileSystem.java:560)
	at org.apache.hadoop.fs.RawLocalFileSystem.setPermission(RawLocalFileSystem.java:551)
	at org.apache.hadoop.fs.FilterFileSystem.setPermission(FilterFileSystem.java:343)
	at org.apache.hadoop.fs.FileSystem.mkdirs(FileSystem.java:410)
	at org.apache.hadoop.mapreduce.JobSubmitter.copyAndConfigureFiles(JobSubmitter.java:166)
	at org.apache.hadoop.mapreduce.JobSubmitter.copyAndConfigureFiles(JobSubmitter.java:283)
	at org.apache.hadoop.mapreduce.JobSubmitter.submitJobInternal(JobSubmitter.java:350)
	at org.apache.hadoop.mapreduce.Job$2.run(Job.java:1037)
	at org.apache.hadoop.mapreduce.Job$2.run(Job.java:1034)
	at java.security.AccessController.doPrivileged(Native Method)
	at javax.security.auth.Subject.doAs(Subject.java:396)
	at org.apache.hadoop.security.UserGroupInformation.doAs(UserGroupInformation.java:1142)
	at org.apache.hadoop.mapreduce.Job.submit(Job.java:1034)
	at org.apache.hadoop.mapred.JobClient.submitJob(JobClient.java:536)
	at org.apache.hadoop.mapred.JobClient.runJob(JobClient.java:781)
	at org.apache.hadoop.mapred.TestMapRed.checkCompression(TestMapRed.java:403)
	at org.apache.hadoop.mapred.TestMapRed.__CLR3_0_2rawc05fne(TestMapRed.java:426)
	at org.apache.hadoop.mapred.TestMapRed.testCompression(TestMapRed.java:421)


REGRESSION:  org.apache.hadoop.mapred.TestMapRed.testSmallInput

Error Message:
Threw exception:org.apache.hadoop.util.Shell$ExitCodeException: chmod: cannot access `/tmp/hadoop-hudson/mapred/staging/hudson-100996368/.staging/job_local_0004': No such file or directory 

Stack Trace:
junit.framework.AssertionFailedError: Threw exception:org.apache.hadoop.util.Shell$ExitCodeException: chmod: cannot access `/tmp/hadoop-hudson/mapred/staging/hudson-100996368/.staging/job_local_0004': No such file or directory


	at org.apache.hadoop.mapred.TestMapRed.runJob(TestMapRed.java:765)
	at org.apache.hadoop.mapred.TestMapRed.__CLR3_0_29c506cfsj(TestMapRed.java:715)
	at org.apache.hadoop.mapred.TestMapRed.testSmallInput(TestMapRed.java:714)


REGRESSION:  org.apache.hadoop.mapred.TestMapRed.testBiggerInput

Error Message:
Threw exception:org.apache.hadoop.util.Shell$ExitCodeException: chmod: cannot access `/tmp/hadoop-hudson/mapred/staging/hudson-1015863751/.staging/job_local_0005': No such file or directory 

Stack Trace:
junit.framework.AssertionFailedError: Threw exception:org.apache.hadoop.util.Shell$ExitCodeException: chmod: cannot access `/tmp/hadoop-hudson/mapred/staging/hudson-1015863751/.staging/job_local_0005': No such file or directory


	at org.apache.hadoop.mapred.TestMapRed.runJob(TestMapRed.java:765)
	at org.apache.hadoop.mapred.TestMapRed.__CLR3_0_22j0llhfsl(TestMapRed.java:720)
	at org.apache.hadoop.mapred.TestMapRed.testBiggerInput(TestMapRed.java:719)


REGRESSION:  org.apache.hadoop.mapred.TestTaskCommit.testCommitFail

Error Message:
chmod: cannot access `/tmp/hadoop-hudson/mapred/staging/hudson-177828573/.staging/job_local_0001': No such file or directory 

Stack Trace:
org.apache.hadoop.util.Shell$ExitCodeException: chmod: cannot access `/tmp/hadoop-hudson/mapred/staging/hudson-177828573/.staging/job_local_0001': No such file or directory

	at org.apache.hadoop.util.Shell.runCommand(Shell.java:256)
	at org.apache.hadoop.util.Shell.run(Shell.java:183)
	at org.apache.hadoop.util.Shell$ShellCommandExecutor.execute(Shell.java:376)
	at org.apache.hadoop.util.Shell.execCommand(Shell.java:462)
	at org.apache.hadoop.util.Shell.execCommand(Shell.java:445)
	at org.apache.hadoop.fs.RawLocalFileSystem.execCommand(RawLocalFileSystem.java:560)
	at org.apache.hadoop.fs.RawLocalFileSystem.setPermission(RawLocalFileSystem.java:551)
	at org.apache.hadoop.fs.FilterFileSystem.setPermission(FilterFileSystem.java:343)
	at org.apache.hadoop.fs.FileSystem.mkdirs(FileSystem.java:410)
	at org.apache.hadoop.mapreduce.JobSubmitter.copyAndConfigureFiles(JobSubmitter.java:166)
	at org.apache.hadoop.mapreduce.JobSubmitter.copyAndConfigureFiles(JobSubmitter.java:283)
	at org.apache.hadoop.mapreduce.JobSubmitter.submitJobInternal(JobSubmitter.java:350)
	at org.apache.hadoop.mapreduce.Job$2.run(Job.java:1037)
	at org.apache.hadoop.mapreduce.Job$2.run(Job.java:1034)
	at java.security.AccessController.doPrivileged(Native Method)
	at javax.security.auth.Subject.doAs(Subject.java:396)
	at org.apache.hadoop.security.UserGroupInformation.doAs(UserGroupInformation.java:1142)
	at org.apache.hadoop.mapreduce.Job.submit(Job.java:1034)
	at org.apache.hadoop.mapred.JobClient.submitJob(JobClient.java:536)
	at org.apache.hadoop.mapred.UtilsForTests.runJob(UtilsForTests.java:587)
	at org.apache.hadoop.mapred.TestTaskCommit.__CLR3_0_222imwin03(TestTaskCommit.java:90)
	at org.apache.hadoop.mapred.TestTaskCommit.testCommitFail(TestTaskCommit.java:84)


REGRESSION:  org.apache.hadoop.mapred.TestUserDefinedCounters.testMapReduceJob

Error Message:
chmod: cannot access `/tmp/hadoop-hudson/mapred/staging/hudson396004612/.staging/job_local_0001': No such file or directory 

Stack Trace:
org.apache.hadoop.util.Shell$ExitCodeException: chmod: cannot access `/tmp/hadoop-hudson/mapred/staging/hudson396004612/.staging/job_local_0001': No such file or directory

	at org.apache.hadoop.util.Shell.runCommand(Shell.java:256)
	at org.apache.hadoop.util.Shell.run(Shell.java:183)
	at org.apache.hadoop.util.Shell$ShellCommandExecutor.execute(Shell.java:376)
	at org.apache.hadoop.util.Shell.execCommand(Shell.java:462)
	at org.apache.hadoop.util.Shell.execCommand(Shell.java:445)
	at org.apache.hadoop.fs.RawLocalFileSystem.execCommand(RawLocalFileSystem.java:560)
	at org.apache.hadoop.fs.RawLocalFileSystem.setPermission(RawLocalFileSystem.java:551)
	at org.apache.hadoop.fs.FilterFileSystem.setPermission(FilterFileSystem.java:343)
	at org.apache.hadoop.fs.FileSystem.mkdirs(FileSystem.java:410)
	at org.apache.hadoop.mapreduce.JobSubmitter.copyAndConfigureFiles(JobSubmitter.java:166)
	at org.apache.hadoop.mapreduce.JobSubmitter.copyAndConfigureFiles(JobSubmitter.java:283)
	at org.apache.hadoop.mapreduce.JobSubmitter.submitJobInternal(JobSubmitter.java:350)
	at org.apache.hadoop.mapreduce.Job$2.run(Job.java:1037)
	at org.apache.hadoop.mapreduce.Job$2.run(Job.java:1034)
	at java.security.AccessController.doPrivileged(Native Method)
	at javax.security.auth.Subject.doAs(Subject.java:396)
	at org.apache.hadoop.security.UserGroupInformation.doAs(UserGroupInformation.java:1142)
	at org.apache.hadoop.mapreduce.Job.submit(Job.java:1034)
	at org.apache.hadoop.mapred.JobClient.submitJob(JobClient.java:536)
	at org.apache.hadoop.mapred.JobClient.runJob(JobClient.java:781)
	at org.apache.hadoop.mapred.TestUserDefinedCounters.__CLR3_0_2nmr1sklbl(TestUserDefinedCounters.java:101)
	at org.apache.hadoop.mapred.TestUserDefinedCounters.testMapReduceJob(TestUserDefinedCounters.java:77)


REGRESSION:  org.apache.hadoop.mapred.jobcontrol.TestLocalJobControl.testLocalJobControlDataCopy

Error Message:
Some jobs failed expected:<0> but was:<4>

Stack Trace:
junit.framework.AssertionFailedError: Some jobs failed expected:<0> but was:<4>
	at org.apache.hadoop.mapred.jobcontrol.TestLocalJobControl.__CLR3_0_22dofof7wh(TestLocalJobControl.java:131)
	at org.apache.hadoop.mapred.jobcontrol.TestLocalJobControl.testLocalJobControlDataCopy(TestLocalJobControl.java:62)


REGRESSION:  org.apache.hadoop.mapred.join.TestDatamerge.testSimpleInnerJoin

Error Message:
chmod: cannot access `/tmp/hadoop-hudson/mapred/staging/hudson-816145480/.staging/job_local_0001': No such file or directory 

Stack Trace:
org.apache.hadoop.util.Shell$ExitCodeException: chmod: cannot access `/tmp/hadoop-hudson/mapred/staging/hudson-816145480/.staging/job_local_0001': No such file or directory

	at org.apache.hadoop.util.Shell.runCommand(Shell.java:256)
	at org.apache.hadoop.util.Shell.run(Shell.java:183)
	at org.apache.hadoop.util.Shell$ShellCommandExecutor.execute(Shell.java:376)
	at org.apache.hadoop.util.Shell.execCommand(Shell.java:462)
	at org.apache.hadoop.util.Shell.execCommand(Shell.java:445)
	at org.apache.hadoop.fs.RawLocalFileSystem.execCommand(RawLocalFileSystem.java:560)
	at org.apache.hadoop.fs.RawLocalFileSystem.setPermission(RawLocalFileSystem.java:551)
	at org.apache.hadoop.fs.FilterFileSystem.setPermission(FilterFileSystem.java:343)
	at org.apache.hadoop.fs.FileSystem.mkdirs(FileSystem.java:410)
	at org.apache.hadoop.mapreduce.JobSubmitter.copyAndConfigureFiles(JobSubmitter.java:166)
	at org.apache.hadoop.mapreduce.JobSubmitter.copyAndConfigureFiles(JobSubmitter.java:283)
	at org.apache.hadoop.mapreduce.JobSubmitter.submitJobInternal(JobSubmitter.java:350)
	at org.apache.hadoop.mapreduce.Job$2.run(Job.java:1037)
	at org.apache.hadoop.mapreduce.Job$2.run(Job.java:1034)
	at java.security.AccessController.doPrivileged(Native Method)
	at javax.security.auth.Subject.doAs(Subject.java:396)
	at org.apache.hadoop.security.UserGroupInformation.doAs(UserGroupInformation.java:1142)
	at org.apache.hadoop.mapreduce.Job.submit(Job.java:1034)
	at org.apache.hadoop.mapred.JobClient.submitJob(JobClient.java:536)
	at org.apache.hadoop.mapred.JobClient.runJob(JobClient.java:781)
	at org.apache.hadoop.mapred.join.TestDatamerge.joinAs(TestDatamerge.java:245)
	at org.apache.hadoop.mapred.join.TestDatamerge.__CLR3_0_239fxnhwdi(TestDatamerge.java:250)
	at org.apache.hadoop.mapred.join.TestDatamerge.testSimpleInnerJoin(TestDatamerge.java:249)
	at junit.extensions.TestDecorator.basicRun(TestDecorator.java:24)
	at junit.extensions.TestSetup$1.protect(TestSetup.java:23)
	at junit.extensions.TestSetup.run(TestSetup.java:27)


REGRESSION:  org.apache.hadoop.mapred.join.TestDatamerge.testSimpleOuterJoin

Error Message:
chmod: cannot access `/tmp/hadoop-hudson/mapred/staging/hudson-202346048/.staging/job_local_0002': No such file or directory 

Stack Trace:
org.apache.hadoop.util.Shell$ExitCodeException: chmod: cannot access `/tmp/hadoop-hudson/mapred/staging/hudson-202346048/.staging/job_local_0002': No such file or directory

	at org.apache.hadoop.util.Shell.runCommand(Shell.java:256)
	at org.apache.hadoop.util.Shell.run(Shell.java:183)
	at org.apache.hadoop.util.Shell$ShellCommandExecutor.execute(Shell.java:376)
	at org.apache.hadoop.util.Shell.execCommand(Shell.java:462)
	at org.apache.hadoop.util.Shell.execCommand(Shell.java:445)
	at org.apache.hadoop.fs.RawLocalFileSystem.execCommand(RawLocalFileSystem.java:560)
	at org.apache.hadoop.fs.RawLocalFileSystem.setPermission(RawLocalFileSystem.java:551)
	at org.apache.hadoop.fs.FilterFileSystem.setPermission(FilterFileSystem.java:343)
	at org.apache.hadoop.fs.FileSystem.mkdirs(FileSystem.java:410)
	at org.apache.hadoop.mapreduce.JobSubmitter.copyAndConfigureFiles(JobSubmitter.java:166)
	at org.apache.hadoop.mapreduce.JobSubmitter.copyAndConfigureFiles(JobSubmitter.java:283)
	at org.apache.hadoop.mapreduce.JobSubmitter.submitJobInternal(JobSubmitter.java:350)
	at org.apache.hadoop.mapreduce.Job$2.run(Job.java:1037)
	at org.apache.hadoop.mapreduce.Job$2.run(Job.java:1034)
	at java.security.AccessController.doPrivileged(Native Method)
	at javax.security.auth.Subject.doAs(Subject.java:396)
	at org.apache.hadoop.security.UserGroupInformation.doAs(UserGroupInformation.java:1142)
	at org.apache.hadoop.mapreduce.Job.submit(Job.java:1034)
	at org.apache.hadoop.mapred.JobClient.submitJob(JobClient.java:536)
	at org.apache.hadoop.mapred.JobClient.runJob(JobClient.java:781)
	at org.apache.hadoop.mapred.join.TestDatamerge.joinAs(TestDatamerge.java:245)
	at org.apache.hadoop.mapred.join.TestDatamerge.__CLR3_0_2abzcwowdk(TestDatamerge.java:254)
	at org.apache.hadoop.mapred.join.TestDatamerge.testSimpleOuterJoin(TestDatamerge.java:253)
	at junit.extensions.TestDecorator.basicRun(TestDecorator.java:24)
	at junit.extensions.TestSetup$1.protect(TestSetup.java:23)
	at junit.extensions.TestSetup.run(TestSetup.java:27)


REGRESSION:  org.apache.hadoop.mapred.join.TestDatamerge.testSimpleOverride

Error Message:
chmod: cannot access `/tmp/hadoop-hudson/mapred/staging/hudson301735874/.staging/job_local_0003': No such file or directory 

Stack Trace:
org.apache.hadoop.util.Shell$ExitCodeException: chmod: cannot access `/tmp/hadoop-hudson/mapred/staging/hudson301735874/.staging/job_local_0003': No such file or directory

	at org.apache.hadoop.util.Shell.runCommand(Shell.java:256)
	at org.apache.hadoop.util.Shell.run(Shell.java:183)
	at org.apache.hadoop.util.Shell$ShellCommandExecutor.execute(Shell.java:376)
	at org.apache.hadoop.util.Shell.execCommand(Shell.java:462)
	at org.apache.hadoop.util.Shell.execCommand(Shell.java:445)
	at org.apache.hadoop.fs.RawLocalFileSystem.execCommand(RawLocalFileSystem.java:560)
	at org.apache.hadoop.fs.RawLocalFileSystem.setPermission(RawLocalFileSystem.java:551)
	at org.apache.hadoop.fs.FilterFileSystem.setPermission(FilterFileSystem.java:343)
	at org.apache.hadoop.fs.FileSystem.mkdirs(FileSystem.java:410)
	at org.apache.hadoop.mapreduce.JobSubmitter.copyAndConfigureFiles(JobSubmitter.java:166)
	at org.apache.hadoop.mapreduce.JobSubmitter.copyAndConfigureFiles(JobSubmitter.java:283)
	at org.apache.hadoop.mapreduce.JobSubmitter.submitJobInternal(JobSubmitter.java:350)
	at org.apache.hadoop.mapreduce.Job$2.run(Job.java:1037)
	at org.apache.hadoop.mapreduce.Job$2.run(Job.java:1034)
	at java.security.AccessController.doPrivileged(Native Method)
	at javax.security.auth.Subject.doAs(Subject.java:396)
	at org.apache.hadoop.security.UserGroupInformation.doAs(UserGroupInformation.java:1142)
	at org.apache.hadoop.mapreduce.Job.submit(Job.java:1034)
	at org.apache.hadoop.mapred.JobClient.submitJob(JobClient.java:536)
	at org.apache.hadoop.mapred.JobClient.runJob(JobClient.java:781)
	at org.apache.hadoop.mapred.join.TestDatamerge.joinAs(TestDatamerge.java:245)
	at org.apache.hadoop.mapred.join.TestDatamerge.__CLR3_0_2a19allwdm(TestDatamerge.java:258)
	at org.apache.hadoop.mapred.join.TestDatamerge.testSimpleOverride(TestDatamerge.java:257)
	at junit.extensions.TestDecorator.basicRun(TestDecorator.java:24)
	at junit.extensions.TestSetup$1.protect(TestSetup.java:23)
	at junit.extensions.TestSetup.run(TestSetup.java:27)


REGRESSION:  org.apache.hadoop.mapred.join.TestDatamerge.testNestedJoin

Error Message:
chmod: cannot access `/tmp/hadoop-hudson/mapred/staging/hudson2014396694/.staging/job_local_0004': No such file or directory 

Stack Trace:
org.apache.hadoop.util.Shell$ExitCodeException: chmod: cannot access `/tmp/hadoop-hudson/mapred/staging/hudson2014396694/.staging/job_local_0004': No such file or directory

	at org.apache.hadoop.util.Shell.runCommand(Shell.java:256)
	at org.apache.hadoop.util.Shell.run(Shell.java:183)
	at org.apache.hadoop.util.Shell$ShellCommandExecutor.execute(Shell.java:376)
	at org.apache.hadoop.util.Shell.execCommand(Shell.java:462)
	at org.apache.hadoop.util.Shell.execCommand(Shell.java:445)
	at org.apache.hadoop.fs.RawLocalFileSystem.execCommand(RawLocalFileSystem.java:560)
	at org.apache.hadoop.fs.RawLocalFileSystem.setPermission(RawLocalFileSystem.java:551)
	at org.apache.hadoop.fs.FilterFileSystem.setPermission(FilterFileSystem.java:343)
	at org.apache.hadoop.fs.FileSystem.mkdirs(FileSystem.java:410)
	at org.apache.hadoop.mapreduce.JobSubmitter.copyAndConfigureFiles(JobSubmitter.java:166)
	at org.apache.hadoop.mapreduce.JobSubmitter.copyAndConfigureFiles(JobSubmitter.java:283)
	at org.apache.hadoop.mapreduce.JobSubmitter.submitJobInternal(JobSubmitter.java:350)
	at org.apache.hadoop.mapreduce.Job$2.run(Job.java:1037)
	at org.apache.hadoop.mapreduce.Job$2.run(Job.java:1034)
	at java.security.AccessController.doPrivileged(Native Method)
	at javax.security.auth.Subject.doAs(Subject.java:396)
	at org.apache.hadoop.security.UserGroupInformation.doAs(UserGroupInformation.java:1142)
	at org.apache.hadoop.mapreduce.Job.submit(Job.java:1034)
	at org.apache.hadoop.mapred.JobClient.submitJob(JobClient.java:536)
	at org.apache.hadoop.mapred.JobClient.runJob(JobClient.java:781)
	at org.apache.hadoop.mapred.join.TestDatamerge.__CLR3_0_2fidujewdo(TestDatamerge.java:319)
	at org.apache.hadoop.mapred.join.TestDatamerge.testNestedJoin(TestDatamerge.java:261)
	at junit.extensions.TestDecorator.basicRun(TestDecorator.java:24)
	at junit.extensions.TestSetup$1.protect(TestSetup.java:23)
	at junit.extensions.TestSetup.run(TestSetup.java:27)


REGRESSION:  org.apache.hadoop.mapred.join.TestDatamerge.testEmptyJoin

Error Message:
chmod: cannot access `/tmp/hadoop-hudson/mapred/staging/hudson-537425228/.staging/job_local_0005': No such file or directory 

Stack Trace:
org.apache.hadoop.util.Shell$ExitCodeException: chmod: cannot access `/tmp/hadoop-hudson/mapred/staging/hudson-537425228/.staging/job_local_0005': No such file or directory

	at org.apache.hadoop.util.Shell.runCommand(Shell.java:256)
	at org.apache.hadoop.util.Shell.run(Shell.java:183)
	at org.apache.hadoop.util.Shell$ShellCommandExecutor.execute(Shell.java:376)
	at org.apache.hadoop.util.Shell.execCommand(Shell.java:462)
	at org.apache.hadoop.util.Shell.execCommand(Shell.java:445)
	at org.apache.hadoop.fs.RawLocalFileSystem.execCommand(RawLocalFileSystem.java:560)
	at org.apache.hadoop.fs.RawLocalFileSystem.setPermission(RawLocalFileSystem.java:551)
	at org.apache.hadoop.fs.FilterFileSystem.setPermission(FilterFileSystem.java:343)
	at org.apache.hadoop.fs.FileSystem.mkdirs(FileSystem.java:410)
	at org.apache.hadoop.mapreduce.JobSubmitter.copyAndConfigureFiles(JobSubmitter.java:166)
	at org.apache.hadoop.mapreduce.JobSubmitter.copyAndConfigureFiles(JobSubmitter.java:283)
	at org.apache.hadoop.mapreduce.JobSubmitter.submitJobInternal(JobSubmitter.java:350)
	at org.apache.hadoop.mapreduce.Job$2.run(Job.java:1037)
	at org.apache.hadoop.mapreduce.Job$2.run(Job.java:1034)
	at java.security.AccessController.doPrivileged(Native Method)
	at javax.security.auth.Subject.doAs(Subject.java:396)
	at org.apache.hadoop.security.UserGroupInformation.doAs(UserGroupInformation.java:1142)
	at org.apache.hadoop.mapreduce.Job.submit(Job.java:1034)
	at org.apache.hadoop.mapred.JobClient.submitJob(JobClient.java:536)
	at org.apache.hadoop.mapred.JobClient.runJob(JobClient.java:781)
	at org.apache.hadoop.mapred.join.TestDatamerge.__CLR3_0_2f6b0b0wg8(TestDatamerge.java:367)
	at org.apache.hadoop.mapred.join.TestDatamerge.testEmptyJoin(TestDatamerge.java:353)
	at junit.extensions.TestDecorator.basicRun(TestDecorator.java:24)
	at junit.extensions.TestSetup$1.protect(TestSetup.java:23)
	at junit.extensions.TestSetup.run(TestSetup.java:27)


REGRESSION:  org.apache.hadoop.mapred.lib.TestChainMapReduce.testChain

Error Message:
chmod: cannot access `/tmp/hadoop-hudson/mapred/staging/hudson-500781299/.staging/job_local_0001': No such file or directory 

Stack Trace:
org.apache.hadoop.util.Shell$ExitCodeException: chmod: cannot access `/tmp/hadoop-hudson/mapred/staging/hudson-500781299/.staging/job_local_0001': No such file or directory

	at org.apache.hadoop.util.Shell.runCommand(Shell.java:256)
	at org.apache.hadoop.util.Shell.run(Shell.java:183)
	at org.apache.hadoop.util.Shell$ShellCommandExecutor.execute(Shell.java:376)
	at org.apache.hadoop.util.Shell.execCommand(Shell.java:462)
	at org.apache.hadoop.util.Shell.execCommand(Shell.java:445)
	at org.apache.hadoop.fs.RawLocalFileSystem.execCommand(RawLocalFileSystem.java:560)
	at org.apache.hadoop.fs.RawLocalFileSystem.setPermission(RawLocalFileSystem.java:551)
	at org.apache.hadoop.fs.FilterFileSystem.setPermission(FilterFileSystem.java:343)
	at org.apache.hadoop.fs.FileSystem.mkdirs(FileSystem.java:410)
	at org.apache.hadoop.mapreduce.JobSubmitter.copyAndConfigureFiles(JobSubmitter.java:166)
	at org.apache.hadoop.mapreduce.JobSubmitter.copyAndConfigureFiles(JobSubmitter.java:283)
	at org.apache.hadoop.mapreduce.JobSubmitter.submitJobInternal(JobSubmitter.java:350)
	at org.apache.hadoop.mapreduce.Job$2.run(Job.java:1037)
	at org.apache.hadoop.mapreduce.Job$2.run(Job.java:1034)
	at java.security.AccessController.doPrivileged(Native Method)
	at javax.security.auth.Subject.doAs(Subject.java:396)
	at org.apache.hadoop.security.UserGroupInformation.doAs(UserGroupInformation.java:1142)
	at org.apache.hadoop.mapreduce.Job.submit(Job.java:1034)
	at org.apache.hadoop.mapred.JobClient.submitJob(JobClient.java:536)
	at org.apache.hadoop.mapred.lib.TestChainMapReduce.__CLR3_0_2ke5z1y7pt(TestChainMapReduce.java:130)
	at org.apache.hadoop.mapred.lib.TestChainMapReduce.testChain(TestChainMapReduce.java:70)


REGRESSION:  org.apache.hadoop.mapred.lib.TestKeyFieldBasedComparator.testBasicUnixComparator

Error Message:
chmod: cannot access `/tmp/hadoop-hudson/mapred/staging/hudson-653271147/.staging/job_local_0001': No such file or directory 

Stack Trace:
org.apache.hadoop.util.Shell$ExitCodeException: chmod: cannot access `/tmp/hadoop-hudson/mapred/staging/hudson-653271147/.staging/job_local_0001': No such file or directory

	at org.apache.hadoop.util.Shell.runCommand(Shell.java:256)
	at org.apache.hadoop.util.Shell.run(Shell.java:183)
	at org.apache.hadoop.util.Shell$ShellCommandExecutor.execute(Shell.java:376)
	at org.apache.hadoop.util.Shell.execCommand(Shell.java:462)
	at org.apache.hadoop.util.Shell.execCommand(Shell.java:445)
	at org.apache.hadoop.fs.RawLocalFileSystem.execCommand(RawLocalFileSystem.java:560)
	at org.apache.hadoop.fs.RawLocalFileSystem.setPermission(RawLocalFileSystem.java:551)
	at org.apache.hadoop.fs.FilterFileSystem.setPermission(FilterFileSystem.java:343)
	at org.apache.hadoop.fs.FileSystem.mkdirs(FileSystem.java:410)
	at org.apache.hadoop.mapreduce.JobSubmitter.copyAndConfigureFiles(JobSubmitter.java:166)
	at org.apache.hadoop.mapreduce.JobSubmitter.copyAndConfigureFiles(JobSubmitter.java:283)
	at org.apache.hadoop.mapreduce.JobSubmitter.submitJobInternal(JobSubmitter.java:350)
	at org.apache.hadoop.mapreduce.Job$2.run(Job.java:1037)
	at org.apache.hadoop.mapreduce.Job$2.run(Job.java:1034)
	at java.security.AccessController.doPrivileged(Native Method)
	at javax.security.auth.Subject.doAs(Subject.java:396)
	at org.apache.hadoop.security.UserGroupInformation.doAs(UserGroupInformation.java:1142)
	at org.apache.hadoop.mapreduce.Job.submit(Job.java:1034)
	at org.apache.hadoop.mapred.JobClient.submitJob(JobClient.java:536)
	at org.apache.hadoop.mapred.lib.TestKeyFieldBasedComparator.configure(TestKeyFieldBasedComparator.java:88)
	at org.apache.hadoop.mapred.lib.TestKeyFieldBasedComparator.__CLR3_0_2efq8in9kq(TestKeyFieldBasedComparator.java:122)
	at org.apache.hadoop.mapred.lib.TestKeyFieldBasedComparator.testBasicUnixComparator(TestKeyFieldBasedComparator.java:121)


REGRESSION:  org.apache.hadoop.mapred.lib.TestMultipleOutputs.testWithoutCounters

Error Message:
chmod: cannot access `/tmp/hadoop-hudson/mapred/staging/hudson717966960/.staging/job_local_0001': No such file or directory 

Stack Trace:
org.apache.hadoop.util.Shell$ExitCodeException: chmod: cannot access `/tmp/hadoop-hudson/mapred/staging/hudson717966960/.staging/job_local_0001': No such file or directory

	at org.apache.hadoop.util.Shell.runCommand(Shell.java:256)
	at org.apache.hadoop.util.Shell.run(Shell.java:183)
	at org.apache.hadoop.util.Shell$ShellCommandExecutor.execute(Shell.java:376)
	at org.apache.hadoop.util.Shell.execCommand(Shell.java:462)
	at org.apache.hadoop.util.Shell.execCommand(Shell.java:445)
	at org.apache.hadoop.fs.RawLocalFileSystem.execCommand(RawLocalFileSystem.java:560)
	at org.apache.hadoop.fs.RawLocalFileSystem.setPermission(RawLocalFileSystem.java:551)
	at org.apache.hadoop.fs.FilterFileSystem.setPermission(FilterFileSystem.java:343)
	at org.apache.hadoop.fs.FileSystem.mkdirs(FileSystem.java:410)
	at org.apache.hadoop.mapreduce.JobSubmitter.copyAndConfigureFiles(JobSubmitter.java:166)
	at org.apache.hadoop.mapreduce.JobSubmitter.copyAndConfigureFiles(JobSubmitter.java:283)
	at org.apache.hadoop.mapreduce.JobSubmitter.submitJobInternal(JobSubmitter.java:350)
	at org.apache.hadoop.mapreduce.Job$2.run(Job.java:1037)
	at org.apache.hadoop.mapreduce.Job$2.run(Job.java:1034)
	at java.security.AccessController.doPrivileged(Native Method)
	at javax.security.auth.Subject.doAs(Subject.java:396)
	at org.apache.hadoop.security.UserGroupInformation.doAs(UserGroupInformation.java:1142)
	at org.apache.hadoop.mapreduce.Job.submit(Job.java:1034)
	at org.apache.hadoop.mapred.JobClient.submitJob(JobClient.java:536)
	at org.apache.hadoop.mapred.lib.TestMultipleOutputs._testMultipleOutputs(TestMultipleOutputs.java:126)
	at org.apache.hadoop.mapred.lib.TestMultipleOutputs.__CLR3_0_27rxkdof06(TestMultipleOutputs.java:41)
	at org.apache.hadoop.mapred.lib.TestMultipleOutputs.testWithoutCounters(TestMultipleOutputs.java:40)


REGRESSION:  org.apache.hadoop.mapred.lib.TestMultipleOutputs.testWithCounters

Error Message:
chmod: cannot access `/tmp/hadoop-hudson/mapred/staging/hudson229545865/.staging/job_local_0002': No such file or directory 

Stack Trace:
org.apache.hadoop.util.Shell$ExitCodeException: chmod: cannot access `/tmp/hadoop-hudson/mapred/staging/hudson229545865/.staging/job_local_0002': No such file or directory

	at org.apache.hadoop.util.Shell.runCommand(Shell.java:256)
	at org.apache.hadoop.util.Shell.run(Shell.java:183)
	at org.apache.hadoop.util.Shell$ShellCommandExecutor.execute(Shell.java:376)
	at org.apache.hadoop.util.Shell.execCommand(Shell.java:462)
	at org.apache.hadoop.util.Shell.execCommand(Shell.java:445)
	at org.apache.hadoop.fs.RawLocalFileSystem.execCommand(RawLocalFileSystem.java:560)
	at org.apache.hadoop.fs.RawLocalFileSystem.setPermission(RawLocalFileSystem.java:551)
	at org.apache.hadoop.fs.FilterFileSystem.setPermission(FilterFileSystem.java:343)
	at org.apache.hadoop.fs.FileSystem.mkdirs(FileSystem.java:410)
	at org.apache.hadoop.mapreduce.JobSubmitter.copyAndConfigureFiles(JobSubmitter.java:166)
	at org.apache.hadoop.mapreduce.JobSubmitter.copyAndConfigureFiles(JobSubmitter.java:283)
	at org.apache.hadoop.mapreduce.JobSubmitter.submitJobInternal(JobSubmitter.java:350)
	at org.apache.hadoop.mapreduce.Job$2.run(Job.java:1037)
	at org.apache.hadoop.mapreduce.Job$2.run(Job.java:1034)
	at java.security.AccessController.doPrivileged(Native Method)
	at javax.security.auth.Subject.doAs(Subject.java:396)
	at org.apache.hadoop.security.UserGroupInformation.doAs(UserGroupInformation.java:1142)
	at org.apache.hadoop.mapreduce.Job.submit(Job.java:1034)
	at org.apache.hadoop.mapred.JobClient.submitJob(JobClient.java:536)
	at org.apache.hadoop.mapred.lib.TestMultipleOutputs._testMultipleOutputs(TestMultipleOutputs.java:126)
	at org.apache.hadoop.mapred.lib.TestMultipleOutputs.__CLR3_0_2435lo6f08(TestMultipleOutputs.java:45)
	at org.apache.hadoop.mapred.lib.TestMultipleOutputs.testWithCounters(TestMultipleOutputs.java:44)


REGRESSION:  org.apache.hadoop.mapred.lib.TestMultithreadedMapRunner.testOKRun

Error Message:
chmod: cannot access `/tmp/hadoop-hudson/mapred/staging/hudson-343774653/.staging/job_local_0001': No such file or directory 

Stack Trace:
org.apache.hadoop.util.Shell$ExitCodeException: chmod: cannot access `/tmp/hadoop-hudson/mapred/staging/hudson-343774653/.staging/job_local_0001': No such file or directory

	at org.apache.hadoop.util.Shell.runCommand(Shell.java:256)
	at org.apache.hadoop.util.Shell.run(Shell.java:183)
	at org.apache.hadoop.util.Shell$ShellCommandExecutor.execute(Shell.java:376)
	at org.apache.hadoop.util.Shell.execCommand(Shell.java:462)
	at org.apache.hadoop.util.Shell.execCommand(Shell.java:445)
	at org.apache.hadoop.fs.RawLocalFileSystem.execCommand(RawLocalFileSystem.java:560)
	at org.apache.hadoop.fs.RawLocalFileSystem.setPermission(RawLocalFileSystem.java:551)
	at org.apache.hadoop.fs.FilterFileSystem.setPermission(FilterFileSystem.java:343)
	at org.apache.hadoop.fs.FileSystem.mkdirs(FileSystem.java:410)
	at org.apache.hadoop.mapreduce.JobSubmitter.copyAndConfigureFiles(JobSubmitter.java:166)
	at org.apache.hadoop.mapreduce.JobSubmitter.copyAndConfigureFiles(JobSubmitter.java:283)
	at org.apache.hadoop.mapreduce.JobSubmitter.submitJobInternal(JobSubmitter.java:350)
	at org.apache.hadoop.mapreduce.Job$2.run(Job.java:1037)
	at org.apache.hadoop.mapreduce.Job$2.run(Job.java:1034)
	at java.security.AccessController.doPrivileged(Native Method)
	at javax.security.auth.Subject.doAs(Subject.java:396)
	at org.apache.hadoop.security.UserGroupInformation.doAs(UserGroupInformation.java:1142)
	at org.apache.hadoop.mapreduce.Job.submit(Job.java:1034)
	at org.apache.hadoop.mapred.JobClient.submitJob(JobClient.java:536)
	at org.apache.hadoop.mapred.lib.TestMultithreadedMapRunner.run(TestMultithreadedMapRunner.java:105)
	at org.apache.hadoop.mapred.lib.TestMultithreadedMapRunner.__CLR3_0_2dhspyclcn(TestMultithreadedMapRunner.java:39)
	at org.apache.hadoop.mapred.lib.TestMultithreadedMapRunner.testOKRun(TestMultithreadedMapRunner.java:38)


REGRESSION:  org.apache.hadoop.mapred.lib.TestMultithreadedMapRunner.testIOExRun

Error Message:
chmod: cannot access `/tmp/hadoop-hudson/mapred/staging/hudson1237188490/.staging/job_local_0002': No such file or directory 

Stack Trace:
org.apache.hadoop.util.Shell$ExitCodeException: chmod: cannot access `/tmp/hadoop-hudson/mapred/staging/hudson1237188490/.staging/job_local_0002': No such file or directory

	at org.apache.hadoop.util.Shell.runCommand(Shell.java:256)
	at org.apache.hadoop.util.Shell.run(Shell.java:183)
	at org.apache.hadoop.util.Shell$ShellCommandExecutor.execute(Shell.java:376)
	at org.apache.hadoop.util.Shell.execCommand(Shell.java:462)
	at org.apache.hadoop.util.Shell.execCommand(Shell.java:445)
	at org.apache.hadoop.fs.RawLocalFileSystem.execCommand(RawLocalFileSystem.java:560)
	at org.apache.hadoop.fs.RawLocalFileSystem.setPermission(RawLocalFileSystem.java:551)
	at org.apache.hadoop.fs.FilterFileSystem.setPermission(FilterFileSystem.java:343)
	at org.apache.hadoop.fs.FileSystem.mkdirs(FileSystem.java:410)
	at org.apache.hadoop.mapreduce.JobSubmitter.copyAndConfigureFiles(JobSubmitter.java:166)
	at org.apache.hadoop.mapreduce.JobSubmitter.copyAndConfigureFiles(JobSubmitter.java:283)
	at org.apache.hadoop.mapreduce.JobSubmitter.submitJobInternal(JobSubmitter.java:350)
	at org.apache.hadoop.mapreduce.Job$2.run(Job.java:1037)
	at org.apache.hadoop.mapreduce.Job$2.run(Job.java:1034)
	at java.security.AccessController.doPrivileged(Native Method)
	at javax.security.auth.Subject.doAs(Subject.java:396)
	at org.apache.hadoop.security.UserGroupInformation.doAs(UserGroupInformation.java:1142)
	at org.apache.hadoop.mapreduce.Job.submit(Job.java:1034)
	at org.apache.hadoop.mapred.JobClient.submitJob(JobClient.java:536)
	at org.apache.hadoop.mapred.lib.TestMultithreadedMapRunner.run(TestMultithreadedMapRunner.java:105)
	at org.apache.hadoop.mapred.lib.TestMultithreadedMapRunner.__CLR3_0_21nnwsnlcp(TestMultithreadedMapRunner.java:43)
	at org.apache.hadoop.mapred.lib.TestMultithreadedMapRunner.testIOExRun(TestMultithreadedMapRunner.java:42)


REGRESSION:  org.apache.hadoop.mapred.lib.TestMultithreadedMapRunner.testRuntimeExRun

Error Message:
chmod: cannot access `/tmp/hadoop-hudson/mapred/staging/hudson-1111891911/.staging/job_local_0003': No such file or directory 

Stack Trace:
org.apache.hadoop.util.Shell$ExitCodeException: chmod: cannot access `/tmp/hadoop-hudson/mapred/staging/hudson-1111891911/.staging/job_local_0003': No such file or directory

	at org.apache.hadoop.util.Shell.runCommand(Shell.java:256)
	at org.apache.hadoop.util.Shell.run(Shell.java:183)
	at org.apache.hadoop.util.Shell$ShellCommandExecutor.execute(Shell.java:376)
	at org.apache.hadoop.util.Shell.execCommand(Shell.java:462)
	at org.apache.hadoop.util.Shell.execCommand(Shell.java:445)
	at org.apache.hadoop.fs.RawLocalFileSystem.execCommand(RawLocalFileSystem.java:560)
	at org.apache.hadoop.fs.RawLocalFileSystem.setPermission(RawLocalFileSystem.java:551)
	at org.apache.hadoop.fs.FilterFileSystem.setPermission(FilterFileSystem.java:343)
	at org.apache.hadoop.fs.FileSystem.mkdirs(FileSystem.java:410)
	at org.apache.hadoop.mapreduce.JobSubmitter.copyAndConfigureFiles(JobSubmitter.java:166)
	at org.apache.hadoop.mapreduce.JobSubmitter.copyAndConfigureFiles(JobSubmitter.java:283)
	at org.apache.hadoop.mapreduce.JobSubmitter.submitJobInternal(JobSubmitter.java:350)
	at org.apache.hadoop.mapreduce.Job$2.run(Job.java:1037)
	at org.apache.hadoop.mapreduce.Job$2.run(Job.java:1034)
	at java.security.AccessController.doPrivileged(Native Method)
	at javax.security.auth.Subject.doAs(Subject.java:396)
	at org.apache.hadoop.security.UserGroupInformation.doAs(UserGroupInformation.java:1142)
	at org.apache.hadoop.mapreduce.Job.submit(Job.java:1034)
	at org.apache.hadoop.mapred.JobClient.submitJob(JobClient.java:536)
	at org.apache.hadoop.mapred.lib.TestMultithreadedMapRunner.run(TestMultithreadedMapRunner.java:105)
	at org.apache.hadoop.mapred.lib.TestMultithreadedMapRunner.__CLR3_0_2zf5zzblcr(TestMultithreadedMapRunner.java:46)
	at org.apache.hadoop.mapred.lib.TestMultithreadedMapRunner.testRuntimeExRun(TestMultithreadedMapRunner.java:45)


REGRESSION:  org.apache.hadoop.mapred.lib.aggregate.TestAggregates.testAggregates

Error Message:
chmod: cannot access `/tmp/hadoop-hudson/mapred/staging/hudson-430988037/.staging/job_local_0001': No such file or directory 

Stack Trace:
org.apache.hadoop.util.Shell$ExitCodeException: chmod: cannot access `/tmp/hadoop-hudson/mapred/staging/hudson-430988037/.staging/job_local_0001': No such file or directory

	at org.apache.hadoop.util.Shell.runCommand(Shell.java:256)
	at org.apache.hadoop.util.Shell.run(Shell.java:183)
	at org.apache.hadoop.util.Shell$ShellCommandExecutor.execute(Shell.java:376)
	at org.apache.hadoop.util.Shell.execCommand(Shell.java:462)
	at org.apache.hadoop.util.Shell.execCommand(Shell.java:445)
	at org.apache.hadoop.fs.RawLocalFileSystem.execCommand(RawLocalFileSystem.java:560)
	at org.apache.hadoop.fs.RawLocalFileSystem.setPermission(RawLocalFileSystem.java:551)
	at org.apache.hadoop.fs.FilterFileSystem.setPermission(FilterFileSystem.java:343)
	at org.apache.hadoop.fs.FileSystem.mkdirs(FileSystem.java:410)
	at org.apache.hadoop.mapreduce.JobSubmitter.copyAndConfigureFiles(JobSubmitter.java:166)
	at org.apache.hadoop.mapreduce.JobSubmitter.copyAndConfigureFiles(JobSubmitter.java:283)
	at org.apache.hadoop.mapreduce.JobSubmitter.submitJobInternal(JobSubmitter.java:350)
	at org.apache.hadoop.mapreduce.Job$2.run(Job.java:1037)
	at org.apache.hadoop.mapreduce.Job$2.run(Job.java:1034)
	at java.security.AccessController.doPrivileged(Native Method)
	at javax.security.auth.Subject.doAs(Subject.java:396)
	at org.apache.hadoop.security.UserGroupInformation.doAs(UserGroupInformation.java:1142)
	at org.apache.hadoop.mapreduce.Job.submit(Job.java:1034)
	at org.apache.hadoop.mapred.JobClient.submitJob(JobClient.java:536)
	at org.apache.hadoop.mapred.JobClient.runJob(JobClient.java:781)
	at org.apache.hadoop.mapred.lib.aggregate.TestAggregates.launch(TestAggregates.java:103)
	at org.apache.hadoop.mapred.lib.aggregate.TestAggregates.__CLR3_0_21uoc3lqa(TestAggregates.java:41)
	at org.apache.hadoop.mapred.lib.aggregate.TestAggregates.testAggregates(TestAggregates.java:40)


REGRESSION:  org.apache.hadoop.mapreduce.TestLocalRunner.testGcCounter

Error Message:
chmod: cannot access `/tmp/hadoop-hudson/mapred/staging/hudson2064034272/.staging/job_local_0001': No such file or directory 

Stack Trace:
org.apache.hadoop.util.Shell$ExitCodeException: chmod: cannot access `/tmp/hadoop-hudson/mapred/staging/hudson2064034272/.staging/job_local_0001': No such file or directory

	at org.apache.hadoop.util.Shell.runCommand(Shell.java:256)
	at org.apache.hadoop.util.Shell.run(Shell.java:183)
	at org.apache.hadoop.util.Shell$ShellCommandExecutor.execute(Shell.java:376)
	at org.apache.hadoop.util.Shell.execCommand(Shell.java:462)
	at org.apache.hadoop.util.Shell.execCommand(Shell.java:445)
	at org.apache.hadoop.fs.RawLocalFileSystem.execCommand(RawLocalFileSystem.java:560)
	at org.apache.hadoop.fs.RawLocalFileSystem.setPermission(RawLocalFileSystem.java:551)
	at org.apache.hadoop.fs.FilterFileSystem.setPermission(FilterFileSystem.java:343)
	at org.apache.hadoop.fs.FileSystem.mkdirs(FileSystem.java:410)
	at org.apache.hadoop.mapreduce.JobSubmitter.copyAndConfigureFiles(JobSubmitter.java:166)
	at org.apache.hadoop.mapreduce.JobSubmitter.copyAndConfigureFiles(JobSubmitter.java:283)
	at org.apache.hadoop.mapreduce.JobSubmitter.submitJobInternal(JobSubmitter.java:350)
	at org.apache.hadoop.mapreduce.Job$2.run(Job.java:1037)
	at org.apache.hadoop.mapreduce.Job$2.run(Job.java:1034)
	at java.security.AccessController.doPrivileged(Native Method)
	at javax.security.auth.Subject.doAs(Subject.java:396)
	at org.apache.hadoop.security.UserGroupInformation.doAs(UserGroupInformation.java:1142)
	at org.apache.hadoop.mapreduce.Job.submit(Job.java:1034)
	at org.apache.hadoop.mapreduce.Job.waitForCompletion(Job.java:1054)
	at org.apache.hadoop.mapreduce.TestLocalRunner.__CLR3_0_2tnowa3n6t(TestLocalRunner.java:270)
	at org.apache.hadoop.mapreduce.TestLocalRunner.testGcCounter(TestLocalRunner.java:243)


REGRESSION:  org.apache.hadoop.mapreduce.TestLocalRunner.testMultiMaps

Error Message:
chmod: cannot access `/tmp/hadoop-hudson/mapred/staging/hudson-1797860306/.staging/job_local_0002': No such file or directory 

Stack Trace:
org.apache.hadoop.util.Shell$ExitCodeException: chmod: cannot access `/tmp/hadoop-hudson/mapred/staging/hudson-1797860306/.staging/job_local_0002': No such file or directory

	at org.apache.hadoop.util.Shell.runCommand(Shell.java:256)
	at org.apache.hadoop.util.Shell.run(Shell.java:183)
	at org.apache.hadoop.util.Shell$ShellCommandExecutor.execute(Shell.java:376)
	at org.apache.hadoop.util.Shell.execCommand(Shell.java:462)
	at org.apache.hadoop.util.Shell.execCommand(Shell.java:445)
	at org.apache.hadoop.fs.RawLocalFileSystem.execCommand(RawLocalFileSystem.java:560)
	at org.apache.hadoop.fs.RawLocalFileSystem.setPermission(RawLocalFileSystem.java:551)
	at org.apache.hadoop.fs.FilterFileSystem.setPermission(FilterFileSystem.java:343)
	at org.apache.hadoop.fs.FileSystem.mkdirs(FileSystem.java:410)
	at org.apache.hadoop.mapreduce.JobSubmitter.copyAndConfigureFiles(JobSubmitter.java:166)
	at org.apache.hadoop.mapreduce.JobSubmitter.copyAndConfigureFiles(JobSubmitter.java:283)
	at org.apache.hadoop.mapreduce.JobSubmitter.submitJobInternal(JobSubmitter.java:350)
	at org.apache.hadoop.mapreduce.Job$2.run(Job.java:1037)
	at org.apache.hadoop.mapreduce.Job$2.run(Job.java:1034)
	at java.security.AccessController.doPrivileged(Native Method)
	at javax.security.auth.Subject.doAs(Subject.java:396)
	at org.apache.hadoop.security.UserGroupInformation.doAs(UserGroupInformation.java:1142)
	at org.apache.hadoop.mapreduce.Job.submit(Job.java:1034)
	at org.apache.hadoop.mapreduce.Job.waitForCompletion(Job.java:1054)
	at org.apache.hadoop.mapreduce.TestLocalRunner.__CLR3_0_21tclffn7i(TestLocalRunner.java:310)
	at org.apache.hadoop.mapreduce.TestLocalRunner.testMultiMaps(TestLocalRunner.java:288)


REGRESSION:  org.apache.hadoop.mapreduce.TestLocalRunner.testInvalidMultiMapParallelism

Error Message:
chmod: cannot access `/tmp/hadoop-hudson/mapred/staging/hudson681294203/.staging/job_local_0003': No such file or directory 

Stack Trace:
org.apache.hadoop.util.Shell$ExitCodeException: chmod: cannot access `/tmp/hadoop-hudson/mapred/staging/hudson681294203/.staging/job_local_0003': No such file or directory

	at org.apache.hadoop.util.Shell.runCommand(Shell.java:256)
	at org.apache.hadoop.util.Shell.run(Shell.java:183)
	at org.apache.hadoop.util.Shell$ShellCommandExecutor.execute(Shell.java:376)
	at org.apache.hadoop.util.Shell.execCommand(Shell.java:462)
	at org.apache.hadoop.util.Shell.execCommand(Shell.java:445)
	at org.apache.hadoop.fs.RawLocalFileSystem.execCommand(RawLocalFileSystem.java:560)
	at org.apache.hadoop.fs.RawLocalFileSystem.setPermission(RawLocalFileSystem.java:551)
	at org.apache.hadoop.fs.FilterFileSystem.setPermission(FilterFileSystem.java:343)
	at org.apache.hadoop.fs.FileSystem.mkdirs(FileSystem.java:410)
	at org.apache.hadoop.mapreduce.JobSubmitter.copyAndConfigureFiles(JobSubmitter.java:166)
	at org.apache.hadoop.mapreduce.JobSubmitter.copyAndConfigureFiles(JobSubmitter.java:283)
	at org.apache.hadoop.mapreduce.JobSubmitter.submitJobInternal(JobSubmitter.java:350)
	at org.apache.hadoop.mapreduce.Job$2.run(Job.java:1037)
	at org.apache.hadoop.mapreduce.Job$2.run(Job.java:1034)
	at java.security.AccessController.doPrivileged(Native Method)
	at javax.security.auth.Subject.doAs(Subject.java:396)
	at org.apache.hadoop.security.UserGroupInformation.doAs(UserGroupInformation.java:1142)
	at org.apache.hadoop.mapreduce.Job.submit(Job.java:1034)
	at org.apache.hadoop.mapreduce.Job.waitForCompletion(Job.java:1054)
	at org.apache.hadoop.mapreduce.TestLocalRunner.__CLR3_0_22jq81nn82(TestLocalRunner.java:340)
	at org.apache.hadoop.mapreduce.TestLocalRunner.testInvalidMultiMapParallelism(TestLocalRunner.java:320)


REGRESSION:  org.apache.hadoop.mapreduce.TestLocalRunner.testEmptyMaps

Error Message:
chmod: cannot access `/tmp/hadoop-hudson/mapred/staging/hudson1978412146/.staging/job_local_0004': No such file or directory 

Stack Trace:
org.apache.hadoop.util.Shell$ExitCodeException: chmod: cannot access `/tmp/hadoop-hudson/mapred/staging/hudson1978412146/.staging/job_local_0004': No such file or directory

	at org.apache.hadoop.util.Shell.runCommand(Shell.java:256)
	at org.apache.hadoop.util.Shell.run(Shell.java:183)
	at org.apache.hadoop.util.Shell$ShellCommandExecutor.execute(Shell.java:376)
	at org.apache.hadoop.util.Shell.execCommand(Shell.java:462)
	at org.apache.hadoop.util.Shell.execCommand(Shell.java:445)
	at org.apache.hadoop.fs.RawLocalFileSystem.execCommand(RawLocalFileSystem.java:560)
	at org.apache.hadoop.fs.RawLocalFileSystem.setPermission(RawLocalFileSystem.java:551)
	at org.apache.hadoop.fs.FilterFileSystem.setPermission(FilterFileSystem.java:343)
	at org.apache.hadoop.fs.FileSystem.mkdirs(FileSystem.java:410)
	at org.apache.hadoop.mapreduce.JobSubmitter.copyAndConfigureFiles(JobSubmitter.java:166)
	at org.apache.hadoop.mapreduce.JobSubmitter.copyAndConfigureFiles(JobSubmitter.java:283)
	at org.apache.hadoop.mapreduce.JobSubmitter.submitJobInternal(JobSubmitter.java:350)
	at org.apache.hadoop.mapreduce.Job$2.run(Job.java:1037)
	at org.apache.hadoop.mapreduce.Job$2.run(Job.java:1034)
	at java.security.AccessController.doPrivileged(Native Method)
	at javax.security.auth.Subject.doAs(Subject.java:396)
	at org.apache.hadoop.security.UserGroupInformation.doAs(UserGroupInformation.java:1142)
	at org.apache.hadoop.mapreduce.Job.submit(Job.java:1034)
	at org.apache.hadoop.mapreduce.Job.waitForCompletion(Job.java:1054)
	at org.apache.hadoop.mapreduce.TestLocalRunner.__CLR3_0_285g4nn8y(TestLocalRunner.java:396)
	at org.apache.hadoop.mapreduce.TestLocalRunner.testEmptyMaps(TestLocalRunner.java:381)


REGRESSION:  org.apache.hadoop.mapreduce.TestMapCollection.testValLastByte

Error Message:
chmod: cannot access `/tmp/hadoop-hudson/mapred/staging/hudson752980053/.staging/job_local_0001': No such file or directory 

Stack Trace:
org.apache.hadoop.util.Shell$ExitCodeException: chmod: cannot access `/tmp/hadoop-hudson/mapred/staging/hudson752980053/.staging/job_local_0001': No such file or directory

	at org.apache.hadoop.util.Shell.runCommand(Shell.java:256)
	at org.apache.hadoop.util.Shell.run(Shell.java:183)
	at org.apache.hadoop.util.Shell$ShellCommandExecutor.execute(Shell.java:376)
	at org.apache.hadoop.util.Shell.execCommand(Shell.java:462)
	at org.apache.hadoop.util.Shell.execCommand(Shell.java:445)
	at org.apache.hadoop.fs.RawLocalFileSystem.execCommand(RawLocalFileSystem.java:560)
	at org.apache.hadoop.fs.RawLocalFileSystem.setPermission(RawLocalFileSystem.java:551)
	at org.apache.hadoop.fs.FilterFileSystem.setPermission(FilterFileSystem.java:343)
	at org.apache.hadoop.fs.FileSystem.mkdirs(FileSystem.java:410)
	at org.apache.hadoop.mapreduce.JobSubmitter.copyAndConfigureFiles(JobSubmitter.java:166)
	at org.apache.hadoop.mapreduce.JobSubmitter.copyAndConfigureFiles(JobSubmitter.java:283)
	at org.apache.hadoop.mapreduce.JobSubmitter.submitJobInternal(JobSubmitter.java:350)
	at org.apache.hadoop.mapreduce.Job$2.run(Job.java:1037)
	at org.apache.hadoop.mapreduce.Job$2.run(Job.java:1034)
	at java.security.AccessController.doPrivileged(Native Method)
	at javax.security.auth.Subject.doAs(Subject.java:396)
	at org.apache.hadoop.security.UserGroupInformation.doAs(UserGroupInformation.java:1142)
	at org.apache.hadoop.mapreduce.Job.submit(Job.java:1034)
	at org.apache.hadoop.mapreduce.Job.waitForCompletion(Job.java:1054)
	at org.apache.hadoop.mapreduce.TestMapCollection.runTest(TestMapCollection.java:326)
	at org.apache.hadoop.mapreduce.TestMapCollection.runTest(TestMapCollection.java:309)
	at org.apache.hadoop.mapreduce.TestMapCollection.__CLR3_0_2cypxscw1s(TestMapCollection.java:332)
	at org.apache.hadoop.mapreduce.TestMapCollection.testValLastByte(TestMapCollection.java:330)


REGRESSION:  org.apache.hadoop.mapreduce.TestMapCollection.testLargeRecords

Error Message:
chmod: cannot access `/tmp/hadoop-hudson/mapred/staging/hudson-868359337/.staging/job_local_0002': No such file or directory 

Stack Trace:
org.apache.hadoop.util.Shell$ExitCodeException: chmod: cannot access `/tmp/hadoop-hudson/mapred/staging/hudson-868359337/.staging/job_local_0002': No such file or directory

	at org.apache.hadoop.util.Shell.runCommand(Shell.java:256)
	at org.apache.hadoop.util.Shell.run(Shell.java:183)
	at org.apache.hadoop.util.Shell$ShellCommandExecutor.execute(Shell.java:376)
	at org.apache.hadoop.util.Shell.execCommand(Shell.java:462)
	at org.apache.hadoop.util.Shell.execCommand(Shell.java:445)
	at org.apache.hadoop.fs.RawLocalFileSystem.execCommand(RawLocalFileSystem.java:560)
	at org.apache.hadoop.fs.RawLocalFileSystem.setPermission(RawLocalFileSystem.java:551)
	at org.apache.hadoop.fs.FilterFileSystem.setPermission(FilterFileSystem.java:343)
	at org.apache.hadoop.fs.FileSystem.mkdirs(FileSystem.java:410)
	at org.apache.hadoop.mapreduce.JobSubmitter.copyAndConfigureFiles(JobSubmitter.java:166)
	at org.apache.hadoop.mapreduce.JobSubmitter.copyAndConfigureFiles(JobSubmitter.java:283)
	at org.apache.hadoop.mapreduce.JobSubmitter.submitJobInternal(JobSubmitter.java:350)
	at org.apache.hadoop.mapreduce.Job$2.run(Job.java:1037)
	at org.apache.hadoop.mapreduce.Job$2.run(Job.java:1034)
	at java.security.AccessController.doPrivileged(Native Method)
	at javax.security.auth.Subject.doAs(Subject.java:396)
	at org.apache.hadoop.security.UserGroupInformation.doAs(UserGroupInformation.java:1142)
	at org.apache.hadoop.mapreduce.Job.submit(Job.java:1034)
	at org.apache.hadoop.mapreduce.Job.waitForCompletion(Job.java:1054)
	at org.apache.hadoop.mapreduce.TestMapCollection.runTest(TestMapCollection.java:326)
	at org.apache.hadoop.mapreduce.TestMapCollection.runTest(TestMapCollection.java:309)
	at org.apache.hadoop.mapreduce.TestMapCollection.__CLR3_0_2fe8528w1v(TestMapCollection.java:339)
	at org.apache.hadoop.mapreduce.TestMapCollection.testLargeRecords(TestMapCollection.java:337)


REGRESSION:  org.apache.hadoop.mapreduce.TestMapCollection.testSpillPer2B

Error Message:
chmod: cannot access `/tmp/hadoop-hudson/mapred/staging/hudson1816688645/.staging/job_local_0003': No such file or directory 

Stack Trace:
org.apache.hadoop.util.Shell$ExitCodeException: chmod: cannot access `/tmp/hadoop-hudson/mapred/staging/hudson1816688645/.staging/job_local_0003': No such file or directory

	at org.apache.hadoop.util.Shell.runCommand(Shell.java:256)
	at org.apache.hadoop.util.Shell.run(Shell.java:183)
	at org.apache.hadoop.util.Shell$ShellCommandExecutor.execute(Shell.java:376)
	at org.apache.hadoop.util.Shell.execCommand(Shell.java:462)
	at org.apache.hadoop.util.Shell.execCommand(Shell.java:445)
	at org.apache.hadoop.fs.RawLocalFileSystem.execCommand(RawLocalFileSystem.java:560)
	at org.apache.hadoop.fs.RawLocalFileSystem.setPermission(RawLocalFileSystem.java:551)
	at org.apache.hadoop.fs.FilterFileSystem.setPermission(FilterFileSystem.java:343)
	at org.apache.hadoop.fs.FileSystem.mkdirs(FileSystem.java:410)
	at org.apache.hadoop.mapreduce.JobSubmitter.copyAndConfigureFiles(JobSubmitter.java:166)
	at org.apache.hadoop.mapreduce.JobSubmitter.copyAndConfigureFiles(JobSubmitter.java:283)
	at org.apache.hadoop.mapreduce.JobSubmitter.submitJobInternal(JobSubmitter.java:350)
	at org.apache.hadoop.mapreduce.Job$2.run(Job.java:1037)
	at org.apache.hadoop.mapreduce.Job$2.run(Job.java:1034)
	at java.security.AccessController.doPrivileged(Native Method)
	at javax.security.auth.Subject.doAs(Subject.java:396)
	at org.apache.hadoop.security.UserGroupInformation.doAs(UserGroupInformation.java:1142)
	at org.apache.hadoop.mapreduce.Job.submit(Job.java:1034)
	at org.apache.hadoop.mapreduce.Job.waitForCompletion(Job.java:1054)
	at org.apache.hadoop.mapreduce.TestMapCollection.runTest(TestMapCollection.java:326)
	at org.apache.hadoop.mapreduce.TestMapCollection.runTest(TestMapCollection.java:309)
	at org.apache.hadoop.mapreduce.TestMapCollection.__CLR3_0_28yt0g6w1y(TestMapCollection.java:346)
	at org.apache.hadoop.mapreduce.TestMapCollection.testSpillPer2B(TestMapCollection.java:344)


REGRESSION:  org.apache.hadoop.mapreduce.TestMapCollection.testZeroVal

Error Message:
chmod: cannot access `/tmp/hadoop-hudson/mapred/staging/hudson2052783648/.staging/job_local_0004': No such file or directory 

Stack Trace:
org.apache.hadoop.util.Shell$ExitCodeException: chmod: cannot access `/tmp/hadoop-hudson/mapred/staging/hudson2052783648/.staging/job_local_0004': No such file or directory

	at org.apache.hadoop.util.Shell.runCommand(Shell.java:256)
	at org.apache.hadoop.util.Shell.run(Shell.java:183)
	at org.apache.hadoop.util.Shell$ShellCommandExecutor.execute(Shell.java:376)
	at org.apache.hadoop.util.Shell.execCommand(Shell.java:462)
	at org.apache.hadoop.util.Shell.execCommand(Shell.java:445)
	at org.apache.hadoop.fs.RawLocalFileSystem.execCommand(RawLocalFileSystem.java:560)
	at org.apache.hadoop.fs.RawLocalFileSystem.setPermission(RawLocalFileSystem.java:551)
	at org.apache.hadoop.fs.FilterFileSystem.setPermission(FilterFileSystem.java:343)
	at org.apache.hadoop.fs.FileSystem.mkdirs(FileSystem.java:410)
	at org.apache.hadoop.mapreduce.JobSubmitter.copyAndConfigureFiles(JobSubmitter.java:166)
	at org.apache.hadoop.mapreduce.JobSubmitter.copyAndConfigureFiles(JobSubmitter.java:283)
	at org.apache.hadoop.mapreduce.JobSubmitter.submitJobInternal(JobSubmitter.java:350)
	at org.apache.hadoop.mapreduce.Job$2.run(Job.java:1037)
	at org.apache.hadoop.mapreduce.Job$2.run(Job.java:1034)
	at java.security.AccessController.doPrivileged(Native Method)
	at javax.security.auth.Subject.doAs(Subject.java:396)
	at org.apache.hadoop.security.UserGroupInformation.doAs(UserGroupInformation.java:1142)
	at org.apache.hadoop.mapreduce.Job.submit(Job.java:1034)
	at org.apache.hadoop.mapreduce.Job.waitForCompletion(Job.java:1054)
	at org.apache.hadoop.mapreduce.TestMapCollection.runTest(TestMapCollection.java:326)
	at org.apache.hadoop.mapreduce.TestMapCollection.runTest(TestMapCollection.java:309)
	at org.apache.hadoop.mapreduce.TestMapCollection.__CLR3_0_2u5xn7yw23(TestMapCollection.java:355)
	at org.apache.hadoop.mapreduce.TestMapCollection.testZeroVal(TestMapCollection.java:353)


REGRESSION:  org.apache.hadoop.mapreduce.TestMapCollection.testSingleRecord

Error Message:
chmod: cannot access `/tmp/hadoop-hudson/mapred/staging/hudson1514925622/.staging/job_local_0005': No such file or directory 

Stack Trace:
org.apache.hadoop.util.Shell$ExitCodeException: chmod: cannot access `/tmp/hadoop-hudson/mapred/staging/hudson1514925622/.staging/job_local_0005': No such file or directory

	at org.apache.hadoop.util.Shell.runCommand(Shell.java:256)
	at org.apache.hadoop.util.Shell.run(Shell.java:183)
	at org.apache.hadoop.util.Shell$ShellCommandExecutor.execute(Shell.java:376)
	at org.apache.hadoop.util.Shell.execCommand(Shell.java:462)
	at org.apache.hadoop.util.Shell.execCommand(Shell.java:445)
	at org.apache.hadoop.fs.RawLocalFileSystem.execCommand(RawLocalFileSystem.java:560)
	at org.apache.hadoop.fs.RawLocalFileSystem.setPermission(RawLocalFileSystem.java:551)
	at org.apache.hadoop.fs.FilterFileSystem.setPermission(FilterFileSystem.java:343)
	at org.apache.hadoop.fs.FileSystem.mkdirs(FileSystem.java:410)
	at org.apache.hadoop.mapreduce.JobSubmitter.copyAndConfigureFiles(JobSubmitter.java:166)
	at org.apache.hadoop.mapreduce.JobSubmitter.copyAndConfigureFiles(JobSubmitter.java:283)
	at org.apache.hadoop.mapreduce.JobSubmitter.submitJobInternal(JobSubmitter.java:350)
	at org.apache.hadoop.mapreduce.Job$2.run(Job.java:1037)
	at org.apache.hadoop.mapreduce.Job$2.run(Job.java:1034)
	at java.security.AccessController.doPrivileged(Native Method)
	at javax.security.auth.Subject.doAs(Subject.java:396)
	at org.apache.hadoop.security.UserGroupInformation.doAs(UserGroupInformation.java:1142)
	at org.apache.hadoop.mapreduce.Job.submit(Job.java:1034)
	at org.apache.hadoop.mapreduce.Job.waitForCompletion(Job.java:1054)
	at org.apache.hadoop.mapreduce.TestMapCollection.runTest(TestMapCollection.java:326)
	at org.apache.hadoop.mapreduce.TestMapCollection.runTest(TestMapCollection.java:309)
	at org.apache.hadoop.mapreduce.TestMapCollection.__CLR3_0_2db2s32w28(TestMapCollection.java:363)
	at org.apache.hadoop.mapreduce.TestMapCollection.testSingleRecord(TestMapCollection.java:362)


REGRESSION:  org.apache.hadoop.mapreduce.TestMapCollection.testLowSpill

Error Message:
chmod: cannot access `/tmp/hadoop-hudson/mapred/staging/hudson1973561865/.staging/job_local_0006': No such file or directory 

Stack Trace:
org.apache.hadoop.util.Shell$ExitCodeException: chmod: cannot access `/tmp/hadoop-hudson/mapred/staging/hudson1973561865/.staging/job_local_0006': No such file or directory

	at org.apache.hadoop.util.Shell.runCommand(Shell.java:256)
	at org.apache.hadoop.util.Shell.run(Shell.java:183)
	at org.apache.hadoop.util.Shell$ShellCommandExecutor.execute(Shell.java:376)
	at org.apache.hadoop.util.Shell.execCommand(Shell.java:462)
	at org.apache.hadoop.util.Shell.execCommand(Shell.java:445)
	at org.apache.hadoop.fs.RawLocalFileSystem.execCommand(RawLocalFileSystem.java:560)
	at org.apache.hadoop.fs.RawLocalFileSystem.setPermission(RawLocalFileSystem.java:551)
	at org.apache.hadoop.fs.FilterFileSystem.setPermission(FilterFileSystem.java:343)
	at org.apache.hadoop.fs.FileSystem.mkdirs(FileSystem.java:410)
	at org.apache.hadoop.mapreduce.JobSubmitter.copyAndConfigureFiles(JobSubmitter.java:166)
	at org.apache.hadoop.mapreduce.JobSubmitter.copyAndConfigureFiles(JobSubmitter.java:283)
	at org.apache.hadoop.mapreduce.JobSubmitter.submitJobInternal(JobSubmitter.java:350)
	at org.apache.hadoop.mapreduce.Job$2.run(Job.java:1037)
	at org.apache.hadoop.mapreduce.Job$2.run(Job.java:1034)
	at java.security.AccessController.doPrivileged(Native Method)
	at javax.security.auth.Subject.doAs(Subject.java:396)
	at org.apache.hadoop.security.UserGroupInformation.doAs(UserGroupInformation.java:1142)
	at org.apache.hadoop.mapreduce.Job.submit(Job.java:1034)
	at org.apache.hadoop.mapreduce.Job.waitForCompletion(Job.java:1054)
	at org.apache.hadoop.mapreduce.TestMapCollection.runTest(TestMapCollection.java:326)
	at org.apache.hadoop.mapreduce.TestMapCollection.runTest(TestMapCollection.java:309)
	at org.apache.hadoop.mapreduce.TestMapCollection.__CLR3_0_2z3qgi7w2b(TestMapCollection.java:369)
	at org.apache.hadoop.mapreduce.TestMapCollection.testLowSpill(TestMapCollection.java:368)


REGRESSION:  org.apache.hadoop.mapreduce.TestMapCollection.testSplitMetaSpill

Error Message:
chmod: cannot access `/tmp/hadoop-hudson/mapred/staging/hudson1308154752/.staging/job_local_0007': No such file or directory 

Stack Trace:
org.apache.hadoop.util.Shell$ExitCodeException: chmod: cannot access `/tmp/hadoop-hudson/mapred/staging/hudson1308154752/.staging/job_local_0007': No such file or directory

	at org.apache.hadoop.util.Shell.runCommand(Shell.java:256)
	at org.apache.hadoop.util.Shell.run(Shell.java:183)
	at org.apache.hadoop.util.Shell$ShellCommandExecutor.execute(Shell.java:376)
	at org.apache.hadoop.util.Shell.execCommand(Shell.java:462)
	at org.apache.hadoop.util.Shell.execCommand(Shell.java:445)
	at org.apache.hadoop.fs.RawLocalFileSystem.execCommand(RawLocalFileSystem.java:560)
	at org.apache.hadoop.fs.RawLocalFileSystem.setPermission(RawLocalFileSystem.java:551)
	at org.apache.hadoop.fs.FilterFileSystem.setPermission(FilterFileSystem.java:343)
	at org.apache.hadoop.fs.FileSystem.mkdirs(FileSystem.java:410)
	at org.apache.hadoop.mapreduce.JobSubmitter.copyAndConfigureFiles(JobSubmitter.java:166)
	at org.apache.hadoop.mapreduce.JobSubmitter.copyAndConfigureFiles(JobSubmitter.java:283)
	at org.apache.hadoop.mapreduce.JobSubmitter.submitJobInternal(JobSubmitter.java:350)
	at org.apache.hadoop.mapreduce.Job$2.run(Job.java:1037)
	at org.apache.hadoop.mapreduce.Job$2.run(Job.java:1034)
	at java.security.AccessController.doPrivileged(Native Method)
	at javax.security.auth.Subject.doAs(Subject.java:396)
	at org.apache.hadoop.security.UserGroupInformation.doAs(UserGroupInformation.java:1142)
	at org.apache.hadoop.mapreduce.Job.submit(Job.java:1034)
	at org.apache.hadoop.mapreduce.Job.waitForCompletion(Job.java:1054)
	at org.apache.hadoop.mapreduce.TestMapCollection.runTest(TestMapCollection.java:326)
	at org.apache.hadoop.mapreduce.TestMapCollection.runTest(TestMapCollection.java:309)
	at org.apache.hadoop.mapreduce.TestMapCollection.__CLR3_0_2molruiw2d(TestMapCollection.java:374)
	at org.apache.hadoop.mapreduce.TestMapCollection.testSplitMetaSpill(TestMapCollection.java:373)


REGRESSION:  org.apache.hadoop.mapreduce.TestMapCollection.testPostSpillMeta

Error Message:
chmod: cannot access `/tmp/hadoop-hudson/mapred/staging/hudson-1999381361/.staging/job_local_0008': No such file or directory 

Stack Trace:
org.apache.hadoop.util.Shell$ExitCodeException: chmod: cannot access `/tmp/hadoop-hudson/mapred/staging/hudson-1999381361/.staging/job_local_0008': No such file or directory

	at org.apache.hadoop.util.Shell.runCommand(Shell.java:256)
	at org.apache.hadoop.util.Shell.run(Shell.java:183)
	at org.apache.hadoop.util.Shell$ShellCommandExecutor.execute(Shell.java:376)
	at org.apache.hadoop.util.Shell.execCommand(Shell.java:462)
	at org.apache.hadoop.util.Shell.execCommand(Shell.java:445)
	at org.apache.hadoop.fs.RawLocalFileSystem.execCommand(RawLocalFileSystem.java:560)
	at org.apache.hadoop.fs.RawLocalFileSystem.setPermission(RawLocalFileSystem.java:551)
	at org.apache.hadoop.fs.FilterFileSystem.setPermission(FilterFileSystem.java:343)
	at org.apache.hadoop.fs.FileSystem.mkdirs(FileSystem.java:410)
	at org.apache.hadoop.mapreduce.JobSubmitter.copyAndConfigureFiles(JobSubmitter.java:166)
	at org.apache.hadoop.mapreduce.JobSubmitter.copyAndConfigureFiles(JobSubmitter.java:283)
	at org.apache.hadoop.mapreduce.JobSubmitter.submitJobInternal(JobSubmitter.java:350)
	at org.apache.hadoop.mapreduce.Job$2.run(Job.java:1037)
	at org.apache.hadoop.mapreduce.Job$2.run(Job.java:1034)
	at java.security.AccessController.doPrivileged(Native Method)
	at javax.security.auth.Subject.doAs(Subject.java:396)
	at org.apache.hadoop.security.UserGroupInformation.doAs(UserGroupInformation.java:1142)
	at org.apache.hadoop.mapreduce.Job.submit(Job.java:1034)
	at org.apache.hadoop.mapreduce.Job.waitForCompletion(Job.java:1054)
	at org.apache.hadoop.mapreduce.TestMapCollection.runTest(TestMapCollection.java:326)
	at org.apache.hadoop.mapreduce.TestMapCollection.__CLR3_0_266dm6ew2z(TestMapCollection.java:423)
	at org.apache.hadoop.mapreduce.TestMapCollection.testPostSpillMeta(TestMapCollection.java:407)


REGRESSION:  org.apache.hadoop.mapreduce.TestMapCollection.testLargeRecConcurrent

Error Message:
chmod: cannot access `/tmp/hadoop-hudson/mapred/staging/hudson942186721/.staging/job_local_0009': No such file or directory 

Stack Trace:
org.apache.hadoop.util.Shell$ExitCodeException: chmod: cannot access `/tmp/hadoop-hudson/mapred/staging/hudson942186721/.staging/job_local_0009': No such file or directory

	at org.apache.hadoop.util.Shell.runCommand(Shell.java:256)
	at org.apache.hadoop.util.Shell.run(Shell.java:183)
	at org.apache.hadoop.util.Shell$ShellCommandExecutor.execute(Shell.java:376)
	at org.apache.hadoop.util.Shell.execCommand(Shell.java:462)
	at org.apache.hadoop.util.Shell.execCommand(Shell.java:445)
	at org.apache.hadoop.fs.RawLocalFileSystem.execCommand(RawLocalFileSystem.java:560)
	at org.apache.hadoop.fs.RawLocalFileSystem.setPermission(RawLocalFileSystem.java:551)
	at org.apache.hadoop.fs.FilterFileSystem.setPermission(FilterFileSystem.java:343)
	at org.apache.hadoop.fs.FileSystem.mkdirs(FileSystem.java:410)
	at org.apache.hadoop.mapreduce.JobSubmitter.copyAndConfigureFiles(JobSubmitter.java:166)
	at org.apache.hadoop.mapreduce.JobSubmitter.copyAndConfigureFiles(JobSubmitter.java:283)
	at org.apache.hadoop.mapreduce.JobSubmitter.submitJobInternal(JobSubmitter.java:350)
	at org.apache.hadoop.mapreduce.Job$2.run(Job.java:1037)
	at org.apache.hadoop.mapreduce.Job$2.run(Job.java:1034)
	at java.security.AccessController.doPrivileged(Native Method)
	at javax.security.auth.Subject.doAs(Subject.java:396)
	at org.apache.hadoop.security.UserGroupInformation.doAs(UserGroupInformation.java:1142)
	at org.apache.hadoop.mapreduce.Job.submit(Job.java:1034)
	at org.apache.hadoop.mapreduce.Job.waitForCompletion(Job.java:1054)
	at org.apache.hadoop.mapreduce.TestMapCollection.runTest(TestMapCollection.java:326)
	at org.apache.hadoop.mapreduce.TestMapCollection.__CLR3_0_2qefqudw3c(TestMapCollection.java:440)
	at org.apache.hadoop.mapreduce.TestMapCollection.testLargeRecConcurrent(TestMapCollection.java:427)


REGRESSION:  org.apache.hadoop.mapreduce.TestMapCollection.testRandom

Error Message:
chmod: cannot access `/tmp/hadoop-hudson/mapred/staging/hudson-1760756748/.staging/job_local_0010': No such file or directory 

Stack Trace:
org.apache.hadoop.util.Shell$ExitCodeException: chmod: cannot access `/tmp/hadoop-hudson/mapred/staging/hudson-1760756748/.staging/job_local_0010': No such file or directory

	at org.apache.hadoop.util.Shell.runCommand(Shell.java:256)
	at org.apache.hadoop.util.Shell.run(Shell.java:183)
	at org.apache.hadoop.util.Shell$ShellCommandExecutor.execute(Shell.java:376)
	at org.apache.hadoop.util.Shell.execCommand(Shell.java:462)
	at org.apache.hadoop.util.Shell.execCommand(Shell.java:445)
	at org.apache.hadoop.fs.RawLocalFileSystem.execCommand(RawLocalFileSystem.java:560)
	at org.apache.hadoop.fs.RawLocalFileSystem.setPermission(RawLocalFileSystem.java:551)
	at org.apache.hadoop.fs.FilterFileSystem.setPermission(FilterFileSystem.java:343)
	at org.apache.hadoop.fs.FileSystem.mkdirs(FileSystem.java:410)
	at org.apache.hadoop.mapreduce.JobSubmitter.copyAndConfigureFiles(JobSubmitter.java:166)
	at org.apache.hadoop.mapreduce.JobSubmitter.copyAndConfigureFiles(JobSubmitter.java:283)
	at org.apache.hadoop.mapreduce.JobSubmitter.submitJobInternal(JobSubmitter.java:350)
	at org.apache.hadoop.mapreduce.Job$2.run(Job.java:1037)
	at org.apache.hadoop.mapreduce.Job$2.run(Job.java:1034)
	at java.security.AccessController.doPrivileged(Native Method)
	at javax.security.auth.Subject.doAs(Subject.java:396)
	at org.apache.hadoop.security.UserGroupInformation.doAs(UserGroupInformation.java:1142)
	at org.apache.hadoop.mapreduce.Job.submit(Job.java:1034)
	at org.apache.hadoop.mapreduce.Job.waitForCompletion(Job.java:1054)
	at org.apache.hadoop.mapreduce.TestMapCollection.runTest(TestMapCollection.java:326)
	at org.apache.hadoop.mapreduce.TestMapCollection.__CLR3_0_2ujoeasw4u(TestMapCollection.java:513)
	at org.apache.hadoop.mapreduce.TestMapCollection.testRandom(TestMapCollection.java:496)


REGRESSION:  org.apache.hadoop.mapreduce.TestMapCollection.testRandomCompress

Error Message:
chmod: cannot access `/tmp/hadoop-hudson/mapred/staging/hudson-746114017/.staging/job_local_0011': No such file or directory 

Stack Trace:
org.apache.hadoop.util.Shell$ExitCodeException: chmod: cannot access `/tmp/hadoop-hudson/mapred/staging/hudson-746114017/.staging/job_local_0011': No such file or directory

	at org.apache.hadoop.util.Shell.runCommand(Shell.java:256)
	at org.apache.hadoop.util.Shell.run(Shell.java:183)
	at org.apache.hadoop.util.Shell$ShellCommandExecutor.execute(Shell.java:376)
	at org.apache.hadoop.util.Shell.execCommand(Shell.java:462)
	at org.apache.hadoop.util.Shell.execCommand(Shell.java:445)
	at org.apache.hadoop.fs.RawLocalFileSystem.execCommand(RawLocalFileSystem.java:560)
	at org.apache.hadoop.fs.RawLocalFileSystem.setPermission(RawLocalFileSystem.java:551)
	at org.apache.hadoop.fs.FilterFileSystem.setPermission(FilterFileSystem.java:343)
	at org.apache.hadoop.fs.FileSystem.mkdirs(FileSystem.java:410)
	at org.apache.hadoop.mapreduce.JobSubmitter.copyAndConfigureFiles(JobSubmitter.java:166)
	at org.apache.hadoop.mapreduce.JobSubmitter.copyAndConfigureFiles(JobSubmitter.java:283)
	at org.apache.hadoop.mapreduce.JobSubmitter.submitJobInternal(JobSubmitter.java:350)
	at org.apache.hadoop.mapreduce.Job$2.run(Job.java:1037)
	at org.apache.hadoop.mapreduce.Job$2.run(Job.java:1034)
	at java.security.AccessController.doPrivileged(Native Method)
	at javax.security.auth.Subject.doAs(Subject.java:396)
	at org.apache.hadoop.security.UserGroupInformation.doAs(UserGroupInformation.java:1142)
	at org.apache.hadoop.mapreduce.Job.submit(Job.java:1034)
	at org.apache.hadoop.mapreduce.Job.waitForCompletion(Job.java:1054)
	at org.apache.hadoop.mapreduce.TestMapCollection.runTest(TestMapCollection.java:326)
	at org.apache.hadoop.mapreduce.TestMapCollection.__CLR3_0_2vyg2zmw5a(TestMapCollection.java:535)
	at org.apache.hadoop.mapreduce.TestMapCollection.testRandomCompress(TestMapCollection.java:517)


REGRESSION:  org.apache.hadoop.mapreduce.TestMapReduce.testMapred

Error Message:
chmod: cannot access `/tmp/hadoop-hudson/mapred/staging/hudson211088327/.staging/job_local_0001': No such file or directory 

Stack Trace:
org.apache.hadoop.util.Shell$ExitCodeException: chmod: cannot access `/tmp/hadoop-hudson/mapred/staging/hudson211088327/.staging/job_local_0001': No such file or directory

	at org.apache.hadoop.util.Shell.runCommand(Shell.java:256)
	at org.apache.hadoop.util.Shell.run(Shell.java:183)
	at org.apache.hadoop.util.Shell$ShellCommandExecutor.execute(Shell.java:376)
	at org.apache.hadoop.util.Shell.execCommand(Shell.java:462)
	at org.apache.hadoop.util.Shell.execCommand(Shell.java:445)
	at org.apache.hadoop.fs.RawLocalFileSystem.execCommand(RawLocalFileSystem.java:560)
	at org.apache.hadoop.fs.RawLocalFileSystem.setPermission(RawLocalFileSystem.java:551)
	at org.apache.hadoop.fs.FilterFileSystem.setPermission(FilterFileSystem.java:343)
	at org.apache.hadoop.fs.FileSystem.mkdirs(FileSystem.java:410)
	at org.apache.hadoop.mapreduce.JobSubmitter.copyAndConfigureFiles(JobSubmitter.java:166)
	at org.apache.hadoop.mapreduce.JobSubmitter.copyAndConfigureFiles(JobSubmitter.java:283)
	at org.apache.hadoop.mapreduce.JobSubmitter.submitJobInternal(JobSubmitter.java:350)
	at org.apache.hadoop.mapreduce.Job$2.run(Job.java:1037)
	at org.apache.hadoop.mapreduce.Job$2.run(Job.java:1034)
	at java.security.AccessController.doPrivileged(Native Method)
	at javax.security.auth.Subject.doAs(Subject.java:396)
	at org.apache.hadoop.security.UserGroupInformation.doAs(UserGroupInformation.java:1142)
	at org.apache.hadoop.mapreduce.Job.submit(Job.java:1034)
	at org.apache.hadoop.mapreduce.Job.waitForCompletion(Job.java:1054)
	at org.apache.hadoop.mapreduce.TestMapReduce.launch(TestMapReduce.java:300)
	at org.apache.hadoop.mapreduce.TestMapReduce.__CLR3_0_2vmf1hqtom(TestMapReduce.java:219)
	at org.apache.hadoop.mapreduce.TestMapReduce.testMapred(TestMapReduce.java:218)


REGRESSION:  org.apache.hadoop.mapreduce.TestValueIterReset.testValueIterReset

Error Message:
null

Stack Trace:
junit.framework.AssertionFailedError: null
	at org.apache.hadoop.mapreduce.TestValueIterReset.__CLR3_0_2hu3roheyx(TestValueIterReset.java:547)
	at org.apache.hadoop.mapreduce.TestValueIterReset.testValueIterReset(TestValueIterReset.java:521)


REGRESSION:  org.apache.hadoop.mapreduce.lib.aggregate.TestMapReduceAggregates.testAggregates

Error Message:
chmod: cannot access `/tmp/hadoop-hudson/mapred/staging/hudson-312455820/.staging/job_local_0001': No such file or directory 

Stack Trace:
org.apache.hadoop.util.Shell$ExitCodeException: chmod: cannot access `/tmp/hadoop-hudson/mapred/staging/hudson-312455820/.staging/job_local_0001': No such file or directory

	at org.apache.hadoop.util.Shell.runCommand(Shell.java:256)
	at org.apache.hadoop.util.Shell.run(Shell.java:183)
	at org.apache.hadoop.util.Shell$ShellCommandExecutor.execute(Shell.java:376)
	at org.apache.hadoop.util.Shell.execCommand(Shell.java:462)
	at org.apache.hadoop.util.Shell.execCommand(Shell.java:445)
	at org.apache.hadoop.fs.RawLocalFileSystem.execCommand(RawLocalFileSystem.java:560)
	at org.apache.hadoop.fs.RawLocalFileSystem.setPermission(RawLocalFileSystem.java:551)
	at org.apache.hadoop.fs.FilterFileSystem.setPermission(FilterFileSystem.java:343)
	at org.apache.hadoop.fs.FileSystem.mkdirs(FileSystem.java:410)
	at org.apache.hadoop.mapreduce.JobSubmitter.copyAndConfigureFiles(JobSubmitter.java:166)
	at org.apache.hadoop.mapreduce.JobSubmitter.copyAndConfigureFiles(JobSubmitter.java:283)
	at org.apache.hadoop.mapreduce.JobSubmitter.submitJobInternal(JobSubmitter.java:350)
	at org.apache.hadoop.mapreduce.Job$2.run(Job.java:1037)
	at org.apache.hadoop.mapreduce.Job$2.run(Job.java:1034)
	at java.security.AccessController.doPrivileged(Native Method)
	at javax.security.auth.Subject.doAs(Subject.java:396)
	at org.apache.hadoop.security.UserGroupInformation.doAs(UserGroupInformation.java:1142)
	at org.apache.hadoop.mapreduce.Job.submit(Job.java:1034)
	at org.apache.hadoop.mapreduce.Job.waitForCompletion(Job.java:1054)
	at org.apache.hadoop.mapreduce.lib.aggregate.TestMapReduceAggregates.launch(TestMapReduceAggregates.java:108)
	at org.apache.hadoop.mapreduce.lib.aggregate.TestMapReduceAggregates.__CLR3_0_21uoc3ura(TestMapReduceAggregates.java:46)
	at org.apache.hadoop.mapreduce.lib.aggregate.TestMapReduceAggregates.testAggregates(TestMapReduceAggregates.java:45)


REGRESSION:  org.apache.hadoop.mapreduce.lib.chain.TestChainErrors.testChainFail

Error Message:
chmod: cannot access `/tmp/hadoop-hudson/mapred/staging/hudson-891965464/.staging/job_local_0001': No such file or directory 

Stack Trace:
org.apache.hadoop.util.Shell$ExitCodeException: chmod: cannot access `/tmp/hadoop-hudson/mapred/staging/hudson-891965464/.staging/job_local_0001': No such file or directory

	at org.apache.hadoop.util.Shell.runCommand(Shell.java:256)
	at org.apache.hadoop.util.Shell.run(Shell.java:183)
	at org.apache.hadoop.util.Shell$ShellCommandExecutor.execute(Shell.java:376)
	at org.apache.hadoop.util.Shell.execCommand(Shell.java:462)
	at org.apache.hadoop.util.Shell.execCommand(Shell.java:445)
	at org.apache.hadoop.fs.RawLocalFileSystem.execCommand(RawLocalFileSystem.java:560)
	at org.apache.hadoop.fs.RawLocalFileSystem.setPermission(RawLocalFileSystem.java:551)
	at org.apache.hadoop.fs.FilterFileSystem.setPermission(FilterFileSystem.java:343)
	at org.apache.hadoop.fs.FileSystem.mkdirs(FileSystem.java:410)
	at org.apache.hadoop.mapreduce.JobSubmitter.copyAndConfigureFiles(JobSubmitter.java:166)
	at org.apache.hadoop.mapreduce.JobSubmitter.copyAndConfigureFiles(JobSubmitter.java:283)
	at org.apache.hadoop.mapreduce.JobSubmitter.submitJobInternal(JobSubmitter.java:350)
	at org.apache.hadoop.mapreduce.Job$2.run(Job.java:1037)
	at org.apache.hadoop.mapreduce.Job$2.run(Job.java:1034)
	at java.security.AccessController.doPrivileged(Native Method)
	at javax.security.auth.Subject.doAs(Subject.java:396)
	at org.apache.hadoop.security.UserGroupInformation.doAs(UserGroupInformation.java:1142)
	at org.apache.hadoop.mapreduce.Job.submit(Job.java:1034)
	at org.apache.hadoop.mapreduce.Job.waitForCompletion(Job.java:1054)
	at org.apache.hadoop.mapreduce.lib.chain.TestChainErrors.__CLR3_0_2bnfjqs9ay(TestChainErrors.java:108)
	at org.apache.hadoop.mapreduce.lib.chain.TestChainErrors.testChainFail(TestChainErrors.java:92)


REGRESSION:  org.apache.hadoop.mapreduce.lib.chain.TestChainErrors.testReducerFail

Error Message:
chmod: cannot access `/tmp/hadoop-hudson/mapred/staging/hudson1948274774/.staging/job_local_0002': No such file or directory 

Stack Trace:
org.apache.hadoop.util.Shell$ExitCodeException: chmod: cannot access `/tmp/hadoop-hudson/mapred/staging/hudson1948274774/.staging/job_local_0002': No such file or directory

	at org.apache.hadoop.util.Shell.runCommand(Shell.java:256)
	at org.apache.hadoop.util.Shell.run(Shell.java:183)
	at org.apache.hadoop.util.Shell$ShellCommandExecutor.execute(Shell.java:376)
	at org.apache.hadoop.util.Shell.execCommand(Shell.java:462)
	at org.apache.hadoop.util.Shell.execCommand(Shell.java:445)
	at org.apache.hadoop.fs.RawLocalFileSystem.execCommand(RawLocalFileSystem.java:560)
	at org.apache.hadoop.fs.RawLocalFileSystem.setPermission(RawLocalFileSystem.java:551)
	at org.apache.hadoop.fs.FilterFileSystem.setPermission(FilterFileSystem.java:343)
	at org.apache.hadoop.fs.FileSystem.mkdirs(FileSystem.java:410)
	at org.apache.hadoop.mapreduce.JobSubmitter.copyAndConfigureFiles(JobSubmitter.java:166)
	at org.apache.hadoop.mapreduce.JobSubmitter.copyAndConfigureFiles(JobSubmitter.java:283)
	at org.apache.hadoop.mapreduce.JobSubmitter.submitJobInternal(JobSubmitter.java:350)
	at org.apache.hadoop.mapreduce.Job$2.run(Job.java:1037)
	at org.apache.hadoop.mapreduce.Job$2.run(Job.java:1034)
	at java.security.AccessController.doPrivileged(Native Method)
	at javax.security.auth.Subject.doAs(Subject.java:396)
	at org.apache.hadoop.security.UserGroupInformation.doAs(UserGroupInformation.java:1142)
	at org.apache.hadoop.mapreduce.Job.submit(Job.java:1034)
	at org.apache.hadoop.mapreduce.Job.waitForCompletion(Job.java:1054)
	at org.apache.hadoop.mapreduce.lib.chain.TestChainErrors.__CLR3_0_25ewwv39b7(TestChainErrors.java:133)
	at org.apache.hadoop.mapreduce.lib.chain.TestChainErrors.testReducerFail(TestChainErrors.java:117)


REGRESSION:  org.apache.hadoop.mapreduce.lib.chain.TestChainErrors.testChainMapNoOuptut

Error Message:
chmod: cannot access `/tmp/hadoop-hudson/mapred/staging/hudson1751067318/.staging/job_local_0003': No such file or directory 

Stack Trace:
org.apache.hadoop.util.Shell$ExitCodeException: chmod: cannot access `/tmp/hadoop-hudson/mapred/staging/hudson1751067318/.staging/job_local_0003': No such file or directory

	at org.apache.hadoop.util.Shell.runCommand(Shell.java:256)
	at org.apache.hadoop.util.Shell.run(Shell.java:183)
	at org.apache.hadoop.util.Shell$ShellCommandExecutor.execute(Shell.java:376)
	at org.apache.hadoop.util.Shell.execCommand(Shell.java:462)
	at org.apache.hadoop.util.Shell.execCommand(Shell.java:445)
	at org.apache.hadoop.fs.RawLocalFileSystem.execCommand(RawLocalFileSystem.java:560)
	at org.apache.hadoop.fs.RawLocalFileSystem.setPermission(RawLocalFileSystem.java:551)
	at org.apache.hadoop.fs.FilterFileSystem.setPermission(FilterFileSystem.java:343)
	at org.apache.hadoop.fs.FileSystem.mkdirs(FileSystem.java:410)
	at org.apache.hadoop.mapreduce.JobSubmitter.copyAndConfigureFiles(JobSubmitter.java:166)
	at org.apache.hadoop.mapreduce.JobSubmitter.copyAndConfigureFiles(JobSubmitter.java:283)
	at org.apache.hadoop.mapreduce.JobSubmitter.submitJobInternal(JobSubmitter.java:350)
	at org.apache.hadoop.mapreduce.Job$2.run(Job.java:1037)
	at org.apache.hadoop.mapreduce.Job$2.run(Job.java:1034)
	at java.security.AccessController.doPrivileged(Native Method)
	at javax.security.auth.Subject.doAs(Subject.java:396)
	at org.apache.hadoop.security.UserGroupInformation.doAs(UserGroupInformation.java:1142)
	at org.apache.hadoop.mapreduce.Job.submit(Job.java:1034)
	at org.apache.hadoop.mapreduce.Job.waitForCompletion(Job.java:1054)
	at org.apache.hadoop.mapreduce.lib.chain.TestChainErrors.__CLR3_0_2mbjvwi9bg(TestChainErrors.java:155)
	at org.apache.hadoop.mapreduce.lib.chain.TestChainErrors.testChainMapNoOuptut(TestChainErrors.java:142)


REGRESSION:  org.apache.hadoop.mapreduce.lib.chain.TestChainErrors.testChainReduceNoOuptut

Error Message:
chmod: cannot access `/tmp/hadoop-hudson/mapred/staging/hudson-1876902118/.staging/job_local_0004': No such file or directory 

Stack Trace:
org.apache.hadoop.util.Shell$ExitCodeException: chmod: cannot access `/tmp/hadoop-hudson/mapred/staging/hudson-1876902118/.staging/job_local_0004': No such file or directory

	at org.apache.hadoop.util.Shell.runCommand(Shell.java:256)
	at org.apache.hadoop.util.Shell.run(Shell.java:183)
	at org.apache.hadoop.util.Shell$ShellCommandExecutor.execute(Shell.java:376)
	at org.apache.hadoop.util.Shell.execCommand(Shell.java:462)
	at org.apache.hadoop.util.Shell.execCommand(Shell.java:445)
	at org.apache.hadoop.fs.RawLocalFileSystem.execCommand(RawLocalFileSystem.java:560)
	at org.apache.hadoop.fs.RawLocalFileSystem.setPermission(RawLocalFileSystem.java:551)
	at org.apache.hadoop.fs.FilterFileSystem.setPermission(FilterFileSystem.java:343)
	at org.apache.hadoop.fs.FileSystem.mkdirs(FileSystem.java:410)
	at org.apache.hadoop.mapreduce.JobSubmitter.copyAndConfigureFiles(JobSubmitter.java:166)
	at org.apache.hadoop.mapreduce.JobSubmitter.copyAndConfigureFiles(JobSubmitter.java:283)
	at org.apache.hadoop.mapreduce.JobSubmitter.submitJobInternal(JobSubmitter.java:350)
	at org.apache.hadoop.mapreduce.Job$2.run(Job.java:1037)
	at org.apache.hadoop.mapreduce.Job$2.run(Job.java:1034)
	at java.security.AccessController.doPrivileged(Native Method)
	at javax.security.auth.Subject.doAs(Subject.java:396)
	at org.apache.hadoop.security.UserGroupInformation.doAs(UserGroupInformation.java:1142)
	at org.apache.hadoop.mapreduce.Job.submit(Job.java:1034)
	at org.apache.hadoop.mapreduce.Job.waitForCompletion(Job.java:1054)
	at org.apache.hadoop.mapreduce.lib.chain.TestChainErrors.__CLR3_0_24qjj5y9bq(TestChainErrors.java:182)
	at org.apache.hadoop.mapreduce.lib.chain.TestChainErrors.testChainReduceNoOuptut(TestChainErrors.java:166)


REGRESSION:  org.apache.hadoop.mapreduce.lib.chain.TestMapReduceChain.testChain

Error Message:
chmod: cannot access `/tmp/hadoop-hudson/mapred/staging/hudson-735048238/.staging/job_local_0001': No such file or directory 

Stack Trace:
org.apache.hadoop.util.Shell$ExitCodeException: chmod: cannot access `/tmp/hadoop-hudson/mapred/staging/hudson-735048238/.staging/job_local_0001': No such file or directory

	at org.apache.hadoop.util.Shell.runCommand(Shell.java:256)
	at org.apache.hadoop.util.Shell.run(Shell.java:183)
	at org.apache.hadoop.util.Shell$ShellCommandExecutor.execute(Shell.java:376)
	at org.apache.hadoop.util.Shell.execCommand(Shell.java:462)
	at org.apache.hadoop.util.Shell.execCommand(Shell.java:445)
	at org.apache.hadoop.fs.RawLocalFileSystem.execCommand(RawLocalFileSystem.java:560)
	at org.apache.hadoop.fs.RawLocalFileSystem.setPermission(RawLocalFileSystem.java:551)
	at org.apache.hadoop.fs.FilterFileSystem.setPermission(FilterFileSystem.java:343)
	at org.apache.hadoop.fs.FileSystem.mkdirs(FileSystem.java:410)
	at org.apache.hadoop.mapreduce.JobSubmitter.copyAndConfigureFiles(JobSubmitter.java:166)
	at org.apache.hadoop.mapreduce.JobSubmitter.copyAndConfigureFiles(JobSubmitter.java:283)
	at org.apache.hadoop.mapreduce.JobSubmitter.submitJobInternal(JobSubmitter.java:350)
	at org.apache.hadoop.mapreduce.Job$2.run(Job.java:1037)
	at org.apache.hadoop.mapreduce.Job$2.run(Job.java:1034)
	at java.security.AccessController.doPrivileged(Native Method)
	at javax.security.auth.Subject.doAs(Subject.java:396)
	at org.apache.hadoop.security.UserGroupInformation.doAs(UserGroupInformation.java:1142)
	at org.apache.hadoop.mapreduce.Job.submit(Job.java:1034)
	at org.apache.hadoop.mapreduce.Job.waitForCompletion(Job.java:1054)
	at org.apache.hadoop.mapreduce.lib.chain.TestMapReduceChain.__CLR3_0_2ke5z1yovy(TestMapReduceChain.java:106)
	at org.apache.hadoop.mapreduce.lib.chain.TestMapReduceChain.testChain(TestMapReduceChain.java:66)


REGRESSION:  org.apache.hadoop.mapreduce.lib.chain.TestSingleElementChain.testNoChain

Error Message:
chmod: cannot access `/tmp/hadoop-hudson/mapred/staging/hudson1255479824/.staging/job_local_0001': No such file or directory 

Stack Trace:
org.apache.hadoop.util.Shell$ExitCodeException: chmod: cannot access `/tmp/hadoop-hudson/mapred/staging/hudson1255479824/.staging/job_local_0001': No such file or directory

	at org.apache.hadoop.util.Shell.runCommand(Shell.java:256)
	at org.apache.hadoop.util.Shell.run(Shell.java:183)
	at org.apache.hadoop.util.Shell$ShellCommandExecutor.execute(Shell.java:376)
	at org.apache.hadoop.util.Shell.execCommand(Shell.java:462)
	at org.apache.hadoop.util.Shell.execCommand(Shell.java:445)
	at org.apache.hadoop.fs.RawLocalFileSystem.execCommand(RawLocalFileSystem.java:560)
	at org.apache.hadoop.fs.RawLocalFileSystem.setPermission(RawLocalFileSystem.java:551)
	at org.apache.hadoop.fs.FilterFileSystem.setPermission(FilterFileSystem.java:343)
	at org.apache.hadoop.fs.FileSystem.mkdirs(FileSystem.java:410)
	at org.apache.hadoop.mapreduce.JobSubmitter.copyAndConfigureFiles(JobSubmitter.java:166)
	at org.apache.hadoop.mapreduce.JobSubmitter.copyAndConfigureFiles(JobSubmitter.java:283)
	at org.apache.hadoop.mapreduce.JobSubmitter.submitJobInternal(JobSubmitter.java:350)
	at org.apache.hadoop.mapreduce.Job$2.run(Job.java:1037)
	at org.apache.hadoop.mapreduce.Job$2.run(Job.java:1034)
	at java.security.AccessController.doPrivileged(Native Method)
	at javax.security.auth.Subject.doAs(Subject.java:396)
	at org.apache.hadoop.security.UserGroupInformation.doAs(UserGroupInformation.java:1142)
	at org.apache.hadoop.mapreduce.Job.submit(Job.java:1034)
	at org.apache.hadoop.mapreduce.Job.waitForCompletion(Job.java:1054)
	at org.apache.hadoop.mapreduce.lib.chain.TestSingleElementChain.__CLR3_0_2tfhzhnmz6(TestSingleElementChain.java:62)
	at org.apache.hadoop.mapreduce.lib.chain.TestSingleElementChain.testNoChain(TestSingleElementChain.java:45)


REGRESSION:  org.apache.hadoop.mapreduce.lib.db.TestDBJob.testRun

Error Message:
chmod: cannot access `/tmp/hadoop-hudson/mapred/staging/hudson-1615278512/.staging/job_local_0001': No such file or directory 

Stack Trace:
org.apache.hadoop.util.Shell$ExitCodeException: chmod: cannot access `/tmp/hadoop-hudson/mapred/staging/hudson-1615278512/.staging/job_local_0001': No such file or directory

	at org.apache.hadoop.util.Shell.runCommand(Shell.java:256)
	at org.apache.hadoop.util.Shell.run(Shell.java:183)
	at org.apache.hadoop.util.Shell$ShellCommandExecutor.execute(Shell.java:376)
	at org.apache.hadoop.util.Shell.execCommand(Shell.java:462)
	at org.apache.hadoop.util.Shell.execCommand(Shell.java:445)
	at org.apache.hadoop.fs.RawLocalFileSystem.execCommand(RawLocalFileSystem.java:560)
	at org.apache.hadoop.fs.RawLocalFileSystem.setPermission(RawLocalFileSystem.java:551)
	at org.apache.hadoop.fs.FilterFileSystem.setPermission(FilterFileSystem.java:343)
	at org.apache.hadoop.fs.FileSystem.mkdirs(FileSystem.java:410)
	at org.apache.hadoop.mapreduce.JobSubmitter.copyAndConfigureFiles(JobSubmitter.java:166)
	at org.apache.hadoop.mapreduce.JobSubmitter.copyAndConfigureFiles(JobSubmitter.java:283)
	at org.apache.hadoop.mapreduce.JobSubmitter.submitJobInternal(JobSubmitter.java:350)
	at org.apache.hadoop.mapreduce.Job$2.run(Job.java:1037)
	at org.apache.hadoop.mapreduce.Job$2.run(Job.java:1034)
	at java.security.AccessController.doPrivileged(Native Method)
	at javax.security.auth.Subject.doAs(Subject.java:396)
	at org.apache.hadoop.security.UserGroupInformation.doAs(UserGroupInformation.java:1142)
	at org.apache.hadoop.mapreduce.Job.submit(Job.java:1034)
	at org.apache.hadoop.mapreduce.Job.waitForCompletion(Job.java:1054)
	at org.apache.hadoop.examples.DBCountPageView.run(DBCountPageView.java:409)
	at org.apache.hadoop.util.ToolRunner.run(ToolRunner.java:69)
	at org.apache.hadoop.mapreduce.lib.db.TestDBJob.__CLR3_0_2yzvxa8sx0(TestDBJob.java:36)
	at org.apache.hadoop.mapreduce.lib.db.TestDBJob.testRun(TestDBJob.java:34)


REGRESSION:  org.apache.hadoop.mapreduce.lib.db.TestDataDrivenDBInputFormat.testDateSplits

Error Message:
chmod: cannot access `/tmp/hadoop-hudson/mapred/staging/hudson1830192368/.staging/job_local_0001': No such file or directory 

Stack Trace:
org.apache.hadoop.util.Shell$ExitCodeException: chmod: cannot access `/tmp/hadoop-hudson/mapred/staging/hudson1830192368/.staging/job_local_0001': No such file or directory

	at org.apache.hadoop.util.Shell.runCommand(Shell.java:256)
	at org.apache.hadoop.util.Shell.run(Shell.java:183)
	at org.apache.hadoop.util.Shell$ShellCommandExecutor.execute(Shell.java:376)
	at org.apache.hadoop.util.Shell.execCommand(Shell.java:462)
	at org.apache.hadoop.util.Shell.execCommand(Shell.java:445)
	at org.apache.hadoop.fs.RawLocalFileSystem.execCommand(RawLocalFileSystem.java:560)
	at org.apache.hadoop.fs.RawLocalFileSystem.setPermission(RawLocalFileSystem.java:551)
	at org.apache.hadoop.fs.FilterFileSystem.setPermission(FilterFileSystem.java:343)
	at org.apache.hadoop.fs.FileSystem.mkdirs(FileSystem.java:410)
	at org.apache.hadoop.mapreduce.JobSubmitter.copyAndConfigureFiles(JobSubmitter.java:166)
	at org.apache.hadoop.mapreduce.JobSubmitter.copyAndConfigureFiles(JobSubmitter.java:283)
	at org.apache.hadoop.mapreduce.JobSubmitter.submitJobInternal(JobSubmitter.java:350)
	at org.apache.hadoop.mapreduce.Job$2.run(Job.java:1037)
	at org.apache.hadoop.mapreduce.Job$2.run(Job.java:1034)
	at java.security.AccessController.doPrivileged(Native Method)
	at javax.security.auth.Subject.doAs(Subject.java:396)
	at org.apache.hadoop.security.UserGroupInformation.doAs(UserGroupInformation.java:1142)
	at org.apache.hadoop.mapreduce.Job.submit(Job.java:1034)
	at org.apache.hadoop.mapreduce.Job.waitForCompletion(Job.java:1054)
	at org.apache.hadoop.mapreduce.lib.db.TestDataDrivenDBInputFormat.__CLR3_0_2klofnkp3i(TestDataDrivenDBInputFormat.java:214)
	at org.apache.hadoop.mapreduce.lib.db.TestDataDrivenDBInputFormat.testDateSplits(TestDataDrivenDBInputFormat.java:173)


REGRESSION:  org.apache.hadoop.mapreduce.lib.fieldsel.TestMRFieldSelection.testFieldSelection

Error Message:
chmod: cannot access `/tmp/hadoop-hudson/mapred/staging/hudson433998624/.staging/job_local_0001': No such file or directory 

Stack Trace:
org.apache.hadoop.util.Shell$ExitCodeException: chmod: cannot access `/tmp/hadoop-hudson/mapred/staging/hudson433998624/.staging/job_local_0001': No such file or directory

	at org.apache.hadoop.util.Shell.runCommand(Shell.java:256)
	at org.apache.hadoop.util.Shell.run(Shell.java:183)
	at org.apache.hadoop.util.Shell$ShellCommandExecutor.execute(Shell.java:376)
	at org.apache.hadoop.util.Shell.execCommand(Shell.java:462)
	at org.apache.hadoop.util.Shell.execCommand(Shell.java:445)
	at org.apache.hadoop.fs.RawLocalFileSystem.execCommand(RawLocalFileSystem.java:560)
	at org.apache.hadoop.fs.RawLocalFileSystem.setPermission(RawLocalFileSystem.java:551)
	at org.apache.hadoop.fs.FilterFileSystem.setPermission(FilterFileSystem.java:343)
	at org.apache.hadoop.fs.FileSystem.mkdirs(FileSystem.java:410)
	at org.apache.hadoop.mapreduce.JobSubmitter.copyAndConfigureFiles(JobSubmitter.java:166)
	at org.apache.hadoop.mapreduce.JobSubmitter.copyAndConfigureFiles(JobSubmitter.java:283)
	at org.apache.hadoop.mapreduce.JobSubmitter.submitJobInternal(JobSubmitter.java:350)
	at org.apache.hadoop.mapreduce.Job$2.run(Job.java:1037)
	at org.apache.hadoop.mapreduce.Job$2.run(Job.java:1034)
	at java.security.AccessController.doPrivileged(Native Method)
	at javax.security.auth.Subject.doAs(Subject.java:396)
	at org.apache.hadoop.security.UserGroupInformation.doAs(UserGroupInformation.java:1142)
	at org.apache.hadoop.mapreduce.Job.submit(Job.java:1034)
	at org.apache.hadoop.mapreduce.Job.waitForCompletion(Job.java:1054)
	at org.apache.hadoop.mapreduce.lib.fieldsel.TestMRFieldSelection.launch(TestMRFieldSelection.java:67)
	at org.apache.hadoop.mapreduce.lib.fieldsel.TestMRFieldSelection.__CLR3_0_2asm65nj35(TestMRFieldSelection.java:38)
	at org.apache.hadoop.mapreduce.lib.fieldsel.TestMRFieldSelection.testFieldSelection(TestMRFieldSelection.java:37)


REGRESSION:  org.apache.hadoop.mapreduce.lib.input.TestMultipleInputs.testDoMultipleInputs

Error Message:
chmod: cannot access `/tmp/hadoop-hudson/mapred/staging/hudson-673946716/.staging/job_local_0001': No such file or directory 

Stack Trace:
org.apache.hadoop.util.Shell$ExitCodeException: chmod: cannot access `/tmp/hadoop-hudson/mapred/staging/hudson-673946716/.staging/job_local_0001': No such file or directory

	at org.apache.hadoop.util.Shell.runCommand(Shell.java:256)
	at org.apache.hadoop.util.Shell.run(Shell.java:183)
	at org.apache.hadoop.util.Shell$ShellCommandExecutor.execute(Shell.java:376)
	at org.apache.hadoop.util.Shell.execCommand(Shell.java:462)
	at org.apache.hadoop.util.Shell.execCommand(Shell.java:445)
	at org.apache.hadoop.fs.RawLocalFileSystem.execCommand(RawLocalFileSystem.java:560)
	at org.apache.hadoop.fs.RawLocalFileSystem.setPermission(RawLocalFileSystem.java:551)
	at org.apache.hadoop.fs.FilterFileSystem.setPermission(FilterFileSystem.java:343)
	at org.apache.hadoop.fs.FileSystem.mkdirs(FileSystem.java:410)
	at org.apache.hadoop.mapreduce.JobSubmitter.copyAndConfigureFiles(JobSubmitter.java:166)
	at org.apache.hadoop.mapreduce.JobSubmitter.copyAndConfigureFiles(JobSubmitter.java:283)
	at org.apache.hadoop.mapreduce.JobSubmitter.submitJobInternal(JobSubmitter.java:350)
	at org.apache.hadoop.mapreduce.Job$2.run(Job.java:1037)
	at org.apache.hadoop.mapreduce.Job$2.run(Job.java:1034)
	at java.security.AccessController.doPrivileged(Native Method)
	at javax.security.auth.Subject.doAs(Subject.java:396)
	at org.apache.hadoop.security.UserGroupInformation.doAs(UserGroupInformation.java:1142)
	at org.apache.hadoop.mapreduce.Job.submit(Job.java:1034)
	at org.apache.hadoop.mapreduce.Job.waitForCompletion(Job.java:1054)
	at org.apache.hadoop.mapreduce.lib.input.TestMultipleInputs.__CLR3_0_2l9fkqlt11(TestMultipleInputs.java:122)
	at org.apache.hadoop.mapreduce.lib.input.TestMultipleInputs.testDoMultipleInputs(TestMultipleInputs.java:85)


REGRESSION:  org.apache.hadoop.mapreduce.lib.jobcontrol.TestMapReduceJobControl.testJobControlWithKillJob

Error Message:
Timeout occurred. Please note the time in the report does not reflect the time until the timeout.

Stack Trace:
junit.framework.AssertionFailedError: Timeout occurred. Please note the time in the report does not reflect the time until the timeout.


REGRESSION:  org.apache.hadoop.mapreduce.lib.join.TestJoinDatamerge.testSimpleInnerJoin

Error Message:
chmod: cannot access `/tmp/hadoop-hudson/mapred/staging/hudson-1265276742/.staging/job_local_0001': No such file or directory 

Stack Trace:
org.apache.hadoop.util.Shell$ExitCodeException: chmod: cannot access `/tmp/hadoop-hudson/mapred/staging/hudson-1265276742/.staging/job_local_0001': No such file or directory

	at org.apache.hadoop.util.Shell.runCommand(Shell.java:256)
	at org.apache.hadoop.util.Shell.run(Shell.java:183)
	at org.apache.hadoop.util.Shell$ShellCommandExecutor.execute(Shell.java:376)
	at org.apache.hadoop.util.Shell.execCommand(Shell.java:462)
	at org.apache.hadoop.util.Shell.execCommand(Shell.java:445)
	at org.apache.hadoop.fs.RawLocalFileSystem.execCommand(RawLocalFileSystem.java:560)
	at org.apache.hadoop.fs.RawLocalFileSystem.setPermission(RawLocalFileSystem.java:551)
	at org.apache.hadoop.fs.FilterFileSystem.setPermission(FilterFileSystem.java:343)
	at org.apache.hadoop.fs.FileSystem.mkdirs(FileSystem.java:410)
	at org.apache.hadoop.mapreduce.JobSubmitter.copyAndConfigureFiles(JobSubmitter.java:166)
	at org.apache.hadoop.mapreduce.JobSubmitter.copyAndConfigureFiles(JobSubmitter.java:283)
	at org.apache.hadoop.mapreduce.JobSubmitter.submitJobInternal(JobSubmitter.java:350)
	at org.apache.hadoop.mapreduce.Job$2.run(Job.java:1037)
	at org.apache.hadoop.mapreduce.Job$2.run(Job.java:1034)
	at java.security.AccessController.doPrivileged(Native Method)
	at javax.security.auth.Subject.doAs(Subject.java:396)
	at org.apache.hadoop.security.UserGroupInformation.doAs(UserGroupInformation.java:1142)
	at org.apache.hadoop.mapreduce.Job.submit(Job.java:1034)
	at org.apache.hadoop.mapreduce.Job.waitForCompletion(Job.java:1054)
	at org.apache.hadoop.mapreduce.lib.join.TestJoinDatamerge.joinAs(TestJoinDatamerge.java:267)
	at org.apache.hadoop.mapreduce.lib.join.TestJoinDatamerge.__CLR3_0_239fxnh66u(TestJoinDatamerge.java:276)
	at org.apache.hadoop.mapreduce.lib.join.TestJoinDatamerge.testSimpleInnerJoin(TestJoinDatamerge.java:275)
	at junit.extensions.TestDecorator.basicRun(TestDecorator.java:24)
	at junit.extensions.TestSetup$1.protect(TestSetup.java:23)
	at junit.extensions.TestSetup.run(TestSetup.java:27)


REGRESSION:  org.apache.hadoop.mapreduce.lib.join.TestJoinDatamerge.testSimpleOuterJoin

Error Message:
chmod: cannot access `/tmp/hadoop-hudson/mapred/staging/hudson-128586589/.staging/job_local_0002': No such file or directory 

Stack Trace:
org.apache.hadoop.util.Shell$ExitCodeException: chmod: cannot access `/tmp/hadoop-hudson/mapred/staging/hudson-128586589/.staging/job_local_0002': No such file or directory

	at org.apache.hadoop.util.Shell.runCommand(Shell.java:256)
	at org.apache.hadoop.util.Shell.run(Shell.java:183)
	at org.apache.hadoop.util.Shell$ShellCommandExecutor.execute(Shell.java:376)
	at org.apache.hadoop.util.Shell.execCommand(Shell.java:462)
	at org.apache.hadoop.util.Shell.execCommand(Shell.java:445)
	at org.apache.hadoop.fs.RawLocalFileSystem.execCommand(RawLocalFileSystem.java:560)
	at org.apache.hadoop.fs.RawLocalFileSystem.setPermission(RawLocalFileSystem.java:551)
	at org.apache.hadoop.fs.FilterFileSystem.setPermission(FilterFileSystem.java:343)
	at org.apache.hadoop.fs.FileSystem.mkdirs(FileSystem.java:410)
	at org.apache.hadoop.mapreduce.JobSubmitter.copyAndConfigureFiles(JobSubmitter.java:166)
	at org.apache.hadoop.mapreduce.JobSubmitter.copyAndConfigureFiles(JobSubmitter.java:283)
	at org.apache.hadoop.mapreduce.JobSubmitter.submitJobInternal(JobSubmitter.java:350)
	at org.apache.hadoop.mapreduce.Job$2.run(Job.java:1037)
	at org.apache.hadoop.mapreduce.Job$2.run(Job.java:1034)
	at java.security.AccessController.doPrivileged(Native Method)
	at javax.security.auth.Subject.doAs(Subject.java:396)
	at org.apache.hadoop.security.UserGroupInformation.doAs(UserGroupInformation.java:1142)
	at org.apache.hadoop.mapreduce.Job.submit(Job.java:1034)
	at org.apache.hadoop.mapreduce.Job.waitForCompletion(Job.java:1054)
	at org.apache.hadoop.mapreduce.lib.join.TestJoinDatamerge.joinAs(TestJoinDatamerge.java:267)
	at org.apache.hadoop.mapreduce.lib.join.TestJoinDatamerge.__CLR3_0_2abzcwo66w(TestJoinDatamerge.java:280)
	at org.apache.hadoop.mapreduce.lib.join.TestJoinDatamerge.testSimpleOuterJoin(TestJoinDatamerge.java:279)
	at junit.extensions.TestDecorator.basicRun(TestDecorator.java:24)
	at junit.extensions.TestSetup$1.protect(TestSetup.java:23)
	at junit.extensions.TestSetup.run(TestSetup.java:27)


REGRESSION:  org.apache.hadoop.mapreduce.lib.join.TestJoinDatamerge.testSimpleOverride

Error Message:
chmod: cannot access `/tmp/hadoop-hudson/mapred/staging/hudson1958214528/.staging/job_local_0003': No such file or directory 

Stack Trace:
org.apache.hadoop.util.Shell$ExitCodeException: chmod: cannot access `/tmp/hadoop-hudson/mapred/staging/hudson1958214528/.staging/job_local_0003': No such file or directory

	at org.apache.hadoop.util.Shell.runCommand(Shell.java:256)
	at org.apache.hadoop.util.Shell.run(Shell.java:183)
	at org.apache.hadoop.util.Shell$ShellCommandExecutor.execute(Shell.java:376)
	at org.apache.hadoop.util.Shell.execCommand(Shell.java:462)
	at org.apache.hadoop.util.Shell.execCommand(Shell.java:445)
	at org.apache.hadoop.fs.RawLocalFileSystem.execCommand(RawLocalFileSystem.java:560)
	at org.apache.hadoop.fs.RawLocalFileSystem.setPermission(RawLocalFileSystem.java:551)
	at org.apache.hadoop.fs.FilterFileSystem.setPermission(FilterFileSystem.java:343)
	at org.apache.hadoop.fs.FileSystem.mkdirs(FileSystem.java:410)
	at org.apache.hadoop.mapreduce.JobSubmitter.copyAndConfigureFiles(JobSubmitter.java:166)
	at org.apache.hadoop.mapreduce.JobSubmitter.copyAndConfigureFiles(JobSubmitter.java:283)
	at org.apache.hadoop.mapreduce.JobSubmitter.submitJobInternal(JobSubmitter.java:350)
	at org.apache.hadoop.mapreduce.Job$2.run(Job.java:1037)
	at org.apache.hadoop.mapreduce.Job$2.run(Job.java:1034)
	at java.security.AccessController.doPrivileged(Native Method)
	at javax.security.auth.Subject.doAs(Subject.java:396)
	at org.apache.hadoop.security.UserGroupInformation.doAs(UserGroupInformation.java:1142)
	at org.apache.hadoop.mapreduce.Job.submit(Job.java:1034)
	at org.apache.hadoop.mapreduce.Job.waitForCompletion(Job.java:1054)
	at org.apache.hadoop.mapreduce.lib.join.TestJoinDatamerge.joinAs(TestJoinDatamerge.java:267)
	at org.apache.hadoop.mapreduce.lib.join.TestJoinDatamerge.__CLR3_0_2a19all67v(TestJoinDatamerge.java:327)
	at org.apache.hadoop.mapreduce.lib.join.TestJoinDatamerge.testSimpleOverride(TestJoinDatamerge.java:326)
	at junit.extensions.TestDecorator.basicRun(TestDecorator.java:24)
	at junit.extensions.TestSetup$1.protect(TestSetup.java:23)
	at junit.extensions.TestSetup.run(TestSetup.java:27)


REGRESSION:  org.apache.hadoop.mapreduce.lib.join.TestJoinDatamerge.testNestedJoin

Error Message:
chmod: cannot access `/tmp/hadoop-hudson/mapred/staging/hudson1209422618/.staging/job_local_0004': No such file or directory 

Stack Trace:
org.apache.hadoop.util.Shell$ExitCodeException: chmod: cannot access `/tmp/hadoop-hudson/mapred/staging/hudson1209422618/.staging/job_local_0004': No such file or directory

	at org.apache.hadoop.util.Shell.runCommand(Shell.java:256)
	at org.apache.hadoop.util.Shell.run(Shell.java:183)
	at org.apache.hadoop.util.Shell$ShellCommandExecutor.execute(Shell.java:376)
	at org.apache.hadoop.util.Shell.execCommand(Shell.java:462)
	at org.apache.hadoop.util.Shell.execCommand(Shell.java:445)
	at org.apache.hadoop.fs.RawLocalFileSystem.execCommand(RawLocalFileSystem.java:560)
	at org.apache.hadoop.fs.RawLocalFileSystem.setPermission(RawLocalFileSystem.java:551)
	at org.apache.hadoop.fs.FilterFileSystem.setPermission(FilterFileSystem.java:343)
	at org.apache.hadoop.fs.FileSystem.mkdirs(FileSystem.java:410)
	at org.apache.hadoop.mapreduce.JobSubmitter.copyAndConfigureFiles(JobSubmitter.java:166)
	at org.apache.hadoop.mapreduce.JobSubmitter.copyAndConfigureFiles(JobSubmitter.java:283)
	at org.apache.hadoop.mapreduce.JobSubmitter.submitJobInternal(JobSubmitter.java:350)
	at org.apache.hadoop.mapreduce.Job$2.run(Job.java:1037)
	at org.apache.hadoop.mapreduce.Job$2.run(Job.java:1034)
	at java.security.AccessController.doPrivileged(Native Method)
	at javax.security.auth.Subject.doAs(Subject.java:396)
	at org.apache.hadoop.security.UserGroupInformation.doAs(UserGroupInformation.java:1142)
	at org.apache.hadoop.mapreduce.Job.submit(Job.java:1034)
	at org.apache.hadoop.mapreduce.Job.waitForCompletion(Job.java:1054)
	at org.apache.hadoop.mapreduce.lib.join.TestJoinDatamerge.__CLR3_0_2fiduje67x(TestJoinDatamerge.java:390)
	at org.apache.hadoop.mapreduce.lib.join.TestJoinDatamerge.testNestedJoin(TestJoinDatamerge.java:330)
	at junit.extensions.TestDecorator.basicRun(TestDecorator.java:24)
	at junit.extensions.TestSetup$1.protect(TestSetup.java:23)
	at junit.extensions.TestSetup.run(TestSetup.java:27)


REGRESSION:  org.apache.hadoop.mapreduce.lib.join.TestJoinDatamerge.testEmptyJoin

Error Message:
chmod: cannot access `/tmp/hadoop-hudson/mapred/staging/hudson-1158527152/.staging/job_local_0005': No such file or directory 

Stack Trace:
org.apache.hadoop.util.Shell$ExitCodeException: chmod: cannot access `/tmp/hadoop-hudson/mapred/staging/hudson-1158527152/.staging/job_local_0005': No such file or directory

	at org.apache.hadoop.util.Shell.runCommand(Shell.java:256)
	at org.apache.hadoop.util.Shell.run(Shell.java:183)
	at org.apache.hadoop.util.Shell$ShellCommandExecutor.execute(Shell.java:376)
	at org.apache.hadoop.util.Shell.execCommand(Shell.java:462)
	at org.apache.hadoop.util.Shell.execCommand(Shell.java:445)
	at org.apache.hadoop.fs.RawLocalFileSystem.execCommand(RawLocalFileSystem.java:560)
	at org.apache.hadoop.fs.RawLocalFileSystem.setPermission(RawLocalFileSystem.java:551)
	at org.apache.hadoop.fs.FilterFileSystem.setPermission(FilterFileSystem.java:343)
	at org.apache.hadoop.fs.FileSystem.mkdirs(FileSystem.java:410)
	at org.apache.hadoop.mapreduce.JobSubmitter.copyAndConfigureFiles(JobSubmitter.java:166)
	at org.apache.hadoop.mapreduce.JobSubmitter.copyAndConfigureFiles(JobSubmitter.java:283)
	at org.apache.hadoop.mapreduce.JobSubmitter.submitJobInternal(JobSubmitter.java:350)
	at org.apache.hadoop.mapreduce.Job$2.run(Job.java:1037)
	at org.apache.hadoop.mapreduce.Job$2.run(Job.java:1034)
	at java.security.AccessController.doPrivileged(Native Method)
	at javax.security.auth.Subject.doAs(Subject.java:396)
	at org.apache.hadoop.security.UserGroupInformation.doAs(UserGroupInformation.java:1142)
	at org.apache.hadoop.mapreduce.Job.submit(Job.java:1034)
	at org.apache.hadoop.mapreduce.Job.waitForCompletion(Job.java:1054)
	at org.apache.hadoop.mapreduce.lib.join.TestJoinDatamerge.__CLR3_0_2f6b0b06aj(TestJoinDatamerge.java:442)
	at org.apache.hadoop.mapreduce.lib.join.TestJoinDatamerge.testEmptyJoin(TestJoinDatamerge.java:425)
	at junit.extensions.TestDecorator.basicRun(TestDecorator.java:24)
	at junit.extensions.TestSetup$1.protect(TestSetup.java:23)
	at junit.extensions.TestSetup.run(TestSetup.java:27)


REGRESSION:  org.apache.hadoop.mapreduce.lib.map.TestMultithreadedMapper.testOKRun

Error Message:
chmod: cannot access `/tmp/hadoop-hudson/mapred/staging/hudson75336370/.staging/job_local_0001': No such file or directory 

Stack Trace:
org.apache.hadoop.util.Shell$ExitCodeException: chmod: cannot access `/tmp/hadoop-hudson/mapred/staging/hudson75336370/.staging/job_local_0001': No such file or directory

	at org.apache.hadoop.util.Shell.runCommand(Shell.java:256)
	at org.apache.hadoop.util.Shell.run(Shell.java:183)
	at org.apache.hadoop.util.Shell$ShellCommandExecutor.execute(Shell.java:376)
	at org.apache.hadoop.util.Shell.execCommand(Shell.java:462)
	at org.apache.hadoop.util.Shell.execCommand(Shell.java:445)
	at org.apache.hadoop.fs.RawLocalFileSystem.execCommand(RawLocalFileSystem.java:560)
	at org.apache.hadoop.fs.RawLocalFileSystem.setPermission(RawLocalFileSystem.java:551)
	at org.apache.hadoop.fs.FilterFileSystem.setPermission(FilterFileSystem.java:343)
	at org.apache.hadoop.fs.FileSystem.mkdirs(FileSystem.java:410)
	at org.apache.hadoop.mapreduce.JobSubmitter.copyAndConfigureFiles(JobSubmitter.java:166)
	at org.apache.hadoop.mapreduce.JobSubmitter.copyAndConfigureFiles(JobSubmitter.java:283)
	at org.apache.hadoop.mapreduce.JobSubmitter.submitJobInternal(JobSubmitter.java:350)
	at org.apache.hadoop.mapreduce.Job$2.run(Job.java:1037)
	at org.apache.hadoop.mapreduce.Job$2.run(Job.java:1034)
	at java.security.AccessController.doPrivileged(Native Method)
	at javax.security.auth.Subject.doAs(Subject.java:396)
	at org.apache.hadoop.security.UserGroupInformation.doAs(UserGroupInformation.java:1142)
	at org.apache.hadoop.mapreduce.Job.submit(Job.java:1034)
	at org.apache.hadoop.mapreduce.Job.waitForCompletion(Job.java:1054)
	at org.apache.hadoop.mapreduce.lib.map.TestMultithreadedMapper.run(TestMultithreadedMapper.java:69)
	at org.apache.hadoop.mapreduce.lib.map.TestMultithreadedMapper.__CLR3_0_2dhspyclgy(TestMultithreadedMapper.java:37)
	at org.apache.hadoop.mapreduce.lib.map.TestMultithreadedMapper.testOKRun(TestMultithreadedMapper.java:36)


REGRESSION:  org.apache.hadoop.mapreduce.lib.map.TestMultithreadedMapper.testIOExRun

Error Message:
chmod: cannot access `/tmp/hadoop-hudson/mapred/staging/hudson1555700496/.staging/job_local_0002': No such file or directory 

Stack Trace:
org.apache.hadoop.util.Shell$ExitCodeException: chmod: cannot access `/tmp/hadoop-hudson/mapred/staging/hudson1555700496/.staging/job_local_0002': No such file or directory

	at org.apache.hadoop.util.Shell.runCommand(Shell.java:256)
	at org.apache.hadoop.util.Shell.run(Shell.java:183)
	at org.apache.hadoop.util.Shell$ShellCommandExecutor.execute(Shell.java:376)
	at org.apache.hadoop.util.Shell.execCommand(Shell.java:462)
	at org.apache.hadoop.util.Shell.execCommand(Shell.java:445)
	at org.apache.hadoop.fs.RawLocalFileSystem.execCommand(RawLocalFileSystem.java:560)
	at org.apache.hadoop.fs.RawLocalFileSystem.setPermission(RawLocalFileSystem.java:551)
	at org.apache.hadoop.fs.FilterFileSystem.setPermission(FilterFileSystem.java:343)
	at org.apache.hadoop.fs.FileSystem.mkdirs(FileSystem.java:410)
	at org.apache.hadoop.mapreduce.JobSubmitter.copyAndConfigureFiles(JobSubmitter.java:166)
	at org.apache.hadoop.mapreduce.JobSubmitter.copyAndConfigureFiles(JobSubmitter.java:283)
	at org.apache.hadoop.mapreduce.JobSubmitter.submitJobInternal(JobSubmitter.java:350)
	at org.apache.hadoop.mapreduce.Job$2.run(Job.java:1037)
	at org.apache.hadoop.mapreduce.Job$2.run(Job.java:1034)
	at java.security.AccessController.doPrivileged(Native Method)
	at javax.security.auth.Subject.doAs(Subject.java:396)
	at org.apache.hadoop.security.UserGroupInformation.doAs(UserGroupInformation.java:1142)
	at org.apache.hadoop.mapreduce.Job.submit(Job.java:1034)
	at org.apache.hadoop.mapreduce.Job.waitForCompletion(Job.java:1054)
	at org.apache.hadoop.mapreduce.lib.map.TestMultithreadedMapper.run(TestMultithreadedMapper.java:69)
	at org.apache.hadoop.mapreduce.lib.map.TestMultithreadedMapper.__CLR3_0_21nnwsnlh0(TestMultithreadedMapper.java:41)
	at org.apache.hadoop.mapreduce.lib.map.TestMultithreadedMapper.testIOExRun(TestMultithreadedMapper.java:40)


REGRESSION:  org.apache.hadoop.mapreduce.lib.map.TestMultithreadedMapper.testRuntimeExRun

Error Message:
chmod: cannot access `/tmp/hadoop-hudson/mapred/staging/hudson604532154/.staging/job_local_0003': No such file or directory 

Stack Trace:
org.apache.hadoop.util.Shell$ExitCodeException: chmod: cannot access `/tmp/hadoop-hudson/mapred/staging/hudson604532154/.staging/job_local_0003': No such file or directory

	at org.apache.hadoop.util.Shell.runCommand(Shell.java:256)
	at org.apache.hadoop.util.Shell.run(Shell.java:183)
	at org.apache.hadoop.util.Shell$ShellCommandExecutor.execute(Shell.java:376)
	at org.apache.hadoop.util.Shell.execCommand(Shell.java:462)
	at org.apache.hadoop.util.Shell.execCommand(Shell.java:445)
	at org.apache.hadoop.fs.RawLocalFileSystem.execCommand(RawLocalFileSystem.java:560)
	at org.apache.hadoop.fs.RawLocalFileSystem.setPermission(RawLocalFileSystem.java:551)
	at org.apache.hadoop.fs.FilterFileSystem.setPermission(FilterFileSystem.java:343)
	at org.apache.hadoop.fs.FileSystem.mkdirs(FileSystem.java:410)
	at org.apache.hadoop.mapreduce.JobSubmitter.copyAndConfigureFiles(JobSubmitter.java:166)
	at org.apache.hadoop.mapreduce.JobSubmitter.copyAndConfigureFiles(JobSubmitter.java:283)
	at org.apache.hadoop.mapreduce.JobSubmitter.submitJobInternal(JobSubmitter.java:350)
	at org.apache.hadoop.mapreduce.Job$2.run(Job.java:1037)
	at org.apache.hadoop.mapreduce.Job$2.run(Job.java:1034)
	at java.security.AccessController.doPrivileged(Native Method)
	at javax.security.auth.Subject.doAs(Subject.java:396)
	at org.apache.hadoop.security.UserGroupInformation.doAs(UserGroupInformation.java:1142)
	at org.apache.hadoop.mapreduce.Job.submit(Job.java:1034)
	at org.apache.hadoop.mapreduce.Job.waitForCompletion(Job.java:1054)
	at org.apache.hadoop.mapreduce.lib.map.TestMultithreadedMapper.run(TestMultithreadedMapper.java:69)
	at org.apache.hadoop.mapreduce.lib.map.TestMultithreadedMapper.__CLR3_0_2zf5zzblh2(TestMultithreadedMapper.java:44)
	at org.apache.hadoop.mapreduce.lib.map.TestMultithreadedMapper.testRuntimeExRun(TestMultithreadedMapper.java:43)


REGRESSION:  org.apache.hadoop.mapreduce.lib.output.TestMRMultipleOutputs.testWithoutCounters

Error Message:
chmod: cannot access `/tmp/hadoop-hudson/mapred/staging/hudson236193241/.staging/job_local_0001': No such file or directory 

Stack Trace:
org.apache.hadoop.util.Shell$ExitCodeException: chmod: cannot access `/tmp/hadoop-hudson/mapred/staging/hudson236193241/.staging/job_local_0001': No such file or directory

	at org.apache.hadoop.util.Shell.runCommand(Shell.java:256)
	at org.apache.hadoop.util.Shell.run(Shell.java:183)
	at org.apache.hadoop.util.Shell$ShellCommandExecutor.execute(Shell.java:376)
	at org.apache.hadoop.util.Shell.execCommand(Shell.java:462)
	at org.apache.hadoop.util.Shell.execCommand(Shell.java:445)
	at org.apache.hadoop.fs.RawLocalFileSystem.execCommand(RawLocalFileSystem.java:560)
	at org.apache.hadoop.fs.RawLocalFileSystem.setPermission(RawLocalFileSystem.java:551)
	at org.apache.hadoop.fs.FilterFileSystem.setPermission(FilterFileSystem.java:343)
	at org.apache.hadoop.fs.FileSystem.mkdirs(FileSystem.java:410)
	at org.apache.hadoop.mapreduce.JobSubmitter.copyAndConfigureFiles(JobSubmitter.java:166)
	at org.apache.hadoop.mapreduce.JobSubmitter.copyAndConfigureFiles(JobSubmitter.java:283)
	at org.apache.hadoop.mapreduce.JobSubmitter.submitJobInternal(JobSubmitter.java:350)
	at org.apache.hadoop.mapreduce.Job$2.run(Job.java:1037)
	at org.apache.hadoop.mapreduce.Job$2.run(Job.java:1034)
	at java.security.AccessController.doPrivileged(Native Method)
	at javax.security.auth.Subject.doAs(Subject.java:396)
	at org.apache.hadoop.security.UserGroupInformation.doAs(UserGroupInformation.java:1142)
	at org.apache.hadoop.mapreduce.Job.submit(Job.java:1034)
	at org.apache.hadoop.mapreduce.Job.waitForCompletion(Job.java:1054)
	at org.apache.hadoop.mapreduce.lib.output.TestMRMultipleOutputs._testMultipleOutputs(TestMRMultipleOutputs.java:88)
	at org.apache.hadoop.mapreduce.lib.output.TestMRMultipleOutputs.__CLR3_0_27rxkdod8b(TestMRMultipleOutputs.java:42)
	at org.apache.hadoop.mapreduce.lib.output.TestMRMultipleOutputs.testWithoutCounters(TestMRMultipleOutputs.java:41)


REGRESSION:  org.apache.hadoop.mapreduce.lib.output.TestMRMultipleOutputs.testWithCounters

Error Message:
chmod: cannot access `/tmp/hadoop-hudson/mapred/staging/hudson1519271122/.staging/job_local_0002': No such file or directory 

Stack Trace:
org.apache.hadoop.util.Shell$ExitCodeException: chmod: cannot access `/tmp/hadoop-hudson/mapred/staging/hudson1519271122/.staging/job_local_0002': No such file or directory

	at org.apache.hadoop.util.Shell.runCommand(Shell.java:256)
	at org.apache.hadoop.util.Shell.run(Shell.java:183)
	at org.apache.hadoop.util.Shell$ShellCommandExecutor.execute(Shell.java:376)
	at org.apache.hadoop.util.Shell.execCommand(Shell.java:462)
	at org.apache.hadoop.util.Shell.execCommand(Shell.java:445)
	at org.apache.hadoop.fs.RawLocalFileSystem.execCommand(RawLocalFileSystem.java:560)
	at org.apache.hadoop.fs.RawLocalFileSystem.setPermission(RawLocalFileSystem.java:551)
	at org.apache.hadoop.fs.FilterFileSystem.setPermission(FilterFileSystem.java:343)
	at org.apache.hadoop.fs.FileSystem.mkdirs(FileSystem.java:410)
	at org.apache.hadoop.mapreduce.JobSubmitter.copyAndConfigureFiles(JobSubmitter.java:166)
	at org.apache.hadoop.mapreduce.JobSubmitter.copyAndConfigureFiles(JobSubmitter.java:283)
	at org.apache.hadoop.mapreduce.JobSubmitter.submitJobInternal(JobSubmitter.java:350)
	at org.apache.hadoop.mapreduce.Job$2.run(Job.java:1037)
	at org.apache.hadoop.mapreduce.Job$2.run(Job.java:1034)
	at java.security.AccessController.doPrivileged(Native Method)
	at javax.security.auth.Subject.doAs(Subject.java:396)
	at org.apache.hadoop.security.UserGroupInformation.doAs(UserGroupInformation.java:1142)
	at org.apache.hadoop.mapreduce.Job.submit(Job.java:1034)
	at org.apache.hadoop.mapreduce.Job.waitForCompletion(Job.java:1054)
	at org.apache.hadoop.mapreduce.lib.output.TestMRMultipleOutputs._testMultipleOutputs(TestMRMultipleOutputs.java:88)
	at org.apache.hadoop.mapreduce.lib.output.TestMRMultipleOutputs.__CLR3_0_2435lo6d8d(TestMRMultipleOutputs.java:46)
	at org.apache.hadoop.mapreduce.lib.output.TestMRMultipleOutputs.testWithCounters(TestMRMultipleOutputs.java:45)


REGRESSION:  org.apache.hadoop.mapreduce.lib.partition.TestMRKeyFieldBasedComparator.testBasicUnixComparator

Error Message:
chmod: cannot access `/tmp/hadoop-hudson/mapred/staging/hudson-1804318819/.staging/job_local_0001': No such file or directory 

Stack Trace:
org.apache.hadoop.util.Shell$ExitCodeException: chmod: cannot access `/tmp/hadoop-hudson/mapred/staging/hudson-1804318819/.staging/job_local_0001': No such file or directory

	at org.apache.hadoop.util.Shell.runCommand(Shell.java:256)
	at org.apache.hadoop.util.Shell.run(Shell.java:183)
	at org.apache.hadoop.util.Shell$ShellCommandExecutor.execute(Shell.java:376)
	at org.apache.hadoop.util.Shell.execCommand(Shell.java:462)
	at org.apache.hadoop.util.Shell.execCommand(Shell.java:445)
	at org.apache.hadoop.fs.RawLocalFileSystem.execCommand(RawLocalFileSystem.java:560)
	at org.apache.hadoop.fs.RawLocalFileSystem.setPermission(RawLocalFileSystem.java:551)
	at org.apache.hadoop.fs.FilterFileSystem.setPermission(FilterFileSystem.java:343)
	at org.apache.hadoop.fs.FileSystem.mkdirs(FileSystem.java:410)
	at org.apache.hadoop.mapreduce.JobSubmitter.copyAndConfigureFiles(JobSubmitter.java:166)
	at org.apache.hadoop.mapreduce.JobSubmitter.copyAndConfigureFiles(JobSubmitter.java:283)
	at org.apache.hadoop.mapreduce.JobSubmitter.submitJobInternal(JobSubmitter.java:350)
	at org.apache.hadoop.mapreduce.Job$2.run(Job.java:1037)
	at org.apache.hadoop.mapreduce.Job$2.run(Job.java:1034)
	at java.security.AccessController.doPrivileged(Native Method)
	at javax.security.auth.Subject.doAs(Subject.java:396)
	at org.apache.hadoop.security.UserGroupInformation.doAs(UserGroupInformation.java:1142)
	at org.apache.hadoop.mapreduce.Job.submit(Job.java:1034)
	at org.apache.hadoop.mapreduce.Job.waitForCompletion(Job.java:1054)
	at org.apache.hadoop.mapreduce.lib.partition.TestMRKeyFieldBasedComparator.testComparator(TestMRKeyFieldBasedComparator.java:68)
	at org.apache.hadoop.mapreduce.lib.partition.TestMRKeyFieldBasedComparator.__CLR3_0_2efq8ino3x(TestMRKeyFieldBasedComparator.java:98)
	at org.apache.hadoop.mapreduce.lib.partition.TestMRKeyFieldBasedComparator.testBasicUnixComparator(TestMRKeyFieldBasedComparator.java:97)


REGRESSION:  org.apache.hadoop.record.TestRecordMR.testMapred

Error Message:
chmod: cannot access `/tmp/hadoop-hudson/mapred/staging/hudson408735661/.staging/job_local_0001': No such file or directory 

Stack Trace:
org.apache.hadoop.util.Shell$ExitCodeException: chmod: cannot access `/tmp/hadoop-hudson/mapred/staging/hudson408735661/.staging/job_local_0001': No such file or directory

	at org.apache.hadoop.util.Shell.runCommand(Shell.java:256)
	at org.apache.hadoop.util.Shell.run(Shell.java:183)
	at org.apache.hadoop.util.Shell$ShellCommandExecutor.execute(Shell.java:376)
	at org.apache.hadoop.util.Shell.execCommand(Shell.java:462)
	at org.apache.hadoop.util.Shell.execCommand(Shell.java:445)
	at org.apache.hadoop.fs.RawLocalFileSystem.execCommand(RawLocalFileSystem.java:560)
	at org.apache.hadoop.fs.RawLocalFileSystem.setPermission(RawLocalFileSystem.java:551)
	at org.apache.hadoop.fs.FilterFileSystem.setPermission(FilterFileSystem.java:343)
	at org.apache.hadoop.fs.FileSystem.mkdirs(FileSystem.java:410)
	at org.apache.hadoop.mapreduce.JobSubmitter.copyAndConfigureFiles(JobSubmitter.java:166)
	at org.apache.hadoop.mapreduce.JobSubmitter.copyAndConfigureFiles(JobSubmitter.java:283)
	at org.apache.hadoop.mapreduce.JobSubmitter.submitJobInternal(JobSubmitter.java:350)
	at org.apache.hadoop.mapreduce.Job$2.run(Job.java:1037)
	at org.apache.hadoop.mapreduce.Job$2.run(Job.java:1034)
	at java.security.AccessController.doPrivileged(Native Method)
	at javax.security.auth.Subject.doAs(Subject.java:396)
	at org.apache.hadoop.security.UserGroupInformation.doAs(UserGroupInformation.java:1142)
	at org.apache.hadoop.mapreduce.Job.submit(Job.java:1034)
	at org.apache.hadoop.mapred.JobClient.submitJob(JobClient.java:536)
	at org.apache.hadoop.mapred.JobClient.runJob(JobClient.java:781)
	at org.apache.hadoop.record.TestRecordMR.launch(TestRecordMR.java:322)
	at org.apache.hadoop.record.TestRecordMR.__CLR3_0_2vmf1hq9mt(TestRecordMR.java:237)
	at org.apache.hadoop.record.TestRecordMR.testMapred(TestRecordMR.java:236)


REGRESSION:  org.apache.hadoop.tools.TestCopyFiles.testCopyFromLocalToLocal

Error Message:
File /grid/0/hudson/hudson-slave/workspace/Hadoop-Mapreduce-22-branch/trunk/build/test/data/destdat/five/six/7562379635267732620 does not exist.

Stack Trace:
java.io.FileNotFoundException: File /grid/0/hudson/hudson-slave/workspace/Hadoop-Mapreduce-22-branch/trunk/build/test/data/destdat/five/six/7562379635267732620 does not exist.
	at org.apache.hadoop.fs.RawLocalFileSystem.getFileStatus(RawLocalFileSystem.java:435)
	at org.apache.hadoop.fs.FilterFileSystem.getFileStatus(FilterFileSystem.java:301)
	at org.apache.hadoop.tools.TestCopyFiles.checkFiles(TestCopyFiles.java:169)
	at org.apache.hadoop.tools.TestCopyFiles.checkFiles(TestCopyFiles.java:159)
	at org.apache.hadoop.tools.TestCopyFiles.__CLR3_0_2qikfc3pz4(TestCopyFiles.java:271)
	at org.apache.hadoop.tools.TestCopyFiles.testCopyFromLocalToLocal(TestCopyFiles.java:264)


REGRESSION:  org.apache.hadoop.tools.TestCopyFiles.testCopyFromDfsToDfs

Error Message:
File does not exist: /destdat/three/2527353664194448514

Stack Trace:
java.io.FileNotFoundException: File does not exist: /destdat/three/2527353664194448514
	at org.apache.hadoop.hdfs.DistributedFileSystem.getFileStatus(DistributedFileSystem.java:732)
	at org.apache.hadoop.tools.TestCopyFiles.checkFiles(TestCopyFiles.java:169)
	at org.apache.hadoop.tools.TestCopyFiles.checkFiles(TestCopyFiles.java:159)
	at org.apache.hadoop.tools.TestCopyFiles.__CLR3_0_2e6yof1pzc(TestCopyFiles.java:293)
	at org.apache.hadoop.tools.TestCopyFiles.testCopyFromDfsToDfs(TestCopyFiles.java:278)


REGRESSION:  org.apache.hadoop.tools.TestCopyFiles.testEmptyDir

Error Message:
Destination directory does not exist.

Stack Trace:
junit.framework.AssertionFailedError: Destination directory does not exist.
	at org.apache.hadoop.tools.TestCopyFiles.__CLR3_0_2v5ob47pzz(TestCopyFiles.java:327)
	at org.apache.hadoop.tools.TestCopyFiles.testEmptyDir(TestCopyFiles.java:308)


REGRESSION:  org.apache.hadoop.tools.TestCopyFiles.testCopyFromLocalToDfs

Error Message:
File does not exist: /destdat/five/zero/1235307362830266820

Stack Trace:
java.io.FileNotFoundException: File does not exist: /destdat/five/zero/1235307362830266820
	at org.apache.hadoop.hdfs.DistributedFileSystem.getFileStatus(DistributedFileSystem.java:732)
	at org.apache.hadoop.tools.TestCopyFiles.checkFiles(TestCopyFiles.java:169)
	at org.apache.hadoop.tools.TestCopyFiles.checkFiles(TestCopyFiles.java:159)
	at org.apache.hadoop.tools.TestCopyFiles.__CLR3_0_2hl9wyrq0m(TestCopyFiles.java:353)
	at org.apache.hadoop.tools.TestCopyFiles.testCopyFromLocalToDfs(TestCopyFiles.java:339)


REGRESSION:  org.apache.hadoop.tools.TestCopyFiles.testCopyFromDfsToLocal

Error Message:
File /grid/0/hudson/hudson-slave/workspace/Hadoop-Mapreduce-22-branch/trunk/build/test/data/destdat/nine/five/7441823347061118822 does not exist.

Stack Trace:
java.io.FileNotFoundException: File /grid/0/hudson/hudson-slave/workspace/Hadoop-Mapreduce-22-branch/trunk/build/test/data/destdat/nine/five/7441823347061118822 does not exist.
	at org.apache.hadoop.fs.RawLocalFileSystem.getFileStatus(RawLocalFileSystem.java:435)
	at org.apache.hadoop.fs.FilterFileSystem.getFileStatus(FilterFileSystem.java:301)
	at org.apache.hadoop.tools.TestCopyFiles.checkFiles(TestCopyFiles.java:169)
	at org.apache.hadoop.tools.TestCopyFiles.checkFiles(TestCopyFiles.java:159)
	at org.apache.hadoop.tools.TestCopyFiles.__CLR3_0_2o5d2y1q17(TestCopyFiles.java:382)
	at org.apache.hadoop.tools.TestCopyFiles.testCopyFromDfsToLocal(TestCopyFiles.java:367)


REGRESSION:  org.apache.hadoop.tools.TestCopyFiles.testCopyDfsToDfsUpdateOverwrite

Error Message:
File does not exist: /destdat/zero/one/6553585531539358407

Stack Trace:
java.io.FileNotFoundException: File does not exist: /destdat/zero/one/6553585531539358407
	at org.apache.hadoop.hdfs.DistributedFileSystem.getFileStatus(DistributedFileSystem.java:732)
	at org.apache.hadoop.tools.TestCopyFiles.checkFiles(TestCopyFiles.java:169)
	at org.apache.hadoop.tools.TestCopyFiles.checkFiles(TestCopyFiles.java:159)
	at org.apache.hadoop.tools.TestCopyFiles.__CLR3_0_2ddsv4zq1t(TestCopyFiles.java:410)
	at org.apache.hadoop.tools.TestCopyFiles.testCopyDfsToDfsUpdateOverwrite(TestCopyFiles.java:395)


REGRESSION:  org.apache.hadoop.tools.TestCopyFiles.testCopyDfsToDfsUpdateWithSkipCRC

Error Message:
Dest did not get overwritten without skip crc

Stack Trace:
junit.framework.AssertionFailedError: Dest did not get overwritten without skip crc
	at org.apache.hadoop.tools.TestCopyFiles.__CLR3_0_29z237lq2q(TestCopyFiles.java:517)
	at org.apache.hadoop.tools.TestCopyFiles.testCopyDfsToDfsUpdateWithSkipCRC(TestCopyFiles.java:455)


REGRESSION:  org.apache.hadoop.tools.TestCopyFiles.testCopyDuplication

Error Message:
File /grid/0/hudson/hudson-slave/workspace/Hadoop-Mapreduce-22-branch/trunk/build/test/data/src2/srcdat/five/five/7274549606820081260 does not exist.

Stack Trace:
java.io.FileNotFoundException: File /grid/0/hudson/hudson-slave/workspace/Hadoop-Mapreduce-22-branch/trunk/build/test/data/src2/srcdat/five/five/7274549606820081260 does not exist.
	at org.apache.hadoop.fs.RawLocalFileSystem.getFileStatus(RawLocalFileSystem.java:435)
	at org.apache.hadoop.fs.FilterFileSystem.getFileStatus(FilterFileSystem.java:301)
	at org.apache.hadoop.tools.TestCopyFiles.checkFiles(TestCopyFiles.java:169)
	at org.apache.hadoop.tools.TestCopyFiles.checkFiles(TestCopyFiles.java:159)
	at org.apache.hadoop.tools.TestCopyFiles.__CLR3_0_2px84yaq3x(TestCopyFiles.java:537)
	at org.apache.hadoop.tools.TestCopyFiles.testCopyDuplication(TestCopyFiles.java:530)


REGRESSION:  org.apache.hadoop.tools.TestCopyFiles.testCopySingleFile

Error Message:
File /grid/0/hudson/hudson-slave/workspace/Hadoop-Mapreduce-22-branch/trunk/build/test/data/destdat/six/9190466935347945949 does not exist.

Stack Trace:
java.io.FileNotFoundException: File /grid/0/hudson/hudson-slave/workspace/Hadoop-Mapreduce-22-branch/trunk/build/test/data/destdat/six/9190466935347945949 does not exist.
	at org.apache.hadoop.fs.RawLocalFileSystem.getFileStatus(RawLocalFileSystem.java:435)
	at org.apache.hadoop.fs.FilterFileSystem.getFileStatus(FilterFileSystem.java:301)
	at org.apache.hadoop.tools.TestCopyFiles.checkFiles(TestCopyFiles.java:169)
	at org.apache.hadoop.tools.TestCopyFiles.checkFiles(TestCopyFiles.java:159)
	at org.apache.hadoop.tools.TestCopyFiles.__CLR3_0_29cq27iq47(TestCopyFiles.java:562)
	at org.apache.hadoop.tools.TestCopyFiles.testCopySingleFile(TestCopyFiles.java:553)


REGRESSION:  org.apache.hadoop.tools.TestCopyFiles.testBasedir

Error Message:
File does not exist: /destdat/middle/srcdat/795228563739748435

Stack Trace:
java.io.FileNotFoundException: File does not exist: /destdat/middle/srcdat/795228563739748435
	at org.apache.hadoop.hdfs.DistributedFileSystem.getFileStatus(DistributedFileSystem.java:732)
	at org.apache.hadoop.tools.TestCopyFiles.checkFiles(TestCopyFiles.java:169)
	at org.apache.hadoop.tools.TestCopyFiles.checkFiles(TestCopyFiles.java:159)
	at org.apache.hadoop.tools.TestCopyFiles.__CLR3_0_2rlzv7zq50(TestCopyFiles.java:627)
	at org.apache.hadoop.tools.TestCopyFiles.testBasedir(TestCopyFiles.java:612)


REGRESSION:  org.apache.hadoop.tools.TestCopyFiles.testPreserveOption

Error Message:
File does not exist: /destdat/five/two/3104153828073328873

Stack Trace:
java.io.FileNotFoundException: File does not exist: /destdat/five/two/3104153828073328873
	at org.apache.hadoop.hdfs.DistributedFileSystem.getFileStatus(DistributedFileSystem.java:732)
	at org.apache.hadoop.tools.TestCopyFiles.checkFiles(TestCopyFiles.java:169)
	at org.apache.hadoop.tools.TestCopyFiles.checkFiles(TestCopyFiles.java:159)
	at org.apache.hadoop.tools.TestCopyFiles.__CLR3_0_2p0v3lyq5l(TestCopyFiles.java:654)
	at org.apache.hadoop.tools.TestCopyFiles.testPreserveOption(TestCopyFiles.java:638)


REGRESSION:  org.apache.hadoop.tools.TestCopyFiles.testLimits

Error Message:
expected:<10> but was:<0>

Stack Trace:
junit.framework.AssertionFailedError: expected:<10> but was:<0>
	at org.apache.hadoop.tools.TestCopyFiles.__CLR3_0_2gnl1gvq8r(TestCopyFiles.java:816)
	at org.apache.hadoop.tools.TestCopyFiles.testLimits(TestCopyFiles.java:789)


REGRESSION:  org.apache.hadoop.tools.TestCopyFiles.testDelete

Error Message:
null expected:</2[761877667324792306 /3313615108373751321 /5006436104680917464 /7326164790843185782 /eight /eight/8896131388914899002 /four /four/eight /four/eight/8000704913396642260 /nine /nine/8401679428323926196 /nine/one /nine/one/8920675131517474447 /one /one/3547686179905378974 /one/five /one/five/6649325619394907174 /one/five/8808916434129157202 /one/zero /one/zero/239558830443870688 /seven /seven/three /seven/three/6481666156580597151 /six /six/eight /six/eight/8298357006389746119 /three /three/5509907107123009071 /three/three /three/three/5178142728305531861 /two /two/7830005248866353138 /two/six /two/six/6388344064949034032 /zero /zero/1323561891734348754 /zero/5520109598772753035] > but was:</2[532246763316379282 /4084227333667408011 /5370625402507367006 /7854258332539111476 /8112731129162512703 /8725009880478102820 /eight /eight/8445407182719436808 /eight/8739477730501882069 /eight/two /eight/two/8580552438180415626 /five /five/7967161073384272352 /five/eight /five/eight/4983863247750803395 /five/five /five/five/3524684131567789482 /four /four/7685661242132834469 /four/nine /four/nine/5155980119601329544 /nine /nine/1200098294881069247 /seven /seven/7551322209845565740 /three /three/nine /three/nine/5359766597931054961 /two /two/709270324616877532 /two/four /two/four/5827751033203300749 /zero /zero/two /zero/two/8371864177544090196] >

Stack Trace:
junit.framework.ComparisonFailure: null expected:</2[761877667324792306
/3313615108373751321
/5006436104680917464
/7326164790843185782
/eight
/eight/8896131388914899002
/four
/four/eight
/four/eight/8000704913396642260
/nine
/nine/8401679428323926196
/nine/one
/nine/one/8920675131517474447
/one
/one/3547686179905378974
/one/five
/one/five/6649325619394907174
/one/five/8808916434129157202
/one/zero
/one/zero/239558830443870688
/seven
/seven/three
/seven/three/6481666156580597151
/six
/six/eight
/six/eight/8298357006389746119
/three
/three/5509907107123009071
/three/three
/three/three/5178142728305531861
/two
/two/7830005248866353138
/two/six
/two/six/6388344064949034032
/zero
/zero/1323561891734348754
/zero/5520109598772753035]
> but was:</2[532246763316379282
/4084227333667408011
/5370625402507367006
/7854258332539111476
/8112731129162512703
/8725009880478102820
/eight
/eight/8445407182719436808
/eight/8739477730501882069
/eight/two
/eight/two/8580552438180415626
/five
/five/7967161073384272352
/five/eight
/five/eight/4983863247750803395
/five/five
/five/five/3524684131567789482
/four
/four/7685661242132834469
/four/nine
/four/nine/5155980119601329544
/nine
/nine/1200098294881069247
/seven
/seven/7551322209845565740
/three
/three/nine
/three/nine/5359766597931054961
/two
/two/709270324616877532
/two/four
/two/four/5827751033203300749
/zero
/zero/two
/zero/two/8371864177544090196]
>
	at org.apache.hadoop.tools.TestCopyFiles.__CLR3_0_2yilj0cqby(TestCopyFiles.java:989)
	at org.apache.hadoop.tools.TestCopyFiles.testDelete(TestCopyFiles.java:952)


REGRESSION:  org.apache.hadoop.tools.TestCopyFiles.testDeleteLocal

Error Message:
File /grid/0/hudson/hudson-slave/workspace/Hadoop-Mapreduce-22-branch/trunk/build/test/data/destdat/zero/two/3189965281209333339 does not exist.

Stack Trace:
java.io.FileNotFoundException: File /grid/0/hudson/hudson-slave/workspace/Hadoop-Mapreduce-22-branch/trunk/build/test/data/destdat/zero/two/3189965281209333339 does not exist.
	at org.apache.hadoop.fs.RawLocalFileSystem.getFileStatus(RawLocalFileSystem.java:435)
	at org.apache.hadoop.fs.FilterFileSystem.getFileStatus(FilterFileSystem.java:301)
	at org.apache.hadoop.tools.TestCopyFiles.checkFiles(TestCopyFiles.java:169)
	at org.apache.hadoop.tools.TestCopyFiles.checkFiles(TestCopyFiles.java:159)
	at org.apache.hadoop.tools.TestCopyFiles.__CLR3_0_2tkhgbvqd2(TestCopyFiles.java:1043)
	at org.apache.hadoop.tools.TestCopyFiles.testDeleteLocal(TestCopyFiles.java:1024)


REGRESSION:  org.apache.hadoop.tools.TestCopyFiles.testGlobbing

Error Message:
File does not exist: /destdat/eight/8854741012424686418

Stack Trace:
java.io.FileNotFoundException: File does not exist: /destdat/eight/8854741012424686418
	at org.apache.hadoop.hdfs.DistributedFileSystem.getFileStatus(DistributedFileSystem.java:732)
	at org.apache.hadoop.tools.TestCopyFiles.checkFiles(TestCopyFiles.java:169)
	at org.apache.hadoop.tools.TestCopyFiles.checkFiles(TestCopyFiles.java:159)
	at org.apache.hadoop.tools.TestCopyFiles.__CLR3_0_23k01ovqdq(TestCopyFiles.java:1072)
	at org.apache.hadoop.tools.TestCopyFiles.testGlobbing(TestCopyFiles.java:1057)




Mime
View raw message