hadoop-mapreduce-dev mailing list archives

Site index · List index
Message view « Date » · « Thread »
Top « Date » · « Thread »
From Apache Hudson Server <hud...@hudson.apache.org>
Subject Hadoop-Mapreduce-trunk - Build # 652 - Failure
Date Sat, 16 Apr 2011 13:04:18 GMT
See https://hudson.apache.org/hudson/job/Hadoop-Mapreduce-trunk/652/

###################################################################################
########################## LAST 60 LINES OF THE CONSOLE ###########################
[...truncated 5193 lines...]
[ivy:resolve] downloading https://repository.apache.org/content/repositories/snapshots/org/apache/hadoop/hadoop-common/0.23.0-SNAPSHOT/hadoop-common-0.23.0-20110416.015154-83.jar
...
[ivy:resolve] ......................................................................................................................................................................................
(1402kB)
[ivy:resolve] .. (0kB)
[ivy:resolve] 	[SUCCESSFUL ] org.apache.hadoop#hadoop-common;0.23.0-SNAPSHOT!hadoop-common.jar
(734ms)
[ivy:resolve] downloading https://repository.apache.org/content/repositories/snapshots/org/apache/hadoop/hadoop-common-test/0.23.0-SNAPSHOT/hadoop-common-test-0.23.0-20110416.015154-82.jar
...
[ivy:resolve] ...............................................................................................
(729kB)
[ivy:resolve] .. (0kB)
[ivy:resolve] 	[SUCCESSFUL ] org.apache.hadoop#hadoop-common-test;0.23.0-SNAPSHOT!hadoop-common-test.jar
(380ms)

ivy-retrieve-test:

compile-mapred-test:
    [mkdir] Created dir: /grid/0/hudson/hudson-slave/workspace/Hadoop-Mapreduce-trunk/trunk/build/test/mapred/classes
    [mkdir] Created dir: /grid/0/hudson/hudson-slave/workspace/Hadoop-Mapreduce-trunk/trunk/build/test/mapred/testjar
    [mkdir] Created dir: /grid/0/hudson/hudson-slave/workspace/Hadoop-Mapreduce-trunk/trunk/build/test/mapred/testshell
    [javac] Compiling 326 source files to /grid/0/hudson/hudson-slave/workspace/Hadoop-Mapreduce-trunk/trunk/build/test/mapred/classes
    [javac] /grid/0/hudson/hudson-slave/workspace/Hadoop-Mapreduce-trunk/trunk/src/test/mapred/org/apache/hadoop/cli/TestMRCLI.java:22:
cannot find symbol
    [javac] symbol  : class TestCmd
    [javac] location: class org.apache.hadoop.cli.util.CLITestData
    [javac] import org.apache.hadoop.cli.util.CLITestData.TestCmd;
    [javac]                                              ^
    [javac] /grid/0/hudson/hudson-slave/workspace/Hadoop-Mapreduce-trunk/trunk/src/test/mapred/org/apache/hadoop/cli/TestMRCLI.java:69:
cannot find symbol
    [javac] symbol  : class TestCmd
    [javac] location: class org.apache.hadoop.cli.TestMRCLI
    [javac]   protected Result execute(TestCmd cmd) throws Exception {
    [javac]                            ^
    [javac] /grid/0/hudson/hudson-slave/workspace/Hadoop-Mapreduce-trunk/trunk/src/test/mapred/org/apache/hadoop/cli/TestMRCLI.java:70:
package TestCmd does not exist
    [javac]     if(cmd.getType() == TestCmd.CommandType.MRADMIN) {
    [javac]                                ^
    [javac] /grid/0/hudson/hudson-slave/workspace/Hadoop-Mapreduce-trunk/trunk/src/test/mapred/org/apache/hadoop/cli/TestMRCLI.java:72:
package TestCmd does not exist
    [javac]     } else if(cmd.getType() == TestCmd.CommandType.ARCHIVE) {
    [javac]                                       ^
    [javac] /grid/0/hudson/hudson-slave/workspace/Hadoop-Mapreduce-trunk/trunk/src/test/mapred/org/apache/hadoop/cli/TestMRCLI.java:75:
cannot access org.apache.hadoop.cli.util.CLITestData.TestCmd
    [javac] class file for org.apache.hadoop.cli.util.CLITestData$TestCmd not found
    [javac]       return super.execute(cmd);
    [javac]                   ^
    [javac] Note: Some input files use or override a deprecated API.
    [javac] Note: Recompile with -Xlint:deprecation for details.
    [javac] 5 errors

BUILD FAILED
/grid/0/hudson/hudson-slave/workspace/Hadoop-Mapreduce-trunk/trunk/build.xml:535: The following
error occurred while executing this line:
/grid/0/hudson/hudson-slave/workspace/Hadoop-Mapreduce-trunk/trunk/build.xml:612: Compile
failed; see the compiler error output for details.

Total time: 3 minutes 29 seconds
+ RESULT=1
+ [ 1 != 0 ]
+ echo Build Failed: remaining tests not run
Build Failed: remaining tests not run
+ exit 1
[FINDBUGS] Skipping publisher since build result is FAILURE
Recording fingerprints
Archiving artifacts
Recording test results
Publishing Javadoc
Publishing Clover coverage report...
No Clover report will be published due to a Build Failure
Email was triggered for: Failure
Sending email for trigger: Failure



###################################################################################
############################## FAILED TESTS (if any) ##############################
No tests ran.

Mime
View raw message