hadoop-mapreduce-dev mailing list archives

Site index · List index
Message view « Date » · « Thread »
Top « Date » · « Thread »
From Apache Jenkins Server <hud...@hudson.apache.org>
Subject Hadoop-Mapreduce-trunk - Build # 661 - Still Failing
Date Tue, 26 Apr 2011 14:45:23 GMT
See https://builds.apache.org/hudson/job/Hadoop-Mapreduce-trunk/661/

###################################################################################
########################## LAST 60 LINES OF THE CONSOLE ###########################
[...truncated 190567 lines...]
    [junit]    0.8:96530
    [junit]    0.85:96549
    [junit]    0.9:96658
    [junit]    0.95:96670
    [junit] Failed Reduce CDF --------
    [junit] 0: -9223372036854775808--9223372036854775807
    [junit] map attempts to success -- 0.6567164179104478, 0.3283582089552239, 0.014925373134328358, 
    [junit] ===============
    [junit] 2011-04-26 14:41:34,277 WARN  rumen.ZombieJob (ZombieJob.java:sanitizeLoggedTask(318)) - Task task_200904211745_0004_r_000025 has nulll TaskStatus
    [junit] 2011-04-26 14:41:34,278 WARN  rumen.ZombieJob (ZombieJob.java:sanitizeLoggedTask(318)) - Task task_200904211745_0004_r_000028 has nulll TaskStatus
    [junit] 2011-04-26 14:41:34,278 WARN  rumen.ZombieJob (ZombieJob.java:sanitizeLoggedTask(318)) - Task task_200904211745_0004_r_000029 has nulll TaskStatus
    [junit] 2011-04-26 14:41:34,279 WARN  rumen.ZombieJob (ZombieJob.java:sanitizeLoggedTask(318)) - Task task_200904211745_0004_r_000030 has nulll TaskStatus
    [junit] 2011-04-26 14:41:34,279 WARN  rumen.ZombieJob (ZombieJob.java:sanitizeLoggedTask(318)) - Task task_200904211745_0004_r_000031 has nulll TaskStatus
    [junit] 2011-04-26 14:41:34,279 WARN  rumen.ZombieJob (ZombieJob.java:sanitizeLoggedTask(318)) - Task task_200904211745_0004_r_000032 has nulll TaskStatus
    [junit] 2011-04-26 14:41:34,279 WARN  rumen.ZombieJob (ZombieJob.java:sanitizeLoggedTask(318)) - Task task_200904211745_0004_r_000033 has nulll TaskStatus
    [junit] 2011-04-26 14:41:34,280 WARN  rumen.ZombieJob (ZombieJob.java:sanitizeLoggedTask(318)) - Task task_200904211745_0004_r_000034 has nulll TaskStatus
    [junit] 2011-04-26 14:41:34,280 WARN  rumen.ZombieJob (ZombieJob.java:sanitizeLoggedTask(318)) - Task task_200904211745_0004_r_000035 has nulll TaskStatus
    [junit] 2011-04-26 14:41:34,280 WARN  rumen.ZombieJob (ZombieJob.java:sanitizeLoggedTask(318)) - Task task_200904211745_0004_r_000036 has nulll TaskStatus
    [junit] 2011-04-26 14:41:34,281 WARN  rumen.ZombieJob (ZombieJob.java:sanitizeLoggedTask(318)) - Task task_200904211745_0004_r_000037 has nulll TaskStatus
    [junit] 2011-04-26 14:41:34,281 WARN  rumen.ZombieJob (ZombieJob.java:sanitizeLoggedTask(318)) - Task task_200904211745_0004_r_000038 has nulll TaskStatus
    [junit] 2011-04-26 14:41:34,281 WARN  rumen.ZombieJob (ZombieJob.java:sanitizeLoggedTask(318)) - Task task_200904211745_0004_r_000039 has nulll TaskStatus
    [junit] 2011-04-26 14:41:34,282 WARN  rumen.ZombieJob (ZombieJob.java:sanitizeLoggedTask(318)) - Task task_200904211745_0004_r_000040 has nulll TaskStatus
    [junit] 2011-04-26 14:41:34,282 WARN  rumen.ZombieJob (ZombieJob.java:sanitizeLoggedTask(318)) - Task task_200904211745_0004_r_000041 has nulll TaskStatus
    [junit] 2011-04-26 14:41:34,282 WARN  rumen.ZombieJob (ZombieJob.java:sanitizeLoggedTask(318)) - Task task_200904211745_0004_r_000042 has nulll TaskStatus
    [junit] 2011-04-26 14:41:34,282 WARN  rumen.ZombieJob (ZombieJob.java:sanitizeLoggedTask(318)) - Task task_200904211745_0004_r_000043 has nulll TaskStatus
    [junit] 2011-04-26 14:41:34,283 WARN  rumen.ZombieJob (ZombieJob.java:sanitizeLoggedTask(318)) - Task task_200904211745_0004_r_000044 has nulll TaskStatus
    [junit] 2011-04-26 14:41:34,283 WARN  rumen.ZombieJob (ZombieJob.java:sanitizeLoggedTask(318)) - Task task_200904211745_0004_r_000045 has nulll TaskStatus
    [junit] 2011-04-26 14:41:34,283 WARN  rumen.ZombieJob (ZombieJob.java:sanitizeLoggedTask(318)) - Task task_200904211745_0004_r_000046 has nulll TaskStatus
    [junit] generated failed map runtime distribution
    [junit] 100000: 18592--18592
    [junit]    0.1:18592
    [junit]    0.5:18592
    [junit]    0.9:18592
    [junit] Tests run: 5, Failures: 0, Errors: 0, Time elapsed: 2.948 sec
    [junit] Running org.apache.hadoop.util.TestReflectionUtils
    [junit] Tests run: 1, Failures: 0, Errors: 0, Time elapsed: 0.337 sec
    [junit] Running org.apache.hadoop.util.TestRunJar
    [junit] Creating file/grid/0/hudson/hudson-slave/workspace/Hadoop-Mapreduce-trunk/trunk/build/test/data/out
    [junit] Tests run: 1, Failures: 0, Errors: 0, Time elapsed: 0.32 sec

checkfailure:

run-test-mapred-all-withtestcaseonly:

run-test-mapred:

BUILD FAILED
/grid/0/hudson/hudson-slave/workspace/Hadoop-Mapreduce-trunk/trunk/build.xml:830: Tests failed!

Total time: 96 minutes 59 seconds
[FINDBUGS] Skipping publisher since build result is FAILURE
Recording fingerprints
Archiving artifacts
Recording test results
Publishing Javadoc
Publishing Clover coverage report...
No Clover report will be published due to a Build Failure
Email was triggered for: Failure
Sending email for trigger: Failure



###################################################################################
############################## FAILED TESTS (if any) ##############################
103 tests failed.
FAILED:  org.apache.hadoop.cli.TestMRCLI.testAll

Error Message:
One of the tests failed. See the Detailed results to identify the command that failed

Stack Trace:
junit.framework.AssertionFailedError: One of the tests failed. See the Detailed results to identify the command that failed
	at org.apache.hadoop.cli.CLITestHelper.displayResults(CLITestHelper.java:264)
	at org.apache.hadoop.cli.CLITestHelper.tearDown(CLITestHelper.java:126)
	at org.apache.hadoop.cli.TestHDFSCLI.tearDown(TestHDFSCLI.java:81)
	at org.apache.hadoop.cli.TestMRCLI.tearDown(TestMRCLI.java:56)


FAILED:  org.apache.hadoop.fs.TestDFSIO.testIOs

Error Message:
chmod: cannot access `/tmp/hadoop-hudson/mapred/staging/hudson485907793/.staging/job_local_0001': No such file or directory 

Stack Trace:
org.apache.hadoop.util.Shell$ExitCodeException: chmod: cannot access `/tmp/hadoop-hudson/mapred/staging/hudson485907793/.staging/job_local_0001': No such file or directory

	at org.apache.hadoop.util.Shell.runCommand(Shell.java:261)
	at org.apache.hadoop.util.Shell.run(Shell.java:188)
	at org.apache.hadoop.util.Shell$ShellCommandExecutor.execute(Shell.java:381)
	at org.apache.hadoop.util.Shell.execCommand(Shell.java:467)
	at org.apache.hadoop.util.Shell.execCommand(Shell.java:450)
	at org.apache.hadoop.fs.RawLocalFileSystem.execCommand(RawLocalFileSystem.java:549)
	at org.apache.hadoop.fs.RawLocalFileSystem.setPermission(RawLocalFileSystem.java:540)
	at org.apache.hadoop.fs.FilterFileSystem.setPermission(FilterFileSystem.java:353)
	at org.apache.hadoop.fs.FileSystem.mkdirs(FileSystem.java:428)
	at org.apache.hadoop.mapreduce.JobSubmitter.copyAndConfigureFiles(JobSubmitter.java:166)
	at org.apache.hadoop.mapreduce.JobSubmitter.copyAndConfigureFiles(JobSubmitter.java:283)
	at org.apache.hadoop.mapreduce.JobSubmitter.submitJobInternal(JobSubmitter.java:350)
	at org.apache.hadoop.mapreduce.Job$2.run(Job.java:1037)
	at org.apache.hadoop.mapreduce.Job$2.run(Job.java:1034)
	at java.security.AccessController.doPrivileged(Native Method)
	at javax.security.auth.Subject.doAs(Subject.java:396)
	at org.apache.hadoop.security.UserGroupInformation.doAs(UserGroupInformation.java:1142)
	at org.apache.hadoop.mapreduce.Job.submit(Job.java:1034)
	at org.apache.hadoop.mapred.JobClient.submitJob(JobClient.java:536)
	at org.apache.hadoop.mapred.JobClient.runJob(JobClient.java:781)
	at org.apache.hadoop.fs.TestDFSIO.runIOTest(TestDFSIO.java:340)
	at org.apache.hadoop.fs.TestDFSIO.writeTest(TestDFSIO.java:321)
	at org.apache.hadoop.fs.TestDFSIO.testIOs(TestDFSIO.java:188)
	at org.apache.hadoop.fs.TestDFSIO.__CLR3_0_27nynfmghr(TestDFSIO.java:168)
	at org.apache.hadoop.fs.TestDFSIO.testIOs(TestDFSIO.java:166)


FAILED:  org.apache.hadoop.fs.TestFileSystem.testFs

Error Message:
chmod: cannot access `/tmp/hadoop-hudson/mapred/staging/hudson-902235385/.staging/job_local_0001': No such file or directory 

Stack Trace:
org.apache.hadoop.util.Shell$ExitCodeException: chmod: cannot access `/tmp/hadoop-hudson/mapred/staging/hudson-902235385/.staging/job_local_0001': No such file or directory

	at org.apache.hadoop.util.Shell.runCommand(Shell.java:261)
	at org.apache.hadoop.util.Shell.run(Shell.java:188)
	at org.apache.hadoop.util.Shell$ShellCommandExecutor.execute(Shell.java:381)
	at org.apache.hadoop.util.Shell.execCommand(Shell.java:467)
	at org.apache.hadoop.util.Shell.execCommand(Shell.java:450)
	at org.apache.hadoop.fs.RawLocalFileSystem.execCommand(RawLocalFileSystem.java:549)
	at org.apache.hadoop.fs.RawLocalFileSystem.setPermission(RawLocalFileSystem.java:540)
	at org.apache.hadoop.fs.FilterFileSystem.setPermission(FilterFileSystem.java:353)
	at org.apache.hadoop.fs.FileSystem.mkdirs(FileSystem.java:428)
	at org.apache.hadoop.mapreduce.JobSubmitter.copyAndConfigureFiles(JobSubmitter.java:166)
	at org.apache.hadoop.mapreduce.JobSubmitter.copyAndConfigureFiles(JobSubmitter.java:283)
	at org.apache.hadoop.mapreduce.JobSubmitter.submitJobInternal(JobSubmitter.java:350)
	at org.apache.hadoop.mapreduce.Job$2.run(Job.java:1037)
	at org.apache.hadoop.mapreduce.Job$2.run(Job.java:1034)
	at java.security.AccessController.doPrivileged(Native Method)
	at javax.security.auth.Subject.doAs(Subject.java:396)
	at org.apache.hadoop.security.UserGroupInformation.doAs(UserGroupInformation.java:1142)
	at org.apache.hadoop.mapreduce.Job.submit(Job.java:1034)
	at org.apache.hadoop.mapred.JobClient.submitJob(JobClient.java:536)
	at org.apache.hadoop.mapred.JobClient.runJob(JobClient.java:781)
	at org.apache.hadoop.fs.TestFileSystem.writeTest(TestFileSystem.java:237)
	at org.apache.hadoop.fs.TestFileSystem.testFs(TestFileSystem.java:83)
	at org.apache.hadoop.fs.TestFileSystem.__CLR3_0_2jwa3javh6(TestFileSystem.java:69)
	at org.apache.hadoop.fs.TestFileSystem.testFs(TestFileSystem.java:68)


FAILED:  org.apache.hadoop.fs.slive.TestSlive.testMRFlow

Error Message:
null

Stack Trace:
junit.framework.AssertionFailedError: 
	at org.apache.hadoop.fs.slive.TestSlive.__CLR3_0_234abe46nr(TestSlive.java:409)
	at org.apache.hadoop.fs.slive.TestSlive.testMRFlow(TestSlive.java:405)


FAILED:  org.apache.hadoop.mapred.TestCollect.testCollect

Error Message:
chmod: cannot access `/tmp/hadoop-hudson/mapred/staging/hudson-2147395864/.staging/job_local_0001': No such file or directory 

Stack Trace:
org.apache.hadoop.util.Shell$ExitCodeException: chmod: cannot access `/tmp/hadoop-hudson/mapred/staging/hudson-2147395864/.staging/job_local_0001': No such file or directory

	at org.apache.hadoop.util.Shell.runCommand(Shell.java:261)
	at org.apache.hadoop.util.Shell.run(Shell.java:188)
	at org.apache.hadoop.util.Shell$ShellCommandExecutor.execute(Shell.java:381)
	at org.apache.hadoop.util.Shell.execCommand(Shell.java:467)
	at org.apache.hadoop.util.Shell.execCommand(Shell.java:450)
	at org.apache.hadoop.fs.RawLocalFileSystem.execCommand(RawLocalFileSystem.java:549)
	at org.apache.hadoop.fs.RawLocalFileSystem.setPermission(RawLocalFileSystem.java:540)
	at org.apache.hadoop.fs.FilterFileSystem.setPermission(FilterFileSystem.java:353)
	at org.apache.hadoop.fs.FileSystem.mkdirs(FileSystem.java:428)
	at org.apache.hadoop.mapreduce.JobSubmitter.copyAndConfigureFiles(JobSubmitter.java:166)
	at org.apache.hadoop.mapreduce.JobSubmitter.copyAndConfigureFiles(JobSubmitter.java:283)
	at org.apache.hadoop.mapreduce.JobSubmitter.submitJobInternal(JobSubmitter.java:350)
	at org.apache.hadoop.mapreduce.Job$2.run(Job.java:1037)
	at org.apache.hadoop.mapreduce.Job$2.run(Job.java:1034)
	at java.security.AccessController.doPrivileged(Native Method)
	at javax.security.auth.Subject.doAs(Subject.java:396)
	at org.apache.hadoop.security.UserGroupInformation.doAs(UserGroupInformation.java:1142)
	at org.apache.hadoop.mapreduce.Job.submit(Job.java:1034)
	at org.apache.hadoop.mapred.JobClient.submitJob(JobClient.java:536)
	at org.apache.hadoop.mapred.JobClient.runJob(JobClient.java:781)
	at org.apache.hadoop.mapred.TestCollect.__CLR3_0_21ivclbuv8(TestCollect.java:133)
	at org.apache.hadoop.mapred.TestCollect.testCollect(TestCollect.java:129)


FAILED:  org.apache.hadoop.mapred.TestComparators.testDefaultMRComparator

Error Message:
chmod: cannot access `/tmp/hadoop-hudson/mapred/staging/hudson-627276854/.staging/job_local_0001': No such file or directory 

Stack Trace:
org.apache.hadoop.util.Shell$ExitCodeException: chmod: cannot access `/tmp/hadoop-hudson/mapred/staging/hudson-627276854/.staging/job_local_0001': No such file or directory

	at org.apache.hadoop.util.Shell.runCommand(Shell.java:261)
	at org.apache.hadoop.util.Shell.run(Shell.java:188)
	at org.apache.hadoop.util.Shell$ShellCommandExecutor.execute(Shell.java:381)
	at org.apache.hadoop.util.Shell.execCommand(Shell.java:467)
	at org.apache.hadoop.util.Shell.execCommand(Shell.java:450)
	at org.apache.hadoop.fs.RawLocalFileSystem.execCommand(RawLocalFileSystem.java:549)
	at org.apache.hadoop.fs.RawLocalFileSystem.setPermission(RawLocalFileSystem.java:540)
	at org.apache.hadoop.fs.FilterFileSystem.setPermission(FilterFileSystem.java:353)
	at org.apache.hadoop.fs.FileSystem.mkdirs(FileSystem.java:428)
	at org.apache.hadoop.mapreduce.JobSubmitter.copyAndConfigureFiles(JobSubmitter.java:166)
	at org.apache.hadoop.mapreduce.JobSubmitter.copyAndConfigureFiles(JobSubmitter.java:283)
	at org.apache.hadoop.mapreduce.JobSubmitter.submitJobInternal(JobSubmitter.java:350)
	at org.apache.hadoop.mapreduce.Job$2.run(Job.java:1037)
	at org.apache.hadoop.mapreduce.Job$2.run(Job.java:1034)
	at java.security.AccessController.doPrivileged(Native Method)
	at javax.security.auth.Subject.doAs(Subject.java:396)
	at org.apache.hadoop.security.UserGroupInformation.doAs(UserGroupInformation.java:1142)
	at org.apache.hadoop.mapreduce.Job.submit(Job.java:1034)
	at org.apache.hadoop.mapred.JobClient.submitJob(JobClient.java:536)
	at org.apache.hadoop.mapred.TestComparators.__CLR3_0_2x7bh2px01(TestComparators.java:345)
	at org.apache.hadoop.mapred.TestComparators.testDefaultMRComparator(TestComparators.java:340)


FAILED:  org.apache.hadoop.mapred.TestComparators.testUserMRComparator

Error Message:
chmod: cannot access `/tmp/hadoop-hudson/mapred/staging/hudson107894432/.staging/job_local_0002': No such file or directory 

Stack Trace:
org.apache.hadoop.util.Shell$ExitCodeException: chmod: cannot access `/tmp/hadoop-hudson/mapred/staging/hudson107894432/.staging/job_local_0002': No such file or directory

	at org.apache.hadoop.util.Shell.runCommand(Shell.java:261)
	at org.apache.hadoop.util.Shell.run(Shell.java:188)
	at org.apache.hadoop.util.Shell$ShellCommandExecutor.execute(Shell.java:381)
	at org.apache.hadoop.util.Shell.execCommand(Shell.java:467)
	at org.apache.hadoop.util.Shell.execCommand(Shell.java:450)
	at org.apache.hadoop.fs.RawLocalFileSystem.execCommand(RawLocalFileSystem.java:549)
	at org.apache.hadoop.fs.RawLocalFileSystem.setPermission(RawLocalFileSystem.java:540)
	at org.apache.hadoop.fs.FilterFileSystem.setPermission(FilterFileSystem.java:353)
	at org.apache.hadoop.fs.FileSystem.mkdirs(FileSystem.java:428)
	at org.apache.hadoop.mapreduce.JobSubmitter.copyAndConfigureFiles(JobSubmitter.java:166)
	at org.apache.hadoop.mapreduce.JobSubmitter.copyAndConfigureFiles(JobSubmitter.java:283)
	at org.apache.hadoop.mapreduce.JobSubmitter.submitJobInternal(JobSubmitter.java:350)
	at org.apache.hadoop.mapreduce.Job$2.run(Job.java:1037)
	at org.apache.hadoop.mapreduce.Job$2.run(Job.java:1034)
	at java.security.AccessController.doPrivileged(Native Method)
	at javax.security.auth.Subject.doAs(Subject.java:396)
	at org.apache.hadoop.security.UserGroupInformation.doAs(UserGroupInformation.java:1142)
	at org.apache.hadoop.mapreduce.Job.submit(Job.java:1034)
	at org.apache.hadoop.mapred.JobClient.submitJob(JobClient.java:536)
	at org.apache.hadoop.mapred.TestComparators.__CLR3_0_2ljmb1dx0e(TestComparators.java:367)
	at org.apache.hadoop.mapred.TestComparators.testUserMRComparator(TestComparators.java:361)


FAILED:  org.apache.hadoop.mapred.TestComparators.testUserValueGroupingComparator

Error Message:
chmod: cannot access `/tmp/hadoop-hudson/mapred/staging/hudson1299565912/.staging/job_local_0003': No such file or directory 

Stack Trace:
org.apache.hadoop.util.Shell$ExitCodeException: chmod: cannot access `/tmp/hadoop-hudson/mapred/staging/hudson1299565912/.staging/job_local_0003': No such file or directory

	at org.apache.hadoop.util.Shell.runCommand(Shell.java:261)
	at org.apache.hadoop.util.Shell.run(Shell.java:188)
	at org.apache.hadoop.util.Shell$ShellCommandExecutor.execute(Shell.java:381)
	at org.apache.hadoop.util.Shell.execCommand(Shell.java:467)
	at org.apache.hadoop.util.Shell.execCommand(Shell.java:450)
	at org.apache.hadoop.fs.RawLocalFileSystem.execCommand(RawLocalFileSystem.java:549)
	at org.apache.hadoop.fs.RawLocalFileSystem.setPermission(RawLocalFileSystem.java:540)
	at org.apache.hadoop.fs.FilterFileSystem.setPermission(FilterFileSystem.java:353)
	at org.apache.hadoop.fs.FileSystem.mkdirs(FileSystem.java:428)
	at org.apache.hadoop.mapreduce.JobSubmitter.copyAndConfigureFiles(JobSubmitter.java:166)
	at org.apache.hadoop.mapreduce.JobSubmitter.copyAndConfigureFiles(JobSubmitter.java:283)
	at org.apache.hadoop.mapreduce.JobSubmitter.submitJobInternal(JobSubmitter.java:350)
	at org.apache.hadoop.mapreduce.Job$2.run(Job.java:1037)
	at org.apache.hadoop.mapreduce.Job$2.run(Job.java:1034)
	at java.security.AccessController.doPrivileged(Native Method)
	at javax.security.auth.Subject.doAs(Subject.java:396)
	at org.apache.hadoop.security.UserGroupInformation.doAs(UserGroupInformation.java:1142)
	at org.apache.hadoop.mapreduce.Job.submit(Job.java:1034)
	at org.apache.hadoop.mapred.JobClient.submitJob(JobClient.java:536)
	at org.apache.hadoop.mapred.TestComparators.__CLR3_0_2rqt6a4x0s(TestComparators.java:390)
	at org.apache.hadoop.mapred.TestComparators.testUserValueGroupingComparator(TestComparators.java:384)


FAILED:  org.apache.hadoop.mapred.TestComparators.testAllUserComparators

Error Message:
chmod: cannot access `/tmp/hadoop-hudson/mapred/staging/hudson1750021957/.staging/job_local_0004': No such file or directory 

Stack Trace:
org.apache.hadoop.util.Shell$ExitCodeException: chmod: cannot access `/tmp/hadoop-hudson/mapred/staging/hudson1750021957/.staging/job_local_0004': No such file or directory

	at org.apache.hadoop.util.Shell.runCommand(Shell.java:261)
	at org.apache.hadoop.util.Shell.run(Shell.java:188)
	at org.apache.hadoop.util.Shell$ShellCommandExecutor.execute(Shell.java:381)
	at org.apache.hadoop.util.Shell.execCommand(Shell.java:467)
	at org.apache.hadoop.util.Shell.execCommand(Shell.java:450)
	at org.apache.hadoop.fs.RawLocalFileSystem.execCommand(RawLocalFileSystem.java:549)
	at org.apache.hadoop.fs.RawLocalFileSystem.setPermission(RawLocalFileSystem.java:540)
	at org.apache.hadoop.fs.FilterFileSystem.setPermission(FilterFileSystem.java:353)
	at org.apache.hadoop.fs.FileSystem.mkdirs(FileSystem.java:428)
	at org.apache.hadoop.mapreduce.JobSubmitter.copyAndConfigureFiles(JobSubmitter.java:166)
	at org.apache.hadoop.mapreduce.JobSubmitter.copyAndConfigureFiles(JobSubmitter.java:283)
	at org.apache.hadoop.mapreduce.JobSubmitter.submitJobInternal(JobSubmitter.java:350)
	at org.apache.hadoop.mapreduce.Job$2.run(Job.java:1037)
	at org.apache.hadoop.mapreduce.Job$2.run(Job.java:1034)
	at java.security.AccessController.doPrivileged(Native Method)
	at javax.security.auth.Subject.doAs(Subject.java:396)
	at org.apache.hadoop.security.UserGroupInformation.doAs(UserGroupInformation.java:1142)
	at org.apache.hadoop.mapreduce.Job.submit(Job.java:1034)
	at org.apache.hadoop.mapred.JobClient.submitJob(JobClient.java:536)
	at org.apache.hadoop.mapred.TestComparators.__CLR3_0_2mq9wl2x16(TestComparators.java:416)
	at org.apache.hadoop.mapred.TestComparators.testAllUserComparators(TestComparators.java:409)


FAILED:  org.apache.hadoop.mapred.TestFieldSelection.testFieldSelection

Error Message:
chmod: cannot access `/tmp/hadoop-hudson/mapred/staging/hudson-3495353/.staging/job_local_0001': No such file or directory 

Stack Trace:
org.apache.hadoop.util.Shell$ExitCodeException: chmod: cannot access `/tmp/hadoop-hudson/mapred/staging/hudson-3495353/.staging/job_local_0001': No such file or directory

	at org.apache.hadoop.util.Shell.runCommand(Shell.java:261)
	at org.apache.hadoop.util.Shell.run(Shell.java:188)
	at org.apache.hadoop.util.Shell$ShellCommandExecutor.execute(Shell.java:381)
	at org.apache.hadoop.util.Shell.execCommand(Shell.java:467)
	at org.apache.hadoop.util.Shell.execCommand(Shell.java:450)
	at org.apache.hadoop.fs.RawLocalFileSystem.execCommand(RawLocalFileSystem.java:549)
	at org.apache.hadoop.fs.RawLocalFileSystem.setPermission(RawLocalFileSystem.java:540)
	at org.apache.hadoop.fs.FilterFileSystem.setPermission(FilterFileSystem.java:353)
	at org.apache.hadoop.fs.FileSystem.mkdirs(FileSystem.java:428)
	at org.apache.hadoop.mapreduce.JobSubmitter.copyAndConfigureFiles(JobSubmitter.java:166)
	at org.apache.hadoop.mapreduce.JobSubmitter.copyAndConfigureFiles(JobSubmitter.java:283)
	at org.apache.hadoop.mapreduce.JobSubmitter.submitJobInternal(JobSubmitter.java:350)
	at org.apache.hadoop.mapreduce.Job$2.run(Job.java:1037)
	at org.apache.hadoop.mapreduce.Job$2.run(Job.java:1034)
	at java.security.AccessController.doPrivileged(Native Method)
	at javax.security.auth.Subject.doAs(Subject.java:396)
	at org.apache.hadoop.security.UserGroupInformation.doAs(UserGroupInformation.java:1142)
	at org.apache.hadoop.mapreduce.Job.submit(Job.java:1034)
	at org.apache.hadoop.mapred.JobClient.submitJob(JobClient.java:536)
	at org.apache.hadoop.mapred.JobClient.runJob(JobClient.java:781)
	at org.apache.hadoop.mapred.TestFieldSelection.launch(TestFieldSelection.java:81)
	at org.apache.hadoop.mapred.TestFieldSelection.__CLR3_0_2asm65nkpq(TestFieldSelection.java:39)
	at org.apache.hadoop.mapred.TestFieldSelection.testFieldSelection(TestFieldSelection.java:38)


FAILED:  org.apache.hadoop.mapred.TestFileOutputFormat.testCustomFile

Error Message:
chmod: cannot access `/tmp/hadoop-hudson/mapred/staging/hudson-1003721775/.staging/job_local_0001': No such file or directory 

Stack Trace:
org.apache.hadoop.util.Shell$ExitCodeException: chmod: cannot access `/tmp/hadoop-hudson/mapred/staging/hudson-1003721775/.staging/job_local_0001': No such file or directory

	at org.apache.hadoop.util.Shell.runCommand(Shell.java:261)
	at org.apache.hadoop.util.Shell.run(Shell.java:188)
	at org.apache.hadoop.util.Shell$ShellCommandExecutor.execute(Shell.java:381)
	at org.apache.hadoop.util.Shell.execCommand(Shell.java:467)
	at org.apache.hadoop.util.Shell.execCommand(Shell.java:450)
	at org.apache.hadoop.fs.RawLocalFileSystem.execCommand(RawLocalFileSystem.java:549)
	at org.apache.hadoop.fs.RawLocalFileSystem.setPermission(RawLocalFileSystem.java:540)
	at org.apache.hadoop.fs.FilterFileSystem.setPermission(FilterFileSystem.java:353)
	at org.apache.hadoop.fs.FileSystem.mkdirs(FileSystem.java:428)
	at org.apache.hadoop.mapreduce.JobSubmitter.copyAndConfigureFiles(JobSubmitter.java:166)
	at org.apache.hadoop.mapreduce.JobSubmitter.copyAndConfigureFiles(JobSubmitter.java:283)
	at org.apache.hadoop.mapreduce.JobSubmitter.submitJobInternal(JobSubmitter.java:350)
	at org.apache.hadoop.mapreduce.Job$2.run(Job.java:1037)
	at org.apache.hadoop.mapreduce.Job$2.run(Job.java:1034)
	at java.security.AccessController.doPrivileged(Native Method)
	at javax.security.auth.Subject.doAs(Subject.java:396)
	at org.apache.hadoop.security.UserGroupInformation.doAs(UserGroupInformation.java:1142)
	at org.apache.hadoop.mapreduce.Job.submit(Job.java:1034)
	at org.apache.hadoop.mapred.JobClient.submitJob(JobClient.java:536)
	at org.apache.hadoop.mapred.TestFileOutputFormat.__CLR3_0_24yakvaqdl(TestFileOutputFormat.java:84)
	at org.apache.hadoop.mapred.TestFileOutputFormat.testCustomFile(TestFileOutputFormat.java:38)


FAILED:  org.apache.hadoop.mapred.TestJavaSerialization.testMapReduceJob

Error Message:
chmod: cannot access `/tmp/hadoop-hudson/mapred/staging/hudson-270094668/.staging/job_local_0001': No such file or directory 

Stack Trace:
org.apache.hadoop.util.Shell$ExitCodeException: chmod: cannot access `/tmp/hadoop-hudson/mapred/staging/hudson-270094668/.staging/job_local_0001': No such file or directory

	at org.apache.hadoop.util.Shell.runCommand(Shell.java:261)
	at org.apache.hadoop.util.Shell.run(Shell.java:188)
	at org.apache.hadoop.util.Shell$ShellCommandExecutor.execute(Shell.java:381)
	at org.apache.hadoop.util.Shell.execCommand(Shell.java:467)
	at org.apache.hadoop.util.Shell.execCommand(Shell.java:450)
	at org.apache.hadoop.fs.RawLocalFileSystem.execCommand(RawLocalFileSystem.java:549)
	at org.apache.hadoop.fs.RawLocalFileSystem.setPermission(RawLocalFileSystem.java:540)
	at org.apache.hadoop.fs.FilterFileSystem.setPermission(FilterFileSystem.java:353)
	at org.apache.hadoop.fs.FileSystem.mkdirs(FileSystem.java:428)
	at org.apache.hadoop.mapreduce.JobSubmitter.copyAndConfigureFiles(JobSubmitter.java:166)
	at org.apache.hadoop.mapreduce.JobSubmitter.copyAndConfigureFiles(JobSubmitter.java:283)
	at org.apache.hadoop.mapreduce.JobSubmitter.submitJobInternal(JobSubmitter.java:350)
	at org.apache.hadoop.mapreduce.Job$2.run(Job.java:1037)
	at org.apache.hadoop.mapreduce.Job$2.run(Job.java:1034)
	at java.security.AccessController.doPrivileged(Native Method)
	at javax.security.auth.Subject.doAs(Subject.java:396)
	at org.apache.hadoop.security.UserGroupInformation.doAs(UserGroupInformation.java:1142)
	at org.apache.hadoop.mapreduce.Job.submit(Job.java:1034)
	at org.apache.hadoop.mapred.JobClient.submitJob(JobClient.java:536)
	at org.apache.hadoop.mapred.JobClient.runJob(JobClient.java:781)
	at org.apache.hadoop.mapred.TestJavaSerialization.__CLR3_0_2nmr1skx6b(TestJavaSerialization.java:116)
	at org.apache.hadoop.mapred.TestJavaSerialization.testMapReduceJob(TestJavaSerialization.java:91)


FAILED:  org.apache.hadoop.mapred.TestJavaSerialization.testWriteToSequencefile

Error Message:
chmod: cannot access `/tmp/hadoop-hudson/mapred/staging/hudson-2114753407/.staging/job_local_0002': No such file or directory 

Stack Trace:
org.apache.hadoop.util.Shell$ExitCodeException: chmod: cannot access `/tmp/hadoop-hudson/mapred/staging/hudson-2114753407/.staging/job_local_0002': No such file or directory

	at org.apache.hadoop.util.Shell.runCommand(Shell.java:261)
	at org.apache.hadoop.util.Shell.run(Shell.java:188)
	at org.apache.hadoop.util.Shell$ShellCommandExecutor.execute(Shell.java:381)
	at org.apache.hadoop.util.Shell.execCommand(Shell.java:467)
	at org.apache.hadoop.util.Shell.execCommand(Shell.java:450)
	at org.apache.hadoop.fs.RawLocalFileSystem.execCommand(RawLocalFileSystem.java:549)
	at org.apache.hadoop.fs.RawLocalFileSystem.setPermission(RawLocalFileSystem.java:540)
	at org.apache.hadoop.fs.FilterFileSystem.setPermission(FilterFileSystem.java:353)
	at org.apache.hadoop.fs.FileSystem.mkdirs(FileSystem.java:428)
	at org.apache.hadoop.mapreduce.JobSubmitter.copyAndConfigureFiles(JobSubmitter.java:166)
	at org.apache.hadoop.mapreduce.JobSubmitter.copyAndConfigureFiles(JobSubmitter.java:283)
	at org.apache.hadoop.mapreduce.JobSubmitter.submitJobInternal(JobSubmitter.java:350)
	at org.apache.hadoop.mapreduce.Job$2.run(Job.java:1037)
	at org.apache.hadoop.mapreduce.Job$2.run(Job.java:1034)
	at java.security.AccessController.doPrivileged(Native Method)
	at javax.security.auth.Subject.doAs(Subject.java:396)
	at org.apache.hadoop.security.UserGroupInformation.doAs(UserGroupInformation.java:1142)
	at org.apache.hadoop.mapreduce.Job.submit(Job.java:1034)
	at org.apache.hadoop.mapred.JobClient.submitJob(JobClient.java:536)
	at org.apache.hadoop.mapred.JobClient.runJob(JobClient.java:781)
	at org.apache.hadoop.mapred.TestJavaSerialization.__CLR3_0_2l3txox6y(TestJavaSerialization.java:162)
	at org.apache.hadoop.mapred.TestJavaSerialization.testWriteToSequencefile(TestJavaSerialization.java:137)


FAILED:  org.apache.hadoop.mapred.TestJobCounters.testOldCounterA

Error Message:
chmod: cannot access `/tmp/hadoop-hudson/mapred/staging/hudson1203604182/.staging/job_local_0001': No such file or directory 

Stack Trace:
org.apache.hadoop.util.Shell$ExitCodeException: chmod: cannot access `/tmp/hadoop-hudson/mapred/staging/hudson1203604182/.staging/job_local_0001': No such file or directory

	at org.apache.hadoop.util.Shell.runCommand(Shell.java:261)
	at org.apache.hadoop.util.Shell.run(Shell.java:188)
	at org.apache.hadoop.util.Shell$ShellCommandExecutor.execute(Shell.java:381)
	at org.apache.hadoop.util.Shell.execCommand(Shell.java:467)
	at org.apache.hadoop.util.Shell.execCommand(Shell.java:450)
	at org.apache.hadoop.fs.RawLocalFileSystem.execCommand(RawLocalFileSystem.java:549)
	at org.apache.hadoop.fs.RawLocalFileSystem.setPermission(RawLocalFileSystem.java:540)
	at org.apache.hadoop.fs.FilterFileSystem.setPermission(FilterFileSystem.java:353)
	at org.apache.hadoop.fs.FileSystem.mkdirs(FileSystem.java:428)
	at org.apache.hadoop.mapreduce.JobSubmitter.copyAndConfigureFiles(JobSubmitter.java:166)
	at org.apache.hadoop.mapreduce.JobSubmitter.copyAndConfigureFiles(JobSubmitter.java:283)
	at org.apache.hadoop.mapreduce.JobSubmitter.submitJobInternal(JobSubmitter.java:350)
	at org.apache.hadoop.mapreduce.Job$2.run(Job.java:1037)
	at org.apache.hadoop.mapreduce.Job$2.run(Job.java:1034)
	at java.security.AccessController.doPrivileged(Native Method)
	at javax.security.auth.Subject.doAs(Subject.java:396)
	at org.apache.hadoop.security.UserGroupInformation.doAs(UserGroupInformation.java:1142)
	at org.apache.hadoop.mapreduce.Job.submit(Job.java:1034)
	at org.apache.hadoop.mapred.JobClient.submitJob(JobClient.java:536)
	at org.apache.hadoop.mapred.JobClient.runJob(JobClient.java:781)
	at org.apache.hadoop.mapred.TestJobCounters.__CLR3_0_25rygblfjt(TestJobCounters.java:180)
	at org.apache.hadoop.mapred.TestJobCounters.testOldCounterA(TestJobCounters.java:171)


FAILED:  org.apache.hadoop.mapred.TestJobCounters.testOldCounterB

Error Message:
chmod: cannot access `/tmp/hadoop-hudson/mapred/staging/hudson-1764273761/.staging/job_local_0002': No such file or directory 

Stack Trace:
org.apache.hadoop.util.Shell$ExitCodeException: chmod: cannot access `/tmp/hadoop-hudson/mapred/staging/hudson-1764273761/.staging/job_local_0002': No such file or directory

	at org.apache.hadoop.util.Shell.runCommand(Shell.java:261)
	at org.apache.hadoop.util.Shell.run(Shell.java:188)
	at org.apache.hadoop.util.Shell$ShellCommandExecutor.execute(Shell.java:381)
	at org.apache.hadoop.util.Shell.execCommand(Shell.java:467)
	at org.apache.hadoop.util.Shell.execCommand(Shell.java:450)
	at org.apache.hadoop.fs.RawLocalFileSystem.execCommand(RawLocalFileSystem.java:549)
	at org.apache.hadoop.fs.RawLocalFileSystem.setPermission(RawLocalFileSystem.java:540)
	at org.apache.hadoop.fs.FilterFileSystem.setPermission(FilterFileSystem.java:353)
	at org.apache.hadoop.fs.FileSystem.mkdirs(FileSystem.java:428)
	at org.apache.hadoop.mapreduce.JobSubmitter.copyAndConfigureFiles(JobSubmitter.java:166)
	at org.apache.hadoop.mapreduce.JobSubmitter.copyAndConfigureFiles(JobSubmitter.java:283)
	at org.apache.hadoop.mapreduce.JobSubmitter.submitJobInternal(JobSubmitter.java:350)
	at org.apache.hadoop.mapreduce.Job$2.run(Job.java:1037)
	at org.apache.hadoop.mapreduce.Job$2.run(Job.java:1034)
	at java.security.AccessController.doPrivileged(Native Method)
	at javax.security.auth.Subject.doAs(Subject.java:396)
	at org.apache.hadoop.security.UserGroupInformation.doAs(UserGroupInformation.java:1142)
	at org.apache.hadoop.mapreduce.Job.submit(Job.java:1034)
	at org.apache.hadoop.mapred.JobClient.submitJob(JobClient.java:536)
	at org.apache.hadoop.mapred.JobClient.runJob(JobClient.java:781)
	at org.apache.hadoop.mapred.TestJobCounters.__CLR3_0_290yf42fk4(TestJobCounters.java:219)
	at org.apache.hadoop.mapred.TestJobCounters.testOldCounterB(TestJobCounters.java:209)


FAILED:  org.apache.hadoop.mapred.TestJobCounters.testOldCounterC

Error Message:
chmod: cannot access `/tmp/hadoop-hudson/mapred/staging/hudson-935296239/.staging/job_local_0003': No such file or directory 

Stack Trace:
org.apache.hadoop.util.Shell$ExitCodeException: chmod: cannot access `/tmp/hadoop-hudson/mapred/staging/hudson-935296239/.staging/job_local_0003': No such file or directory

	at org.apache.hadoop.util.Shell.runCommand(Shell.java:261)
	at org.apache.hadoop.util.Shell.run(Shell.java:188)
	at org.apache.hadoop.util.Shell$ShellCommandExecutor.execute(Shell.java:381)
	at org.apache.hadoop.util.Shell.execCommand(Shell.java:467)
	at org.apache.hadoop.util.Shell.execCommand(Shell.java:450)
	at org.apache.hadoop.fs.RawLocalFileSystem.execCommand(RawLocalFileSystem.java:549)
	at org.apache.hadoop.fs.RawLocalFileSystem.setPermission(RawLocalFileSystem.java:540)
	at org.apache.hadoop.fs.FilterFileSystem.setPermission(FilterFileSystem.java:353)
	at org.apache.hadoop.fs.FileSystem.mkdirs(FileSystem.java:428)
	at org.apache.hadoop.mapreduce.JobSubmitter.copyAndConfigureFiles(JobSubmitter.java:166)
	at org.apache.hadoop.mapreduce.JobSubmitter.copyAndConfigureFiles(JobSubmitter.java:283)
	at org.apache.hadoop.mapreduce.JobSubmitter.submitJobInternal(JobSubmitter.java:350)
	at org.apache.hadoop.mapreduce.Job$2.run(Job.java:1037)
	at org.apache.hadoop.mapreduce.Job$2.run(Job.java:1034)
	at java.security.AccessController.doPrivileged(Native Method)
	at javax.security.auth.Subject.doAs(Subject.java:396)
	at org.apache.hadoop.security.UserGroupInformation.doAs(UserGroupInformation.java:1142)
	at org.apache.hadoop.mapreduce.Job.submit(Job.java:1034)
	at org.apache.hadoop.mapred.JobClient.submitJob(JobClient.java:536)
	at org.apache.hadoop.mapred.JobClient.runJob(JobClient.java:781)
	at org.apache.hadoop.mapred.TestJobCounters.__CLR3_0_2c9ydwjfkf(TestJobCounters.java:244)
	at org.apache.hadoop.mapred.TestJobCounters.testOldCounterC(TestJobCounters.java:236)


FAILED:  org.apache.hadoop.mapred.TestJobCounters.testNewCounterA

Error Message:
chmod: cannot access `/tmp/hadoop-hudson/mapred/staging/hudson-1911313669/.staging/job_local_0004': No such file or directory 

Stack Trace:
org.apache.hadoop.util.Shell$ExitCodeException: chmod: cannot access `/tmp/hadoop-hudson/mapred/staging/hudson-1911313669/.staging/job_local_0004': No such file or directory

	at org.apache.hadoop.util.Shell.runCommand(Shell.java:261)
	at org.apache.hadoop.util.Shell.run(Shell.java:188)
	at org.apache.hadoop.util.Shell$ShellCommandExecutor.execute(Shell.java:381)
	at org.apache.hadoop.util.Shell.execCommand(Shell.java:467)
	at org.apache.hadoop.util.Shell.execCommand(Shell.java:450)
	at org.apache.hadoop.fs.RawLocalFileSystem.execCommand(RawLocalFileSystem.java:549)
	at org.apache.hadoop.fs.RawLocalFileSystem.setPermission(RawLocalFileSystem.java:540)
	at org.apache.hadoop.fs.FilterFileSystem.setPermission(FilterFileSystem.java:353)
	at org.apache.hadoop.fs.FileSystem.mkdirs(FileSystem.java:428)
	at org.apache.hadoop.mapreduce.JobSubmitter.copyAndConfigureFiles(JobSubmitter.java:166)
	at org.apache.hadoop.mapreduce.JobSubmitter.copyAndConfigureFiles(JobSubmitter.java:283)
	at org.apache.hadoop.mapreduce.JobSubmitter.submitJobInternal(JobSubmitter.java:350)
	at org.apache.hadoop.mapreduce.Job$2.run(Job.java:1037)
	at org.apache.hadoop.mapreduce.Job$2.run(Job.java:1034)
	at java.security.AccessController.doPrivileged(Native Method)
	at javax.security.auth.Subject.doAs(Subject.java:396)
	at org.apache.hadoop.security.UserGroupInformation.doAs(UserGroupInformation.java:1142)
	at org.apache.hadoop.mapreduce.Job.submit(Job.java:1034)
	at org.apache.hadoop.mapreduce.Job.waitForCompletion(Job.java:1054)
	at org.apache.hadoop.mapred.TestJobCounters.__CLR3_0_21grq0qfkq(TestJobCounters.java:267)
	at org.apache.hadoop.mapred.TestJobCounters.testNewCounterA(TestJobCounters.java:257)


FAILED:  org.apache.hadoop.mapred.TestJobCounters.testNewCounterB

Error Message:
chmod: cannot access `/tmp/hadoop-hudson/mapred/staging/hudson2081112049/.staging/job_local_0005': No such file or directory 

Stack Trace:
org.apache.hadoop.util.Shell$ExitCodeException: chmod: cannot access `/tmp/hadoop-hudson/mapred/staging/hudson2081112049/.staging/job_local_0005': No such file or directory

	at org.apache.hadoop.util.Shell.runCommand(Shell.java:261)
	at org.apache.hadoop.util.Shell.run(Shell.java:188)
	at org.apache.hadoop.util.Shell$ShellCommandExecutor.execute(Shell.java:381)
	at org.apache.hadoop.util.Shell.execCommand(Shell.java:467)
	at org.apache.hadoop.util.Shell.execCommand(Shell.java:450)
	at org.apache.hadoop.fs.RawLocalFileSystem.execCommand(RawLocalFileSystem.java:549)
	at org.apache.hadoop.fs.RawLocalFileSystem.setPermission(RawLocalFileSystem.java:540)
	at org.apache.hadoop.fs.FilterFileSystem.setPermission(FilterFileSystem.java:353)
	at org.apache.hadoop.fs.FileSystem.mkdirs(FileSystem.java:428)
	at org.apache.hadoop.mapreduce.JobSubmitter.copyAndConfigureFiles(JobSubmitter.java:166)
	at org.apache.hadoop.mapreduce.JobSubmitter.copyAndConfigureFiles(JobSubmitter.java:283)
	at org.apache.hadoop.mapreduce.JobSubmitter.submitJobInternal(JobSubmitter.java:350)
	at org.apache.hadoop.mapreduce.Job$2.run(Job.java:1037)
	at org.apache.hadoop.mapreduce.Job$2.run(Job.java:1034)
	at java.security.AccessController.doPrivileged(Native Method)
	at javax.security.auth.Subject.doAs(Subject.java:396)
	at org.apache.hadoop.security.UserGroupInformation.doAs(UserGroupInformation.java:1142)
	at org.apache.hadoop.mapreduce.Job.submit(Job.java:1034)
	at org.apache.hadoop.mapreduce.Job.waitForCompletion(Job.java:1054)
	at org.apache.hadoop.mapred.TestJobCounters.__CLR3_0_24prot7fl1(TestJobCounters.java:283)
	at org.apache.hadoop.mapred.TestJobCounters.testNewCounterB(TestJobCounters.java:273)


FAILED:  org.apache.hadoop.mapred.TestJobCounters.testNewCounterC

Error Message:
chmod: cannot access `/tmp/hadoop-hudson/mapred/staging/hudson561624362/.staging/job_local_0006': No such file or directory 

Stack Trace:
org.apache.hadoop.util.Shell$ExitCodeException: chmod: cannot access `/tmp/hadoop-hudson/mapred/staging/hudson561624362/.staging/job_local_0006': No such file or directory

	at org.apache.hadoop.util.Shell.runCommand(Shell.java:261)
	at org.apache.hadoop.util.Shell.run(Shell.java:188)
	at org.apache.hadoop.util.Shell$ShellCommandExecutor.execute(Shell.java:381)
	at org.apache.hadoop.util.Shell.execCommand(Shell.java:467)
	at org.apache.hadoop.util.Shell.execCommand(Shell.java:450)
	at org.apache.hadoop.fs.RawLocalFileSystem.execCommand(RawLocalFileSystem.java:549)
	at org.apache.hadoop.fs.RawLocalFileSystem.setPermission(RawLocalFileSystem.java:540)
	at org.apache.hadoop.fs.FilterFileSystem.setPermission(FilterFileSystem.java:353)
	at org.apache.hadoop.fs.FileSystem.mkdirs(FileSystem.java:428)
	at org.apache.hadoop.mapreduce.JobSubmitter.copyAndConfigureFiles(JobSubmitter.java:166)
	at org.apache.hadoop.mapreduce.JobSubmitter.copyAndConfigureFiles(JobSubmitter.java:283)
	at org.apache.hadoop.mapreduce.JobSubmitter.submitJobInternal(JobSubmitter.java:350)
	at org.apache.hadoop.mapreduce.Job$2.run(Job.java:1037)
	at org.apache.hadoop.mapreduce.Job$2.run(Job.java:1034)
	at java.security.AccessController.doPrivileged(Native Method)
	at javax.security.auth.Subject.doAs(Subject.java:396)
	at org.apache.hadoop.security.UserGroupInformation.doAs(UserGroupInformation.java:1142)
	at org.apache.hadoop.mapreduce.Job.submit(Job.java:1034)
	at org.apache.hadoop.mapreduce.Job.waitForCompletion(Job.java:1054)
	at org.apache.hadoop.mapred.TestJobCounters.__CLR3_0_27yrnloflc(TestJobCounters.java:299)
	at org.apache.hadoop.mapred.TestJobCounters.testNewCounterC(TestJobCounters.java:289)


FAILED:  org.apache.hadoop.mapred.TestLocalMRNotification.testMR

Error Message:
chmod: cannot access `/tmp/hadoop-hudson/mapred/staging/hudson-1543400604/.staging/job_local_0001': No such file or directory 

Stack Trace:
org.apache.hadoop.util.Shell$ExitCodeException: chmod: cannot access `/tmp/hadoop-hudson/mapred/staging/hudson-1543400604/.staging/job_local_0001': No such file or directory

	at org.apache.hadoop.util.Shell.runCommand(Shell.java:261)
	at org.apache.hadoop.util.Shell.run(Shell.java:188)
	at org.apache.hadoop.util.Shell$ShellCommandExecutor.execute(Shell.java:381)
	at org.apache.hadoop.util.Shell.execCommand(Shell.java:467)
	at org.apache.hadoop.util.Shell.execCommand(Shell.java:450)
	at org.apache.hadoop.fs.RawLocalFileSystem.execCommand(RawLocalFileSystem.java:549)
	at org.apache.hadoop.fs.RawLocalFileSystem.setPermission(RawLocalFileSystem.java:540)
	at org.apache.hadoop.fs.FilterFileSystem.setPermission(FilterFileSystem.java:353)
	at org.apache.hadoop.fs.FileSystem.mkdirs(FileSystem.java:428)
	at org.apache.hadoop.mapreduce.JobSubmitter.copyAndConfigureFiles(JobSubmitter.java:166)
	at org.apache.hadoop.mapreduce.JobSubmitter.copyAndConfigureFiles(JobSubmitter.java:283)
	at org.apache.hadoop.mapreduce.JobSubmitter.submitJobInternal(JobSubmitter.java:350)
	at org.apache.hadoop.mapreduce.Job$2.run(Job.java:1037)
	at org.apache.hadoop.mapreduce.Job$2.run(Job.java:1034)
	at java.security.AccessController.doPrivileged(Native Method)
	at javax.security.auth.Subject.doAs(Subject.java:396)
	at org.apache.hadoop.security.UserGroupInformation.doAs(UserGroupInformation.java:1142)
	at org.apache.hadoop.mapreduce.Job.submit(Job.java:1034)
	at org.apache.hadoop.mapred.JobClient.submitJob(JobClient.java:536)
	at org.apache.hadoop.mapred.JobClient.runJob(JobClient.java:781)
	at org.apache.hadoop.mapred.NotificationTestCase.launchWordCount(NotificationTestCase.java:220)
	at org.apache.hadoop.mapred.NotificationTestCase.__CLR3_0_2ldwkpup50(NotificationTestCase.java:150)
	at org.apache.hadoop.mapred.NotificationTestCase.testMR(NotificationTestCase.java:149)


FAILED:  org.apache.hadoop.mapred.TestMRWithDistributedCache.testLocalJobRunner

Error Message:
chmod: cannot access `/tmp/hadoop-hudson/mapred/staging/hudson-1914163913/.staging/job_local_0001': No such file or directory 

Stack Trace:
org.apache.hadoop.util.Shell$ExitCodeException: chmod: cannot access `/tmp/hadoop-hudson/mapred/staging/hudson-1914163913/.staging/job_local_0001': No such file or directory

	at org.apache.hadoop.util.Shell.runCommand(Shell.java:261)
	at org.apache.hadoop.util.Shell.run(Shell.java:188)
	at org.apache.hadoop.util.Shell$ShellCommandExecutor.execute(Shell.java:381)
	at org.apache.hadoop.util.Shell.execCommand(Shell.java:467)
	at org.apache.hadoop.util.Shell.execCommand(Shell.java:450)
	at org.apache.hadoop.fs.RawLocalFileSystem.execCommand(RawLocalFileSystem.java:549)
	at org.apache.hadoop.fs.RawLocalFileSystem.setPermission(RawLocalFileSystem.java:540)
	at org.apache.hadoop.fs.FilterFileSystem.setPermission(FilterFileSystem.java:353)
	at org.apache.hadoop.fs.FileSystem.mkdirs(FileSystem.java:428)
	at org.apache.hadoop.mapreduce.JobSubmitter.copyAndConfigureFiles(JobSubmitter.java:166)
	at org.apache.hadoop.mapreduce.JobSubmitter.copyAndConfigureFiles(JobSubmitter.java:283)
	at org.apache.hadoop.mapreduce.JobSubmitter.submitJobInternal(JobSubmitter.java:350)
	at org.apache.hadoop.mapreduce.Job$2.run(Job.java:1037)
	at org.apache.hadoop.mapreduce.Job$2.run(Job.java:1034)
	at java.security.AccessController.doPrivileged(Native Method)
	at javax.security.auth.Subject.doAs(Subject.java:396)
	at org.apache.hadoop.security.UserGroupInformation.doAs(UserGroupInformation.java:1142)
	at org.apache.hadoop.mapreduce.Job.submit(Job.java:1034)
	at org.apache.hadoop.mapred.TestMRWithDistributedCache.testWithConf(TestMRWithDistributedCache.java:154)
	at org.apache.hadoop.mapred.TestMRWithDistributedCache.__CLR3_0_2mk2aclukt(TestMRWithDistributedCache.java:163)
	at org.apache.hadoop.mapred.TestMRWithDistributedCache.testLocalJobRunner(TestMRWithDistributedCache.java:159)


FAILED:  org.apache.hadoop.mapred.TestMapOutputType.testKeyMismatch

Error Message:
chmod: cannot access `/tmp/hadoop-hudson/mapred/staging/hudson-101096556/.staging/job_local_0001': No such file or directory 

Stack Trace:
org.apache.hadoop.util.Shell$ExitCodeException: chmod: cannot access `/tmp/hadoop-hudson/mapred/staging/hudson-101096556/.staging/job_local_0001': No such file or directory

	at org.apache.hadoop.util.Shell.runCommand(Shell.java:261)
	at org.apache.hadoop.util.Shell.run(Shell.java:188)
	at org.apache.hadoop.util.Shell$ShellCommandExecutor.execute(Shell.java:381)
	at org.apache.hadoop.util.Shell.execCommand(Shell.java:467)
	at org.apache.hadoop.util.Shell.execCommand(Shell.java:450)
	at org.apache.hadoop.fs.RawLocalFileSystem.execCommand(RawLocalFileSystem.java:549)
	at org.apache.hadoop.fs.RawLocalFileSystem.setPermission(RawLocalFileSystem.java:540)
	at org.apache.hadoop.fs.FilterFileSystem.setPermission(FilterFileSystem.java:353)
	at org.apache.hadoop.fs.FileSystem.mkdirs(FileSystem.java:428)
	at org.apache.hadoop.mapreduce.JobSubmitter.copyAndConfigureFiles(JobSubmitter.java:166)
	at org.apache.hadoop.mapreduce.JobSubmitter.copyAndConfigureFiles(JobSubmitter.java:283)
	at org.apache.hadoop.mapreduce.JobSubmitter.submitJobInternal(JobSubmitter.java:350)
	at org.apache.hadoop.mapreduce.Job$2.run(Job.java:1037)
	at org.apache.hadoop.mapreduce.Job$2.run(Job.java:1034)
	at java.security.AccessController.doPrivileged(Native Method)
	at javax.security.auth.Subject.doAs(Subject.java:396)
	at org.apache.hadoop.security.UserGroupInformation.doAs(UserGroupInformation.java:1142)
	at org.apache.hadoop.mapreduce.Job.submit(Job.java:1034)
	at org.apache.hadoop.mapred.JobClient.submitJob(JobClient.java:536)
	at org.apache.hadoop.mapred.TestMapOutputType.__CLR3_0_2mrrh6m7q6(TestMapOutputType.java:116)
	at org.apache.hadoop.mapred.TestMapOutputType.testKeyMismatch(TestMapOutputType.java:109)


FAILED:  org.apache.hadoop.mapred.TestMapOutputType.testValueMismatch

Error Message:
chmod: cannot access `/tmp/hadoop-hudson/mapred/staging/hudson1230343360/.staging/job_local_0002': No such file or directory 

Stack Trace:
org.apache.hadoop.util.Shell$ExitCodeException: chmod: cannot access `/tmp/hadoop-hudson/mapred/staging/hudson1230343360/.staging/job_local_0002': No such file or directory

	at org.apache.hadoop.util.Shell.runCommand(Shell.java:261)
	at org.apache.hadoop.util.Shell.run(Shell.java:188)
	at org.apache.hadoop.util.Shell$ShellCommandExecutor.execute(Shell.java:381)
	at org.apache.hadoop.util.Shell.execCommand(Shell.java:467)
	at org.apache.hadoop.util.Shell.execCommand(Shell.java:450)
	at org.apache.hadoop.fs.RawLocalFileSystem.execCommand(RawLocalFileSystem.java:549)
	at org.apache.hadoop.fs.RawLocalFileSystem.setPermission(RawLocalFileSystem.java:540)
	at org.apache.hadoop.fs.FilterFileSystem.setPermission(FilterFileSystem.java:353)
	at org.apache.hadoop.fs.FileSystem.mkdirs(FileSystem.java:428)
	at org.apache.hadoop.mapreduce.JobSubmitter.copyAndConfigureFiles(JobSubmitter.java:166)
	at org.apache.hadoop.mapreduce.JobSubmitter.copyAndConfigureFiles(JobSubmitter.java:283)
	at org.apache.hadoop.mapreduce.JobSubmitter.submitJobInternal(JobSubmitter.java:350)
	at org.apache.hadoop.mapreduce.Job$2.run(Job.java:1037)
	at org.apache.hadoop.mapreduce.Job$2.run(Job.java:1034)
	at java.security.AccessController.doPrivileged(Native Method)
	at javax.security.auth.Subject.doAs(Subject.java:396)
	at org.apache.hadoop.security.UserGroupInformation.doAs(UserGroupInformation.java:1142)
	at org.apache.hadoop.mapreduce.Job.submit(Job.java:1034)
	at org.apache.hadoop.mapred.JobClient.submitJob(JobClient.java:536)
	at org.apache.hadoop.mapred.TestMapOutputType.__CLR3_0_2a8ghw47qj(TestMapOutputType.java:133)
	at org.apache.hadoop.mapred.TestMapOutputType.testValueMismatch(TestMapOutputType.java:126)


FAILED:  org.apache.hadoop.mapred.TestMapOutputType.testNoMismatch

Error Message:
chmod: cannot access `/tmp/hadoop-hudson/mapred/staging/hudson-1002596700/.staging/job_local_0003': No such file or directory 

Stack Trace:
org.apache.hadoop.util.Shell$ExitCodeException: chmod: cannot access `/tmp/hadoop-hudson/mapred/staging/hudson-1002596700/.staging/job_local_0003': No such file or directory

	at org.apache.hadoop.util.Shell.runCommand(Shell.java:261)
	at org.apache.hadoop.util.Shell.run(Shell.java:188)
	at org.apache.hadoop.util.Shell$ShellCommandExecutor.execute(Shell.java:381)
	at org.apache.hadoop.util.Shell.execCommand(Shell.java:467)
	at org.apache.hadoop.util.Shell.execCommand(Shell.java:450)
	at org.apache.hadoop.fs.RawLocalFileSystem.execCommand(RawLocalFileSystem.java:549)
	at org.apache.hadoop.fs.RawLocalFileSystem.setPermission(RawLocalFileSystem.java:540)
	at org.apache.hadoop.fs.FilterFileSystem.setPermission(FilterFileSystem.java:353)
	at org.apache.hadoop.fs.FileSystem.mkdirs(FileSystem.java:428)
	at org.apache.hadoop.mapreduce.JobSubmitter.copyAndConfigureFiles(JobSubmitter.java:166)
	at org.apache.hadoop.mapreduce.JobSubmitter.copyAndConfigureFiles(JobSubmitter.java:283)
	at org.apache.hadoop.mapreduce.JobSubmitter.submitJobInternal(JobSubmitter.java:350)
	at org.apache.hadoop.mapreduce.Job$2.run(Job.java:1037)
	at org.apache.hadoop.mapreduce.Job$2.run(Job.java:1034)
	at java.security.AccessController.doPrivileged(Native Method)
	at javax.security.auth.Subject.doAs(Subject.java:396)
	at org.apache.hadoop.security.UserGroupInformation.doAs(UserGroupInformation.java:1142)
	at org.apache.hadoop.mapreduce.Job.submit(Job.java:1034)
	at org.apache.hadoop.mapred.JobClient.submitJob(JobClient.java:536)
	at org.apache.hadoop.mapred.TestMapOutputType.__CLR3_0_2wob207qw(TestMapOutputType.java:150)
	at org.apache.hadoop.mapred.TestMapOutputType.testNoMismatch(TestMapOutputType.java:143)


FAILED:  org.apache.hadoop.mapred.TestMapRed.testMapred

Error Message:
chmod: cannot access `/tmp/hadoop-hudson/mapred/staging/hudson558172675/.staging/job_local_0001': No such file or directory 

Stack Trace:
org.apache.hadoop.util.Shell$ExitCodeException: chmod: cannot access `/tmp/hadoop-hudson/mapred/staging/hudson558172675/.staging/job_local_0001': No such file or directory

	at org.apache.hadoop.util.Shell.runCommand(Shell.java:261)
	at org.apache.hadoop.util.Shell.run(Shell.java:188)
	at org.apache.hadoop.util.Shell$ShellCommandExecutor.execute(Shell.java:381)
	at org.apache.hadoop.util.Shell.execCommand(Shell.java:467)
	at org.apache.hadoop.util.Shell.execCommand(Shell.java:450)
	at org.apache.hadoop.fs.RawLocalFileSystem.execCommand(RawLocalFileSystem.java:549)
	at org.apache.hadoop.fs.RawLocalFileSystem.setPermission(RawLocalFileSystem.java:540)
	at org.apache.hadoop.fs.FilterFileSystem.setPermission(FilterFileSystem.java:353)
	at org.apache.hadoop.fs.FileSystem.mkdirs(FileSystem.java:428)
	at org.apache.hadoop.mapreduce.JobSubmitter.copyAndConfigureFiles(JobSubmitter.java:166)
	at org.apache.hadoop.mapreduce.JobSubmitter.copyAndConfigureFiles(JobSubmitter.java:283)
	at org.apache.hadoop.mapreduce.JobSubmitter.submitJobInternal(JobSubmitter.java:350)
	at org.apache.hadoop.mapreduce.Job$2.run(Job.java:1037)
	at org.apache.hadoop.mapreduce.Job$2.run(Job.java:1034)
	at java.security.AccessController.doPrivileged(Native Method)
	at javax.security.auth.Subject.doAs(Subject.java:396)
	at org.apache.hadoop.security.UserGroupInformation.doAs(UserGroupInformation.java:1142)
	at org.apache.hadoop.mapreduce.Job.submit(Job.java:1034)
	at org.apache.hadoop.mapred.JobClient.submitJob(JobClient.java:536)
	at org.apache.hadoop.mapred.JobClient.runJob(JobClient.java:781)
	at org.apache.hadoop.mapred.TestMapRed.launch(TestMapRed.java:522)
	at org.apache.hadoop.mapred.TestMapRed.__CLR3_0_2vmf1hqxgz(TestMapRed.java:260)
	at org.apache.hadoop.mapred.TestMapRed.testMapred(TestMapRed.java:259)


FAILED:  org.apache.hadoop.mapred.TestMapRed.testNullKeys

Error Message:
chmod: cannot access `/tmp/hadoop-hudson/mapred/staging/hudson1411018446/.staging/job_local_0002': No such file or directory 

Stack Trace:
org.apache.hadoop.util.Shell$ExitCodeException: chmod: cannot access `/tmp/hadoop-hudson/mapred/staging/hudson1411018446/.staging/job_local_0002': No such file or directory

	at org.apache.hadoop.util.Shell.runCommand(Shell.java:261)
	at org.apache.hadoop.util.Shell.run(Shell.java:188)
	at org.apache.hadoop.util.Shell$ShellCommandExecutor.execute(Shell.java:381)
	at org.apache.hadoop.util.Shell.execCommand(Shell.java:467)
	at org.apache.hadoop.util.Shell.execCommand(Shell.java:450)
	at org.apache.hadoop.fs.RawLocalFileSystem.execCommand(RawLocalFileSystem.java:549)
	at org.apache.hadoop.fs.RawLocalFileSystem.setPermission(RawLocalFileSystem.java:540)
	at org.apache.hadoop.fs.FilterFileSystem.setPermission(FilterFileSystem.java:353)
	at org.apache.hadoop.fs.FileSystem.mkdirs(FileSystem.java:428)
	at org.apache.hadoop.mapreduce.JobSubmitter.copyAndConfigureFiles(JobSubmitter.java:166)
	at org.apache.hadoop.mapreduce.JobSubmitter.copyAndConfigureFiles(JobSubmitter.java:283)
	at org.apache.hadoop.mapreduce.JobSubmitter.submitJobInternal(JobSubmitter.java:350)
	at org.apache.hadoop.mapreduce.Job$2.run(Job.java:1037)
	at org.apache.hadoop.mapreduce.Job$2.run(Job.java:1034)
	at java.security.AccessController.doPrivileged(Native Method)
	at javax.security.auth.Subject.doAs(Subject.java:396)
	at org.apache.hadoop.security.UserGroupInformation.doAs(UserGroupInformation.java:1142)
	at org.apache.hadoop.mapreduce.Job.submit(Job.java:1034)
	at org.apache.hadoop.mapred.JobClient.submitJob(JobClient.java:536)
	at org.apache.hadoop.mapred.JobClient.runJob(JobClient.java:781)
	at org.apache.hadoop.mapred.TestMapRed.__CLR3_0_2i5a2rwxhq(TestMapRed.java:355)
	at org.apache.hadoop.mapred.TestMapRed.testNullKeys(TestMapRed.java:324)


FAILED:  org.apache.hadoop.mapred.TestMapRed.testCompression

Error Message:
chmod: cannot access `/tmp/hadoop-hudson/mapred/staging/hudson-47851964/.staging/job_local_0003': No such file or directory 

Stack Trace:
org.apache.hadoop.util.Shell$ExitCodeException: chmod: cannot access `/tmp/hadoop-hudson/mapred/staging/hudson-47851964/.staging/job_local_0003': No such file or directory

	at org.apache.hadoop.util.Shell.runCommand(Shell.java:261)
	at org.apache.hadoop.util.Shell.run(Shell.java:188)
	at org.apache.hadoop.util.Shell$ShellCommandExecutor.execute(Shell.java:381)
	at org.apache.hadoop.util.Shell.execCommand(Shell.java:467)
	at org.apache.hadoop.util.Shell.execCommand(Shell.java:450)
	at org.apache.hadoop.fs.RawLocalFileSystem.execCommand(RawLocalFileSystem.java:549)
	at org.apache.hadoop.fs.RawLocalFileSystem.setPermission(RawLocalFileSystem.java:540)
	at org.apache.hadoop.fs.FilterFileSystem.setPermission(FilterFileSystem.java:353)
	at org.apache.hadoop.fs.FileSystem.mkdirs(FileSystem.java:428)
	at org.apache.hadoop.mapreduce.JobSubmitter.copyAndConfigureFiles(JobSubmitter.java:166)
	at org.apache.hadoop.mapreduce.JobSubmitter.copyAndConfigureFiles(JobSubmitter.java:283)
	at org.apache.hadoop.mapreduce.JobSubmitter.submitJobInternal(JobSubmitter.java:350)
	at org.apache.hadoop.mapreduce.Job$2.run(Job.java:1037)
	at org.apache.hadoop.mapreduce.Job$2.run(Job.java:1034)
	at java.security.AccessController.doPrivileged(Native Method)
	at javax.security.auth.Subject.doAs(Subject.java:396)
	at org.apache.hadoop.security.UserGroupInformation.doAs(UserGroupInformation.java:1142)
	at org.apache.hadoop.mapreduce.Job.submit(Job.java:1034)
	at org.apache.hadoop.mapred.JobClient.submitJob(JobClient.java:536)
	at org.apache.hadoop.mapred.JobClient.runJob(JobClient.java:781)
	at org.apache.hadoop.mapred.TestMapRed.checkCompression(TestMapRed.java:403)
	at org.apache.hadoop.mapred.TestMapRed.__CLR3_0_2rawc05xjz(TestMapRed.java:426)
	at org.apache.hadoop.mapred.TestMapRed.testCompression(TestMapRed.java:421)


FAILED:  org.apache.hadoop.mapred.TestMapRed.testSmallInput

Error Message:
Threw exception:org.apache.hadoop.util.Shell$ExitCodeException: chmod: cannot access `/tmp/hadoop-hudson/mapred/staging/hudson-234138290/.staging/job_local_0004': No such file or directory 

Stack Trace:
junit.framework.AssertionFailedError: Threw exception:org.apache.hadoop.util.Shell$ExitCodeException: chmod: cannot access `/tmp/hadoop-hudson/mapred/staging/hudson-234138290/.staging/job_local_0004': No such file or directory


	at org.apache.hadoop.mapred.TestMapRed.runJob(TestMapRed.java:765)
	at org.apache.hadoop.mapred.TestMapRed.__CLR3_0_29c506cxp4(TestMapRed.java:715)
	at org.apache.hadoop.mapred.TestMapRed.testSmallInput(TestMapRed.java:714)


FAILED:  org.apache.hadoop.mapred.TestMapRed.testBiggerInput

Error Message:
Threw exception:org.apache.hadoop.util.Shell$ExitCodeException: chmod: cannot access `/tmp/hadoop-hudson/mapred/staging/hudson316160677/.staging/job_local_0005': No such file or directory 

Stack Trace:
junit.framework.AssertionFailedError: Threw exception:org.apache.hadoop.util.Shell$ExitCodeException: chmod: cannot access `/tmp/hadoop-hudson/mapred/staging/hudson316160677/.staging/job_local_0005': No such file or directory


	at org.apache.hadoop.mapred.TestMapRed.runJob(TestMapRed.java:765)
	at org.apache.hadoop.mapred.TestMapRed.__CLR3_0_22j0llhxp6(TestMapRed.java:720)
	at org.apache.hadoop.mapred.TestMapRed.testBiggerInput(TestMapRed.java:719)


FAILED:  org.apache.hadoop.mapred.TestTaskCommit.testCommitFail

Error Message:
chmod: cannot access `/tmp/hadoop-hudson/mapred/staging/hudson291852045/.staging/job_local_0001': No such file or directory 

Stack Trace:
org.apache.hadoop.util.Shell$ExitCodeException: chmod: cannot access `/tmp/hadoop-hudson/mapred/staging/hudson291852045/.staging/job_local_0001': No such file or directory

	at org.apache.hadoop.util.Shell.runCommand(Shell.java:261)
	at org.apache.hadoop.util.Shell.run(Shell.java:188)
	at org.apache.hadoop.util.Shell$ShellCommandExecutor.execute(Shell.java:381)
	at org.apache.hadoop.util.Shell.execCommand(Shell.java:467)
	at org.apache.hadoop.util.Shell.execCommand(Shell.java:450)
	at org.apache.hadoop.fs.RawLocalFileSystem.execCommand(RawLocalFileSystem.java:549)
	at org.apache.hadoop.fs.RawLocalFileSystem.setPermission(RawLocalFileSystem.java:540)
	at org.apache.hadoop.fs.FilterFileSystem.setPermission(FilterFileSystem.java:353)
	at org.apache.hadoop.fs.FileSystem.mkdirs(FileSystem.java:428)
	at org.apache.hadoop.mapreduce.JobSubmitter.copyAndConfigureFiles(JobSubmitter.java:166)
	at org.apache.hadoop.mapreduce.JobSubmitter.copyAndConfigureFiles(JobSubmitter.java:283)
	at org.apache.hadoop.mapreduce.JobSubmitter.submitJobInternal(JobSubmitter.java:350)
	at org.apache.hadoop.mapreduce.Job$2.run(Job.java:1037)
	at org.apache.hadoop.mapreduce.Job$2.run(Job.java:1034)
	at java.security.AccessController.doPrivileged(Native Method)
	at javax.security.auth.Subject.doAs(Subject.java:396)
	at org.apache.hadoop.security.UserGroupInformation.doAs(UserGroupInformation.java:1142)
	at org.apache.hadoop.mapreduce.Job.submit(Job.java:1034)
	at org.apache.hadoop.mapred.JobClient.submitJob(JobClient.java:536)
	at org.apache.hadoop.mapred.UtilsForTests.runJob(UtilsForTests.java:587)
	at org.apache.hadoop.mapred.TestTaskCommit.__CLR3_0_222imwihkp(TestTaskCommit.java:91)
	at org.apache.hadoop.mapred.TestTaskCommit.testCommitFail(TestTaskCommit.java:85)


FAILED:  org.apache.hadoop.mapred.TestUserDefinedCounters.testMapReduceJob

Error Message:
chmod: cannot access `/tmp/hadoop-hudson/mapred/staging/hudson856482566/.staging/job_local_0001': No such file or directory 

Stack Trace:
org.apache.hadoop.util.Shell$ExitCodeException: chmod: cannot access `/tmp/hadoop-hudson/mapred/staging/hudson856482566/.staging/job_local_0001': No such file or directory

	at org.apache.hadoop.util.Shell.runCommand(Shell.java:261)
	at org.apache.hadoop.util.Shell.run(Shell.java:188)
	at org.apache.hadoop.util.Shell$ShellCommandExecutor.execute(Shell.java:381)
	at org.apache.hadoop.util.Shell.execCommand(Shell.java:467)
	at org.apache.hadoop.util.Shell.execCommand(Shell.java:450)
	at org.apache.hadoop.fs.RawLocalFileSystem.execCommand(RawLocalFileSystem.java:549)
	at org.apache.hadoop.fs.RawLocalFileSystem.setPermission(RawLocalFileSystem.java:540)
	at org.apache.hadoop.fs.FilterFileSystem.setPermission(FilterFileSystem.java:353)
	at org.apache.hadoop.fs.FileSystem.mkdirs(FileSystem.java:428)
	at org.apache.hadoop.mapreduce.JobSubmitter.copyAndConfigureFiles(JobSubmitter.java:166)
	at org.apache.hadoop.mapreduce.JobSubmitter.copyAndConfigureFiles(JobSubmitter.java:283)
	at org.apache.hadoop.mapreduce.JobSubmitter.submitJobInternal(JobSubmitter.java:350)
	at org.apache.hadoop.mapreduce.Job$2.run(Job.java:1037)
	at org.apache.hadoop.mapreduce.Job$2.run(Job.java:1034)
	at java.security.AccessController.doPrivileged(Native Method)
	at javax.security.auth.Subject.doAs(Subject.java:396)
	at org.apache.hadoop.security.UserGroupInformation.doAs(UserGroupInformation.java:1142)
	at org.apache.hadoop.mapreduce.Job.submit(Job.java:1034)
	at org.apache.hadoop.mapred.JobClient.submitJob(JobClient.java:536)
	at org.apache.hadoop.mapred.JobClient.runJob(JobClient.java:781)
	at org.apache.hadoop.mapred.TestUserDefinedCounters.__CLR3_0_2nmr1ska2u(TestUserDefinedCounters.java:101)
	at org.apache.hadoop.mapred.TestUserDefinedCounters.testMapReduceJob(TestUserDefinedCounters.java:77)


FAILED:  org.apache.hadoop.mapred.jobcontrol.TestLocalJobControl.testLocalJobControlDataCopy

Error Message:
Some jobs failed expected:<0> but was:<4>

Stack Trace:
junit.framework.AssertionFailedError: Some jobs failed expected:<0> but was:<4>
	at org.apache.hadoop.mapred.jobcontrol.TestLocalJobControl.__CLR3_0_22dofof9pf(TestLocalJobControl.java:131)
	at org.apache.hadoop.mapred.jobcontrol.TestLocalJobControl.testLocalJobControlDataCopy(TestLocalJobControl.java:62)


FAILED:  org.apache.hadoop.mapred.join.TestDatamerge.testSimpleInnerJoin

Error Message:
chmod: cannot access `/tmp/hadoop-hudson/mapred/staging/hudson-2047105054/.staging/job_local_0001': No such file or directory 

Stack Trace:
org.apache.hadoop.util.Shell$ExitCodeException: chmod: cannot access `/tmp/hadoop-hudson/mapred/staging/hudson-2047105054/.staging/job_local_0001': No such file or directory

	at org.apache.hadoop.util.Shell.runCommand(Shell.java:261)
	at org.apache.hadoop.util.Shell.run(Shell.java:188)
	at org.apache.hadoop.util.Shell$ShellCommandExecutor.execute(Shell.java:381)
	at org.apache.hadoop.util.Shell.execCommand(Shell.java:467)
	at org.apache.hadoop.util.Shell.execCommand(Shell.java:450)
	at org.apache.hadoop.fs.RawLocalFileSystem.execCommand(RawLocalFileSystem.java:549)
	at org.apache.hadoop.fs.RawLocalFileSystem.setPermission(RawLocalFileSystem.java:540)
	at org.apache.hadoop.fs.FilterFileSystem.setPermission(FilterFileSystem.java:353)
	at org.apache.hadoop.fs.FileSystem.mkdirs(FileSystem.java:428)
	at org.apache.hadoop.mapreduce.JobSubmitter.copyAndConfigureFiles(JobSubmitter.java:166)
	at org.apache.hadoop.mapreduce.JobSubmitter.copyAndConfigureFiles(JobSubmitter.java:283)
	at org.apache.hadoop.mapreduce.JobSubmitter.submitJobInternal(JobSubmitter.java:350)
	at org.apache.hadoop.mapreduce.Job$2.run(Job.java:1037)
	at org.apache.hadoop.mapreduce.Job$2.run(Job.java:1034)
	at java.security.AccessController.doPrivileged(Native Method)
	at javax.security.auth.Subject.doAs(Subject.java:396)
	at org.apache.hadoop.security.UserGroupInformation.doAs(UserGroupInformation.java:1142)
	at org.apache.hadoop.mapreduce.Job.submit(Job.java:1034)
	at org.apache.hadoop.mapred.JobClient.submitJob(JobClient.java:536)
	at org.apache.hadoop.mapred.JobClient.runJob(JobClient.java:781)
	at org.apache.hadoop.mapred.join.TestDatamerge.joinAs(TestDatamerge.java:245)
	at org.apache.hadoop.mapred.join.TestDatamerge.__CLR3_0_239fxnh7xs(TestDatamerge.java:250)
	at org.apache.hadoop.mapred.join.TestDatamerge.testSimpleInnerJoin(TestDatamerge.java:249)
	at junit.extensions.TestDecorator.basicRun(TestDecorator.java:24)
	at junit.extensions.TestSetup$1.protect(TestSetup.java:23)
	at junit.extensions.TestSetup.run(TestSetup.java:27)


FAILED:  org.apache.hadoop.mapred.join.TestDatamerge.testSimpleOuterJoin

Error Message:
chmod: cannot access `/tmp/hadoop-hudson/mapred/staging/hudson185519719/.staging/job_local_0002': No such file or directory 

Stack Trace:
org.apache.hadoop.util.Shell$ExitCodeException: chmod: cannot access `/tmp/hadoop-hudson/mapred/staging/hudson185519719/.staging/job_local_0002': No such file or directory

	at org.apache.hadoop.util.Shell.runCommand(Shell.java:261)
	at org.apache.hadoop.util.Shell.run(Shell.java:188)
	at org.apache.hadoop.util.Shell$ShellCommandExecutor.execute(Shell.java:381)
	at org.apache.hadoop.util.Shell.execCommand(Shell.java:467)
	at org.apache.hadoop.util.Shell.execCommand(Shell.java:450)
	at org.apache.hadoop.fs.RawLocalFileSystem.execCommand(RawLocalFileSystem.java:549)
	at org.apache.hadoop.fs.RawLocalFileSystem.setPermission(RawLocalFileSystem.java:540)
	at org.apache.hadoop.fs.FilterFileSystem.setPermission(FilterFileSystem.java:353)
	at org.apache.hadoop.fs.FileSystem.mkdirs(FileSystem.java:428)
	at org.apache.hadoop.mapreduce.JobSubmitter.copyAndConfigureFiles(JobSubmitter.java:166)
	at org.apache.hadoop.mapreduce.JobSubmitter.copyAndConfigureFiles(JobSubmitter.java:283)
	at org.apache.hadoop.mapreduce.JobSubmitter.submitJobInternal(JobSubmitter.java:350)
	at org.apache.hadoop.mapreduce.Job$2.run(Job.java:1037)
	at org.apache.hadoop.mapreduce.Job$2.run(Job.java:1034)
	at java.security.AccessController.doPrivileged(Native Method)
	at javax.security.auth.Subject.doAs(Subject.java:396)
	at org.apache.hadoop.security.UserGroupInformation.doAs(UserGroupInformation.java:1142)
	at org.apache.hadoop.mapreduce.Job.submit(Job.java:1034)
	at org.apache.hadoop.mapred.JobClient.submitJob(JobClient.java:536)
	at org.apache.hadoop.mapred.JobClient.runJob(JobClient.java:781)
	at org.apache.hadoop.mapred.join.TestDatamerge.joinAs(TestDatamerge.java:245)
	at org.apache.hadoop.mapred.join.TestDatamerge.__CLR3_0_2abzcwo7xu(TestDatamerge.java:254)
	at org.apache.hadoop.mapred.join.TestDatamerge.testSimpleOuterJoin(TestDatamerge.java:253)
	at junit.extensions.TestDecorator.basicRun(TestDecorator.java:24)
	at junit.extensions.TestSetup$1.protect(TestSetup.java:23)
	at junit.extensions.TestSetup.run(TestSetup.java:27)


FAILED:  org.apache.hadoop.mapred.join.TestDatamerge.testSimpleOverride

Error Message:
chmod: cannot access `/tmp/hadoop-hudson/mapred/staging/hudson1523289795/.staging/job_local_0003': No such file or directory 

Stack Trace:
org.apache.hadoop.util.Shell$ExitCodeException: chmod: cannot access `/tmp/hadoop-hudson/mapred/staging/hudson1523289795/.staging/job_local_0003': No such file or directory

	at org.apache.hadoop.util.Shell.runCommand(Shell.java:261)
	at org.apache.hadoop.util.Shell.run(Shell.java:188)
	at org.apache.hadoop.util.Shell$ShellCommandExecutor.execute(Shell.java:381)
	at org.apache.hadoop.util.Shell.execCommand(Shell.java:467)
	at org.apache.hadoop.util.Shell.execCommand(Shell.java:450)
	at org.apache.hadoop.fs.RawLocalFileSystem.execCommand(RawLocalFileSystem.java:549)
	at org.apache.hadoop.fs.RawLocalFileSystem.setPermission(RawLocalFileSystem.java:540)
	at org.apache.hadoop.fs.FilterFileSystem.setPermission(FilterFileSystem.java:353)
	at org.apache.hadoop.fs.FileSystem.mkdirs(FileSystem.java:428)
	at org.apache.hadoop.mapreduce.JobSubmitter.copyAndConfigureFiles(JobSubmitter.java:166)
	at org.apache.hadoop.mapreduce.JobSubmitter.copyAndConfigureFiles(JobSubmitter.java:283)
	at org.apache.hadoop.mapreduce.JobSubmitter.submitJobInternal(JobSubmitter.java:350)
	at org.apache.hadoop.mapreduce.Job$2.run(Job.java:1037)
	at org.apache.hadoop.mapreduce.Job$2.run(Job.java:1034)
	at java.security.AccessController.doPrivileged(Native Method)
	at javax.security.auth.Subject.doAs(Subject.java:396)
	at org.apache.hadoop.security.UserGroupInformation.doAs(UserGroupInformation.java:1142)
	at org.apache.hadoop.mapreduce.Job.submit(Job.java:1034)
	at org.apache.hadoop.mapred.JobClient.submitJob(JobClient.java:536)
	at org.apache.hadoop.mapred.JobClient.runJob(JobClient.java:781)
	at org.apache.hadoop.mapred.join.TestDatamerge.joinAs(TestDatamerge.java:245)
	at org.apache.hadoop.mapred.join.TestDatamerge.__CLR3_0_2a19all7xw(TestDatamerge.java:258)
	at org.apache.hadoop.mapred.join.TestDatamerge.testSimpleOverride(TestDatamerge.java:257)
	at junit.extensions.TestDecorator.basicRun(TestDecorator.java:24)
	at junit.extensions.TestSetup$1.protect(TestSetup.java:23)
	at junit.extensions.TestSetup.run(TestSetup.java:27)


FAILED:  org.apache.hadoop.mapred.join.TestDatamerge.testNestedJoin

Error Message:
chmod: cannot access `/tmp/hadoop-hudson/mapred/staging/hudson515515830/.staging/job_local_0004': No such file or directory 

Stack Trace:
org.apache.hadoop.util.Shell$ExitCodeException: chmod: cannot access `/tmp/hadoop-hudson/mapred/staging/hudson515515830/.staging/job_local_0004': No such file or directory

	at org.apache.hadoop.util.Shell.runCommand(Shell.java:261)
	at org.apache.hadoop.util.Shell.run(Shell.java:188)
	at org.apache.hadoop.util.Shell$ShellCommandExecutor.execute(Shell.java:381)
	at org.apache.hadoop.util.Shell.execCommand(Shell.java:467)
	at org.apache.hadoop.util.Shell.execCommand(Shell.java:450)
	at org.apache.hadoop.fs.RawLocalFileSystem.execCommand(RawLocalFileSystem.java:549)
	at org.apache.hadoop.fs.RawLocalFileSystem.setPermission(RawLocalFileSystem.java:540)
	at org.apache.hadoop.fs.FilterFileSystem.setPermission(FilterFileSystem.java:353)
	at org.apache.hadoop.fs.FileSystem.mkdirs(FileSystem.java:428)
	at org.apache.hadoop.mapreduce.JobSubmitter.copyAndConfigureFiles(JobSubmitter.java:166)
	at org.apache.hadoop.mapreduce.JobSubmitter.copyAndConfigureFiles(JobSubmitter.java:283)
	at org.apache.hadoop.mapreduce.JobSubmitter.submitJobInternal(JobSubmitter.java:350)
	at org.apache.hadoop.mapreduce.Job$2.run(Job.java:1037)
	at org.apache.hadoop.mapreduce.Job$2.run(Job.java:1034)
	at java.security.AccessController.doPrivileged(Native Method)
	at javax.security.auth.Subject.doAs(Subject.java:396)
	at org.apache.hadoop.security.UserGroupInformation.doAs(UserGroupInformation.java:1142)
	at org.apache.hadoop.mapreduce.Job.submit(Job.java:1034)
	at org.apache.hadoop.mapred.JobClient.submitJob(JobClient.java:536)
	at org.apache.hadoop.mapred.JobClient.runJob(JobClient.java:781)
	at org.apache.hadoop.mapred.join.TestDatamerge.__CLR3_0_2fiduje7xy(TestDatamerge.java:319)
	at org.apache.hadoop.mapred.join.TestDatamerge.testNestedJoin(TestDatamerge.java:261)
	at junit.extensions.TestDecorator.basicRun(TestDecorator.java:24)
	at junit.extensions.TestSetup$1.protect(TestSetup.java:23)
	at junit.extensions.TestSetup.run(TestSetup.java:27)


FAILED:  org.apache.hadoop.mapred.join.TestDatamerge.testEmptyJoin

Error Message:
chmod: cannot access `/tmp/hadoop-hudson/mapred/staging/hudson1361697595/.staging/job_local_0005': No such file or directory 

Stack Trace:
org.apache.hadoop.util.Shell$ExitCodeException: chmod: cannot access `/tmp/hadoop-hudson/mapred/staging/hudson1361697595/.staging/job_local_0005': No such file or directory

	at org.apache.hadoop.util.Shell.runCommand(Shell.java:261)
	at org.apache.hadoop.util.Shell.run(Shell.java:188)
	at org.apache.hadoop.util.Shell$ShellCommandExecutor.execute(Shell.java:381)
	at org.apache.hadoop.util.Shell.execCommand(Shell.java:467)
	at org.apache.hadoop.util.Shell.execCommand(Shell.java:450)
	at org.apache.hadoop.fs.RawLocalFileSystem.execCommand(RawLocalFileSystem.java:549)
	at org.apache.hadoop.fs.RawLocalFileSystem.setPermission(RawLocalFileSystem.java:540)
	at org.apache.hadoop.fs.FilterFileSystem.setPermission(FilterFileSystem.java:353)
	at org.apache.hadoop.fs.FileSystem.mkdirs(FileSystem.java:428)
	at org.apache.hadoop.mapreduce.JobSubmitter.copyAndConfigureFiles(JobSubmitter.java:166)
	at org.apache.hadoop.mapreduce.JobSubmitter.copyAndConfigureFiles(JobSubmitter.java:283)
	at org.apache.hadoop.mapreduce.JobSubmitter.submitJobInternal(JobSubmitter.java:350)
	at org.apache.hadoop.mapreduce.Job$2.run(Job.java:1037)
	at org.apache.hadoop.mapreduce.Job$2.run(Job.java:1034)
	at java.security.AccessController.doPrivileged(Native Method)
	at javax.security.auth.Subject.doAs(Subject.java:396)
	at org.apache.hadoop.security.UserGroupInformation.doAs(UserGroupInformation.java:1142)
	at org.apache.hadoop.mapreduce.Job.submit(Job.java:1034)
	at org.apache.hadoop.mapred.JobClient.submitJob(JobClient.java:536)
	at org.apache.hadoop.mapred.JobClient.runJob(JobClient.java:781)
	at org.apache.hadoop.mapred.join.TestDatamerge.__CLR3_0_2f6b0b080i(TestDatamerge.java:367)
	at org.apache.hadoop.mapred.join.TestDatamerge.testEmptyJoin(TestDatamerge.java:353)
	at junit.extensions.TestDecorator.basicRun(TestDecorator.java:24)
	at junit.extensions.TestSetup$1.protect(TestSetup.java:23)
	at junit.extensions.TestSetup.run(TestSetup.java:27)


FAILED:  org.apache.hadoop.mapred.lib.TestChainMapReduce.testChain

Error Message:
chmod: cannot access `/tmp/hadoop-hudson/mapred/staging/hudson1667247756/.staging/job_local_0001': No such file or directory 

Stack Trace:
org.apache.hadoop.util.Shell$ExitCodeException: chmod: cannot access `/tmp/hadoop-hudson/mapred/staging/hudson1667247756/.staging/job_local_0001': No such file or directory

	at org.apache.hadoop.util.Shell.runCommand(Shell.java:261)
	at org.apache.hadoop.util.Shell.run(Shell.java:188)
	at org.apache.hadoop.util.Shell$ShellCommandExecutor.execute(Shell.java:381)
	at org.apache.hadoop.util.Shell.execCommand(Shell.java:467)
	at org.apache.hadoop.util.Shell.execCommand(Shell.java:450)
	at org.apache.hadoop.fs.RawLocalFileSystem.execCommand(RawLocalFileSystem.java:549)
	at org.apache.hadoop.fs.RawLocalFileSystem.setPermission(RawLocalFileSystem.java:540)
	at org.apache.hadoop.fs.FilterFileSystem.setPermission(FilterFileSystem.java:353)
	at org.apache.hadoop.fs.FileSystem.mkdirs(FileSystem.java:428)
	at org.apache.hadoop.mapreduce.JobSubmitter.copyAndConfigureFiles(JobSubmitter.java:166)
	at org.apache.hadoop.mapreduce.JobSubmitter.copyAndConfigureFiles(JobSubmitter.java:283)
	at org.apache.hadoop.mapreduce.JobSubmitter.submitJobInternal(JobSubmitter.java:350)
	at org.apache.hadoop.mapreduce.Job$2.run(Job.java:1037)
	at org.apache.hadoop.mapreduce.Job$2.run(Job.java:1034)
	at java.security.AccessController.doPrivileged(Native Method)
	at javax.security.auth.Subject.doAs(Subject.java:396)
	at org.apache.hadoop.security.UserGroupInformation.doAs(UserGroupInformation.java:1142)
	at org.apache.hadoop.mapreduce.Job.submit(Job.java:1034)
	at org.apache.hadoop.mapred.JobClient.submitJob(JobClient.java:536)
	at org.apache.hadoop.mapred.lib.TestChainMapReduce.__CLR3_0_2ke5z1yho0(TestChainMapReduce.java:130)
	at org.apache.hadoop.mapred.lib.TestChainMapReduce.testChain(TestChainMapReduce.java:70)


FAILED:  org.apache.hadoop.mapred.lib.TestKeyFieldBasedComparator.testBasicUnixComparator

Error Message:
chmod: cannot access `/tmp/hadoop-hudson/mapred/staging/hudson1218957120/.staging/job_local_0001': No such file or directory 

Stack Trace:
org.apache.hadoop.util.Shell$ExitCodeException: chmod: cannot access `/tmp/hadoop-hudson/mapred/staging/hudson1218957120/.staging/job_local_0001': No such file or directory

	at org.apache.hadoop.util.Shell.runCommand(Shell.java:261)
	at org.apache.hadoop.util.Shell.run(Shell.java:188)
	at org.apache.hadoop.util.Shell$ShellCommandExecutor.execute(Shell.java:381)
	at org.apache.hadoop.util.Shell.execCommand(Shell.java:467)
	at org.apache.hadoop.util.Shell.execCommand(Shell.java:450)
	at org.apache.hadoop.fs.RawLocalFileSystem.execCommand(RawLocalFileSystem.java:549)
	at org.apache.hadoop.fs.RawLocalFileSystem.setPermission(RawLocalFileSystem.java:540)
	at org.apache.hadoop.fs.FilterFileSystem.setPermission(FilterFileSystem.java:353)
	at org.apache.hadoop.fs.FileSystem.mkdirs(FileSystem.java:428)
	at org.apache.hadoop.mapreduce.JobSubmitter.copyAndConfigureFiles(JobSubmitter.java:166)
	at org.apache.hadoop.mapreduce.JobSubmitter.copyAndConfigureFiles(JobSubmitter.java:283)
	at org.apache.hadoop.mapreduce.JobSubmitter.submitJobInternal(JobSubmitter.java:350)
	at org.apache.hadoop.mapreduce.Job$2.run(Job.java:1037)
	at org.apache.hadoop.mapreduce.Job$2.run(Job.java:1034)
	at java.security.AccessController.doPrivileged(Native Method)
	at javax.security.auth.Subject.doAs(Subject.java:396)
	at org.apache.hadoop.security.UserGroupInformation.doAs(UserGroupInformation.java:1142)
	at org.apache.hadoop.mapreduce.Job.submit(Job.java:1034)
	at org.apache.hadoop.mapred.JobClient.submitJob(JobClient.java:536)
	at org.apache.hadoop.mapred.lib.TestKeyFieldBasedComparator.configure(TestKeyFieldBasedComparator.java:88)
	at org.apache.hadoop.mapred.lib.TestKeyFieldBasedComparator.__CLR3_0_2efq8inuxn(TestKeyFieldBasedComparator.java:122)
	at org.apache.hadoop.mapred.lib.TestKeyFieldBasedComparator.testBasicUnixComparator(TestKeyFieldBasedComparator.java:121)


FAILED:  org.apache.hadoop.mapred.lib.TestMultipleOutputs.testWithoutCounters

Error Message:
chmod: cannot access `/tmp/hadoop-hudson/mapred/staging/hudson-1417239193/.staging/job_local_0001': No such file or directory 

Stack Trace:
org.apache.hadoop.util.Shell$ExitCodeException: chmod: cannot access `/tmp/hadoop-hudson/mapred/staging/hudson-1417239193/.staging/job_local_0001': No such file or directory

	at org.apache.hadoop.util.Shell.runCommand(Shell.java:261)
	at org.apache.hadoop.util.Shell.run(Shell.java:188)
	at org.apache.hadoop.util.Shell$ShellCommandExecutor.execute(Shell.java:381)
	at org.apache.hadoop.util.Shell.execCommand(Shell.java:467)
	at org.apache.hadoop.util.Shell.execCommand(Shell.java:450)
	at org.apache.hadoop.fs.RawLocalFileSystem.execCommand(RawLocalFileSystem.java:549)
	at org.apache.hadoop.fs.RawLocalFileSystem.setPermission(RawLocalFileSystem.java:540)
	at org.apache.hadoop.fs.FilterFileSystem.setPermission(FilterFileSystem.java:353)
	at org.apache.hadoop.fs.FileSystem.mkdirs(FileSystem.java:428)
	at org.apache.hadoop.mapreduce.JobSubmitter.copyAndConfigureFiles(JobSubmitter.java:166)
	at org.apache.hadoop.mapreduce.JobSubmitter.copyAndConfigureFiles(JobSubmitter.java:283)
	at org.apache.hadoop.mapreduce.JobSubmitter.submitJobInternal(JobSubmitter.java:350)
	at org.apache.hadoop.mapreduce.Job$2.run(Job.java:1037)
	at org.apache.hadoop.mapreduce.Job$2.run(Job.java:1034)
	at java.security.AccessController.doPrivileged(Native Method)
	at javax.security.auth.Subject.doAs(Subject.java:396)
	at org.apache.hadoop.security.UserGroupInformation.doAs(UserGroupInformation.java:1142)
	at org.apache.hadoop.mapreduce.Job.submit(Job.java:1034)
	at org.apache.hadoop.mapred.JobClient.submitJob(JobClient.java:536)
	at org.apache.hadoop.mapred.lib.TestMultipleOutputs._testMultipleOutputs(TestMultipleOutputs.java:215)
	at org.apache.hadoop.mapred.lib.TestMultipleOutputs.__CLR3_0_27rxkdoh6h(TestMultipleOutputs.java:42)
	at org.apache.hadoop.mapred.lib.TestMultipleOutputs.testWithoutCounters(TestMultipleOutputs.java:41)


FAILED:  org.apache.hadoop.mapred.lib.TestMultipleOutputs.testWithCounters

Error Message:
chmod: cannot access `/tmp/hadoop-hudson/mapred/staging/hudson-193379229/.staging/job_local_0002': No such file or directory 

Stack Trace:
org.apache.hadoop.util.Shell$ExitCodeException: chmod: cannot access `/tmp/hadoop-hudson/mapred/staging/hudson-193379229/.staging/job_local_0002': No such file or directory

	at org.apache.hadoop.util.Shell.runCommand(Shell.java:261)
	at org.apache.hadoop.util.Shell.run(Shell.java:188)
	at org.apache.hadoop.util.Shell$ShellCommandExecutor.execute(Shell.java:381)
	at org.apache.hadoop.util.Shell.execCommand(Shell.java:467)
	at org.apache.hadoop.util.Shell.execCommand(Shell.java:450)
	at org.apache.hadoop.fs.RawLocalFileSystem.execCommand(RawLocalFileSystem.java:549)
	at org.apache.hadoop.fs.RawLocalFileSystem.setPermission(RawLocalFileSystem.java:540)
	at org.apache.hadoop.fs.FilterFileSystem.setPermission(FilterFileSystem.java:353)
	at org.apache.hadoop.fs.FileSystem.mkdirs(FileSystem.java:428)
	at org.apache.hadoop.mapreduce.JobSubmitter.copyAndConfigureFiles(JobSubmitter.java:166)
	at org.apache.hadoop.mapreduce.JobSubmitter.copyAndConfigureFiles(JobSubmitter.java:283)
	at org.apache.hadoop.mapreduce.JobSubmitter.submitJobInternal(JobSubmitter.java:350)
	at org.apache.hadoop.mapreduce.Job$2.run(Job.java:1037)
	at org.apache.hadoop.mapreduce.Job$2.run(Job.java:1034)
	at java.security.AccessController.doPrivileged(Native Method)
	at javax.security.auth.Subject.doAs(Subject.java:396)
	at org.apache.hadoop.security.UserGroupInformation.doAs(UserGroupInformation.java:1142)
	at org.apache.hadoop.mapreduce.Job.submit(Job.java:1034)
	at org.apache.hadoop.mapred.JobClient.submitJob(JobClient.java:536)
	at org.apache.hadoop.mapred.lib.TestMultipleOutputs._testMultipleOutputs(TestMultipleOutputs.java:215)
	at org.apache.hadoop.mapred.lib.TestMultipleOutputs.__CLR3_0_2435lo6h6k(TestMultipleOutputs.java:47)
	at org.apache.hadoop.mapred.lib.TestMultipleOutputs.testWithCounters(TestMultipleOutputs.java:46)


FAILED:  org.apache.hadoop.mapred.lib.TestMultithreadedMapRunner.testOKRun

Error Message:
chmod: cannot access `/tmp/hadoop-hudson/mapred/staging/hudson-196554710/.staging/job_local_0001': No such file or directory 

Stack Trace:
org.apache.hadoop.util.Shell$ExitCodeException: chmod: cannot access `/tmp/hadoop-hudson/mapred/staging/hudson-196554710/.staging/job_local_0001': No such file or directory

	at org.apache.hadoop.util.Shell.runCommand(Shell.java:261)
	at org.apache.hadoop.util.Shell.run(Shell.java:188)
	at org.apache.hadoop.util.Shell$ShellCommandExecutor.execute(Shell.java:381)
	at org.apache.hadoop.util.Shell.execCommand(Shell.java:467)
	at org.apache.hadoop.util.Shell.execCommand(Shell.java:450)
	at org.apache.hadoop.fs.RawLocalFileSystem.execCommand(RawLocalFileSystem.java:549)
	at org.apache.hadoop.fs.RawLocalFileSystem.setPermission(RawLocalFileSystem.java:540)
	at org.apache.hadoop.fs.FilterFileSystem.setPermission(FilterFileSystem.java:353)
	at org.apache.hadoop.fs.FileSystem.mkdirs(FileSystem.java:428)
	at org.apache.hadoop.mapreduce.JobSubmitter.copyAndConfigureFiles(JobSubmitter.java:166)
	at org.apache.hadoop.mapreduce.JobSubmitter.copyAndConfigureFiles(JobSubmitter.java:283)
	at org.apache.hadoop.mapreduce.JobSubmitter.submitJobInternal(JobSubmitter.java:350)
	at org.apache.hadoop.mapreduce.Job$2.run(Job.java:1037)
	at org.apache.hadoop.mapreduce.Job$2.run(Job.java:1034)
	at java.security.AccessController.doPrivileged(Native Method)
	at javax.security.auth.Subject.doAs(Subject.java:396)
	at org.apache.hadoop.security.UserGroupInformation.doAs(UserGroupInformation.java:1142)
	at org.apache.hadoop.mapreduce.Job.submit(Job.java:1034)
	at org.apache.hadoop.mapred.JobClient.submitJob(JobClient.java:536)
	at org.apache.hadoop.mapred.lib.TestMultithreadedMapRunner.run(TestMultithreadedMapRunner.java:105)
	at org.apache.hadoop.mapred.lib.TestMultithreadedMapRunner.__CLR3_0_2dhspyc98u(TestMultithreadedMapRunner.java:39)
	at org.apache.hadoop.mapred.lib.TestMultithreadedMapRunner.testOKRun(TestMultithreadedMapRunner.java:38)


FAILED:  org.apache.hadoop.mapred.lib.TestMultithreadedMapRunner.testIOExRun

Error Message:
chmod: cannot access `/tmp/hadoop-hudson/mapred/staging/hudson-1800142890/.staging/job_local_0002': No such file or directory 

Stack Trace:
org.apache.hadoop.util.Shell$ExitCodeException: chmod: cannot access `/tmp/hadoop-hudson/mapred/staging/hudson-1800142890/.staging/job_local_0002': No such file or directory

	at org.apache.hadoop.util.Shell.runCommand(Shell.java:261)
	at org.apache.hadoop.util.Shell.run(Shell.java:188)
	at org.apache.hadoop.util.Shell$ShellCommandExecutor.execute(Shell.java:381)
	at org.apache.hadoop.util.Shell.execCommand(Shell.java:467)
	at org.apache.hadoop.util.Shell.execCommand(Shell.java:450)
	at org.apache.hadoop.fs.RawLocalFileSystem.execCommand(RawLocalFileSystem.java:549)
	at org.apache.hadoop.fs.RawLocalFileSystem.setPermission(RawLocalFileSystem.java:540)
	at org.apache.hadoop.fs.FilterFileSystem.setPermission(FilterFileSystem.java:353)
	at org.apache.hadoop.fs.FileSystem.mkdirs(FileSystem.java:428)
	at org.apache.hadoop.mapreduce.JobSubmitter.copyAndConfigureFiles(JobSubmitter.java:166)
	at org.apache.hadoop.mapreduce.JobSubmitter.copyAndConfigureFiles(JobSubmitter.java:283)
	at org.apache.hadoop.mapreduce.JobSubmitter.submitJobInternal(JobSubmitter.java:350)
	at org.apache.hadoop.mapreduce.Job$2.run(Job.java:1037)
	at org.apache.hadoop.mapreduce.Job$2.run(Job.java:1034)
	at java.security.AccessController.doPrivileged(Native Method)
	at javax.security.auth.Subject.doAs(Subject.java:396)
	at org.apache.hadoop.security.UserGroupInformation.doAs(UserGroupInformation.java:1142)
	at org.apache.hadoop.mapreduce.Job.submit(Job.java:1034)
	at org.apache.hadoop.mapred.JobClient.submitJob(JobClient.java:536)
	at org.apache.hadoop.mapred.lib.TestMultithreadedMapRunner.run(TestMultithreadedMapRunner.java:105)
	at org.apache.hadoop.mapred.lib.TestMultithreadedMapRunner.__CLR3_0_21nnwsn98w(TestMultithreadedMapRunner.java:43)
	at org.apache.hadoop.mapred.lib.TestMultithreadedMapRunner.testIOExRun(TestMultithreadedMapRunner.java:42)


FAILED:  org.apache.hadoop.mapred.lib.TestMultithreadedMapRunner.testRuntimeExRun

Error Message:
chmod: cannot access `/tmp/hadoop-hudson/mapred/staging/hudson1522759501/.staging/job_local_0003': No such file or directory 

Stack Trace:
org.apache.hadoop.util.Shell$ExitCodeException: chmod: cannot access `/tmp/hadoop-hudson/mapred/staging/hudson1522759501/.staging/job_local_0003': No such file or directory

	at org.apache.hadoop.util.Shell.runCommand(Shell.java:261)
	at org.apache.hadoop.util.Shell.run(Shell.java:188)
	at org.apache.hadoop.util.Shell$ShellCommandExecutor.execute(Shell.java:381)
	at org.apache.hadoop.util.Shell.execCommand(Shell.java:467)
	at org.apache.hadoop.util.Shell.execCommand(Shell.java:450)
	at org.apache.hadoop.fs.RawLocalFileSystem.execCommand(RawLocalFileSystem.java:549)
	at org.apache.hadoop.fs.RawLocalFileSystem.setPermission(RawLocalFileSystem.java:540)
	at org.apache.hadoop.fs.FilterFileSystem.setPermission(FilterFileSystem.java:353)
	at org.apache.hadoop.fs.FileSystem.mkdirs(FileSystem.java:428)
	at org.apache.hadoop.mapreduce.JobSubmitter.copyAndConfigureFiles(JobSubmitter.java:166)
	at org.apache.hadoop.mapreduce.JobSubmitter.copyAndConfigureFiles(JobSubmitter.java:283)
	at org.apache.hadoop.mapreduce.JobSubmitter.submitJobInternal(JobSubmitter.java:350)
	at org.apache.hadoop.mapreduce.Job$2.run(Job.java:1037)
	at org.apache.hadoop.mapreduce.Job$2.run(Job.java:1034)
	at java.security.AccessController.doPrivileged(Native Method)
	at javax.security.auth.Subject.doAs(Subject.java:396)
	at org.apache.hadoop.security.UserGroupInformation.doAs(UserGroupInformation.java:1142)
	at org.apache.hadoop.mapreduce.Job.submit(Job.java:1034)
	at org.apache.hadoop.mapred.JobClient.submitJob(JobClient.java:536)
	at org.apache.hadoop.mapred.lib.TestMultithreadedMapRunner.run(TestMultithreadedMapRunner.java:105)
	at org.apache.hadoop.mapred.lib.TestMultithreadedMapRunner.__CLR3_0_2zf5zzb98y(TestMultithreadedMapRunner.java:46)
	at org.apache.hadoop.mapred.lib.TestMultithreadedMapRunner.testRuntimeExRun(TestMultithreadedMapRunner.java:45)


FAILED:  org.apache.hadoop.mapred.lib.aggregate.TestAggregates.testAggregates

Error Message:
chmod: cannot access `/tmp/hadoop-hudson/mapred/staging/hudson-1874944305/.staging/job_local_0001': No such file or directory 

Stack Trace:
org.apache.hadoop.util.Shell$ExitCodeException: chmod: cannot access `/tmp/hadoop-hudson/mapred/staging/hudson-1874944305/.staging/job_local_0001': No such file or directory

	at org.apache.hadoop.util.Shell.runCommand(Shell.java:261)
	at org.apache.hadoop.util.Shell.run(Shell.java:188)
	at org.apache.hadoop.util.Shell$ShellCommandExecutor.execute(Shell.java:381)
	at org.apache.hadoop.util.Shell.execCommand(Shell.java:467)
	at org.apache.hadoop.util.Shell.execCommand(Shell.java:450)
	at org.apache.hadoop.fs.RawLocalFileSystem.execCommand(RawLocalFileSystem.java:549)
	at org.apache.hadoop.fs.RawLocalFileSystem.setPermission(RawLocalFileSystem.java:540)
	at org.apache.hadoop.fs.FilterFileSystem.setPermission(FilterFileSystem.java:353)
	at org.apache.hadoop.fs.FileSystem.mkdirs(FileSystem.java:428)
	at org.apache.hadoop.mapreduce.JobSubmitter.copyAndConfigureFiles(JobSubmitter.java:166)
	at org.apache.hadoop.mapreduce.JobSubmitter.copyAndConfigureFiles(JobSubmitter.java:283)
	at org.apache.hadoop.mapreduce.JobSubmitter.submitJobInternal(JobSubmitter.java:350)
	at org.apache.hadoop.mapreduce.Job$2.run(Job.java:1037)
	at org.apache.hadoop.mapreduce.Job$2.run(Job.java:1034)
	at java.security.AccessController.doPrivileged(Native Method)
	at javax.security.auth.Subject.doAs(Subject.java:396)
	at org.apache.hadoop.security.UserGroupInformation.doAs(UserGroupInformation.java:1142)
	at org.apache.hadoop.mapreduce.Job.submit(Job.java:1034)
	at org.apache.hadoop.mapred.JobClient.submitJob(JobClient.java:536)
	at org.apache.hadoop.mapred.JobClient.runJob(JobClient.java:781)
	at org.apache.hadoop.mapred.lib.aggregate.TestAggregates.launch(TestAggregates.java:103)
	at org.apache.hadoop.mapred.lib.aggregate.TestAggregates.__CLR3_0_21uoc3jpe(TestAggregates.java:41)
	at org.apache.hadoop.mapred.lib.aggregate.TestAggregates.testAggregates(TestAggregates.java:40)


FAILED:  org.apache.hadoop.mapreduce.TestLocalRunner.testGcCounter

Error Message:
chmod: cannot access `/tmp/hadoop-hudson/mapred/staging/hudson1376709224/.staging/job_local_0001': No such file or directory 

Stack Trace:
org.apache.hadoop.util.Shell$ExitCodeException: chmod: cannot access `/tmp/hadoop-hudson/mapred/staging/hudson1376709224/.staging/job_local_0001': No such file or directory

	at org.apache.hadoop.util.Shell.runCommand(Shell.java:261)
	at org.apache.hadoop.util.Shell.run(Shell.java:188)
	at org.apache.hadoop.util.Shell$ShellCommandExecutor.execute(Shell.java:381)
	at org.apache.hadoop.util.Shell.execCommand(Shell.java:467)
	at org.apache.hadoop.util.Shell.execCommand(Shell.java:450)
	at org.apache.hadoop.fs.RawLocalFileSystem.execCommand(RawLocalFileSystem.java:549)
	at org.apache.hadoop.fs.RawLocalFileSystem.setPermission(RawLocalFileSystem.java:540)
	at org.apache.hadoop.fs.FilterFileSystem.setPermission(FilterFileSystem.java:353)
	at org.apache.hadoop.fs.FileSystem.mkdirs(FileSystem.java:428)
	at org.apache.hadoop.mapreduce.JobSubmitter.copyAndConfigureFiles(JobSubmitter.java:166)
	at org.apache.hadoop.mapreduce.JobSubmitter.copyAndConfigureFiles(JobSubmitter.java:283)
	at org.apache.hadoop.mapreduce.JobSubmitter.submitJobInternal(JobSubmitter.java:350)
	at org.apache.hadoop.mapreduce.Job$2.run(Job.java:1037)
	at org.apache.hadoop.mapreduce.Job$2.run(Job.java:1034)
	at java.security.AccessController.doPrivileged(Native Method)
	at javax.security.auth.Subject.doAs(Subject.java:396)
	at org.apache.hadoop.security.UserGroupInformation.doAs(UserGroupInformation.java:1142)
	at org.apache.hadoop.mapreduce.Job.submit(Job.java:1034)
	at org.apache.hadoop.mapreduce.Job.waitForCompletion(Job.java:1054)
	at org.apache.hadoop.mapreduce.TestLocalRunner.__CLR3_0_2tnowa3qab(TestLocalRunner.java:271)
	at org.apache.hadoop.mapreduce.TestLocalRunner.testGcCounter(TestLocalRunner.java:244)


FAILED:  org.apache.hadoop.mapreduce.TestLocalRunner.testMultiMaps

Error Message:
chmod: cannot access `/tmp/hadoop-hudson/mapred/staging/hudson-846519740/.staging/job_local_0002': No such file or directory 

Stack Trace:
org.apache.hadoop.util.Shell$ExitCodeException: chmod: cannot access `/tmp/hadoop-hudson/mapred/staging/hudson-846519740/.staging/job_local_0002': No such file or directory

	at org.apache.hadoop.util.Shell.runCommand(Shell.java:261)
	at org.apache.hadoop.util.Shell.run(Shell.java:188)
	at org.apache.hadoop.util.Shell$ShellCommandExecutor.execute(Shell.java:381)
	at org.apache.hadoop.util.Shell.execCommand(Shell.java:467)
	at org.apache.hadoop.util.Shell.execCommand(Shell.java:450)
	at org.apache.hadoop.fs.RawLocalFileSystem.execCommand(RawLocalFileSystem.java:549)
	at org.apache.hadoop.fs.RawLocalFileSystem.setPermission(RawLocalFileSystem.java:540)
	at org.apache.hadoop.fs.FilterFileSystem.setPermission(FilterFileSystem.java:353)
	at org.apache.hadoop.fs.FileSystem.mkdirs(FileSystem.java:428)
	at org.apache.hadoop.mapreduce.JobSubmitter.copyAndConfigureFiles(JobSubmitter.java:166)
	at org.apache.hadoop.mapreduce.JobSubmitter.copyAndConfigureFiles(JobSubmitter.java:283)
	at org.apache.hadoop.mapreduce.JobSubmitter.submitJobInternal(JobSubmitter.java:350)
	at org.apache.hadoop.mapreduce.Job$2.run(Job.java:1037)
	at org.apache.hadoop.mapreduce.Job$2.run(Job.java:1034)
	at java.security.AccessController.doPrivileged(Native Method)
	at javax.security.auth.Subject.doAs(Subject.java:396)
	at org.apache.hadoop.security.UserGroupInformation.doAs(UserGroupInformation.java:1142)
	at org.apache.hadoop.mapreduce.Job.submit(Job.java:1034)
	at org.apache.hadoop.mapreduce.TestLocalRunner.__CLR3_0_21tclffqb0(TestLocalRunner.java:321)
	at org.apache.hadoop.mapreduce.TestLocalRunner.testMultiMaps(TestLocalRunner.java:289)


FAILED:  org.apache.hadoop.mapreduce.TestLocalRunner.testInvalidMultiMapParallelism

Error Message:
chmod: cannot access `/tmp/hadoop-hudson/mapred/staging/hudson77110200/.staging/job_local_0003': No such file or directory 

Stack Trace:
org.apache.hadoop.util.Shell$ExitCodeException: chmod: cannot access `/tmp/hadoop-hudson/mapred/staging/hudson77110200/.staging/job_local_0003': No such file or directory

	at org.apache.hadoop.util.Shell.runCommand(Shell.java:261)
	at org.apache.hadoop.util.Shell.run(Shell.java:188)
	at org.apache.hadoop.util.Shell$ShellCommandExecutor.execute(Shell.java:381)
	at org.apache.hadoop.util.Shell.execCommand(Shell.java:467)
	at org.apache.hadoop.util.Shell.execCommand(Shell.java:450)
	at org.apache.hadoop.fs.RawLocalFileSystem.execCommand(RawLocalFileSystem.java:549)
	at org.apache.hadoop.fs.RawLocalFileSystem.setPermission(RawLocalFileSystem.java:540)
	at org.apache.hadoop.fs.FilterFileSystem.setPermission(FilterFileSystem.java:353)
	at org.apache.hadoop.fs.FileSystem.mkdirs(FileSystem.java:428)
	at org.apache.hadoop.mapreduce.JobSubmitter.copyAndConfigureFiles(JobSubmitter.java:166)
	at org.apache.hadoop.mapreduce.JobSubmitter.copyAndConfigureFiles(JobSubmitter.java:283)
	at org.apache.hadoop.mapreduce.JobSubmitter.submitJobInternal(JobSubmitter.java:350)
	at org.apache.hadoop.mapreduce.Job$2.run(Job.java:1037)
	at org.apache.hadoop.mapreduce.Job$2.run(Job.java:1034)
	at java.security.AccessController.doPrivileged(Native Method)
	at javax.security.auth.Subject.doAs(Subject.java:396)
	at org.apache.hadoop.security.UserGroupInformation.doAs(UserGroupInformation.java:1142)
	at org.apache.hadoop.mapreduce.Job.submit(Job.java:1034)
	at org.apache.hadoop.mapreduce.Job.waitForCompletion(Job.java:1054)
	at org.apache.hadoop.mapreduce.TestLocalRunner.__CLR3_0_22jq81nqc9(TestLocalRunner.java:373)
	at org.apache.hadoop.mapreduce.TestLocalRunner.testInvalidMultiMapParallelism(TestLocalRunner.java:353)


FAILED:  org.apache.hadoop.mapreduce.TestLocalRunner.testEmptyMaps

Error Message:
chmod: cannot access `/tmp/hadoop-hudson/mapred/staging/hudson-1206601772/.staging/job_local_0004': No such file or directory 

Stack Trace:
org.apache.hadoop.util.Shell$ExitCodeException: chmod: cannot access `/tmp/hadoop-hudson/mapred/staging/hudson-1206601772/.staging/job_local_0004': No such file or directory

	at org.apache.hadoop.util.Shell.runCommand(Shell.java:261)
	at org.apache.hadoop.util.Shell.run(Shell.java:188)
	at org.apache.hadoop.util.Shell$ShellCommandExecutor.execute(Shell.java:381)
	at org.apache.hadoop.util.Shell.execCommand(Shell.java:467)
	at org.apache.hadoop.util.Shell.execCommand(Shell.java:450)
	at org.apache.hadoop.fs.RawLocalFileSystem.execCommand(RawLocalFileSystem.java:549)
	at org.apache.hadoop.fs.RawLocalFileSystem.setPermission(RawLocalFileSystem.java:540)
	at org.apache.hadoop.fs.FilterFileSystem.setPermission(FilterFileSystem.java:353)
	at org.apache.hadoop.fs.FileSystem.mkdirs(FileSystem.java:428)
	at org.apache.hadoop.mapreduce.JobSubmitter.copyAndConfigureFiles(JobSubmitter.java:166)
	at org.apache.hadoop.mapreduce.JobSubmitter.copyAndConfigureFiles(JobSubmitter.java:283)
	at org.apache.hadoop.mapreduce.JobSubmitter.submitJobInternal(JobSubmitter.java:350)
	at org.apache.hadoop.mapreduce.Job$2.run(Job.java:1037)
	at org.apache.hadoop.mapreduce.Job$2.run(Job.java:1034)
	at java.security.AccessController.doPrivileged(Native Method)
	at javax.security.auth.Subject.doAs(Subject.java:396)
	at org.apache.hadoop.security.UserGroupInformation.doAs(UserGroupInformation.java:1142)
	at org.apache.hadoop.mapreduce.Job.submit(Job.java:1034)
	at org.apache.hadoop.mapreduce.Job.waitForCompletion(Job.java:1054)
	at org.apache.hadoop.mapreduce.TestLocalRunner.__CLR3_0_285g4nqd5(TestLocalRunner.java:429)
	at org.apache.hadoop.mapreduce.TestLocalRunner.testEmptyMaps(TestLocalRunner.java:414)


FAILED:  org.apache.hadoop.mapreduce.TestMapCollection.testValLastByte

Error Message:
chmod: cannot access `/tmp/hadoop-hudson/mapred/staging/hudson30316289/.staging/job_local_0001': No such file or directory 

Stack Trace:
org.apache.hadoop.util.Shell$ExitCodeException: chmod: cannot access `/tmp/hadoop-hudson/mapred/staging/hudson30316289/.staging/job_local_0001': No such file or directory

	at org.apache.hadoop.util.Shell.runCommand(Shell.java:261)
	at org.apache.hadoop.util.Shell.run(Shell.java:188)
	at org.apache.hadoop.util.Shell$ShellCommandExecutor.execute(Shell.java:381)
	at org.apache.hadoop.util.Shell.execCommand(Shell.java:467)
	at org.apache.hadoop.util.Shell.execCommand(Shell.java:450)
	at org.apache.hadoop.fs.RawLocalFileSystem.execCommand(RawLocalFileSystem.java:549)
	at org.apache.hadoop.fs.RawLocalFileSystem.setPermission(RawLocalFileSystem.java:540)
	at org.apache.hadoop.fs.FilterFileSystem.setPermission(FilterFileSystem.java:353)
	at org.apache.hadoop.fs.FileSystem.mkdirs(FileSystem.java:428)
	at org.apache.hadoop.mapreduce.JobSubmitter.copyAndConfigureFiles(JobSubmitter.java:166)
	at org.apache.hadoop.mapreduce.JobSubmitter.copyAndConfigureFiles(JobSubmitter.java:283)
	at org.apache.hadoop.mapreduce.JobSubmitter.submitJobInternal(JobSubmitter.java:350)
	at org.apache.hadoop.mapreduce.Job$2.run(Job.java:1037)
	at org.apache.hadoop.mapreduce.Job$2.run(Job.java:1034)
	at java.security.AccessController.doPrivileged(Native Method)
	at javax.security.auth.Subject.doAs(Subject.java:396)
	at org.apache.hadoop.security.UserGroupInformation.doAs(UserGroupInformation.java:1142)
	at org.apache.hadoop.mapreduce.Job.submit(Job.java:1034)
	at org.apache.hadoop.mapreduce.Job.waitForCompletion(Job.java:1054)
	at org.apache.hadoop.mapreduce.TestMapCollection.runTest(TestMapCollection.java:326)
	at org.apache.hadoop.mapreduce.TestMapCollection.runTest(TestMapCollection.java:309)
	at org.apache.hadoop.mapreduce.TestMapCollection.__CLR3_0_2cypxscnrl(TestMapCollection.java:332)
	at org.apache.hadoop.mapreduce.TestMapCollection.testValLastByte(TestMapCollection.java:330)


FAILED:  org.apache.hadoop.mapreduce.TestMapCollection.testLargeRecords

Error Message:
chmod: cannot access `/tmp/hadoop-hudson/mapred/staging/hudson-591827821/.staging/job_local_0002': No such file or directory 

Stack Trace:
org.apache.hadoop.util.Shell$ExitCodeException: chmod: cannot access `/tmp/hadoop-hudson/mapred/staging/hudson-591827821/.staging/job_local_0002': No such file or directory

	at org.apache.hadoop.util.Shell.runCommand(Shell.java:261)
	at org.apache.hadoop.util.Shell.run(Shell.java:188)
	at org.apache.hadoop.util.Shell$ShellCommandExecutor.execute(Shell.java:381)
	at org.apache.hadoop.util.Shell.execCommand(Shell.java:467)
	at org.apache.hadoop.util.Shell.execCommand(Shell.java:450)
	at org.apache.hadoop.fs.RawLocalFileSystem.execCommand(RawLocalFileSystem.java:549)
	at org.apache.hadoop.fs.RawLocalFileSystem.setPermission(RawLocalFileSystem.java:540)
	at org.apache.hadoop.fs.FilterFileSystem.setPermission(FilterFileSystem.java:353)
	at org.apache.hadoop.fs.FileSystem.mkdirs(FileSystem.java:428)
	at org.apache.hadoop.mapreduce.JobSubmitter.copyAndConfigureFiles(JobSubmitter.java:166)
	at org.apache.hadoop.mapreduce.JobSubmitter.copyAndConfigureFiles(JobSubmitter.java:283)
	at org.apache.hadoop.mapreduce.JobSubmitter.submitJobInternal(JobSubmitter.java:350)
	at org.apache.hadoop.mapreduce.Job$2.run(Job.java:1037)
	at org.apache.hadoop.mapreduce.Job$2.run(Job.java:1034)
	at java.security.AccessController.doPrivileged(Native Method)
	at javax.security.auth.Subject.doAs(Subject.java:396)
	at org.apache.hadoop.security.UserGroupInformation.doAs(UserGroupInformation.java:1142)
	at org.apache.hadoop.mapreduce.Job.submit(Job.java:1034)
	at org.apache.hadoop.mapreduce.Job.waitForCompletion(Job.java:1054)
	at org.apache.hadoop.mapreduce.TestMapCollection.runTest(TestMapCollection.java:326)
	at org.apache.hadoop.mapreduce.TestMapCollection.runTest(TestMapCollection.java:309)
	at org.apache.hadoop.mapreduce.TestMapCollection.__CLR3_0_2fe8528nro(TestMapCollection.java:339)
	at org.apache.hadoop.mapreduce.TestMapCollection.testLargeRecords(TestMapCollection.java:337)


FAILED:  org.apache.hadoop.mapreduce.TestMapCollection.testSpillPer2B

Error Message:
chmod: cannot access `/tmp/hadoop-hudson/mapred/staging/hudson-885815587/.staging/job_local_0003': No such file or directory 

Stack Trace:
org.apache.hadoop.util.Shell$ExitCodeException: chmod: cannot access `/tmp/hadoop-hudson/mapred/staging/hudson-885815587/.staging/job_local_0003': No such file or directory

	at org.apache.hadoop.util.Shell.runCommand(Shell.java:261)
	at org.apache.hadoop.util.Shell.run(Shell.java:188)
	at org.apache.hadoop.util.Shell$ShellCommandExecutor.execute(Shell.java:381)
	at org.apache.hadoop.util.Shell.execCommand(Shell.java:467)
	at org.apache.hadoop.util.Shell.execCommand(Shell.java:450)
	at org.apache.hadoop.fs.RawLocalFileSystem.execCommand(RawLocalFileSystem.java:549)
	at org.apache.hadoop.fs.RawLocalFileSystem.setPermission(RawLocalFileSystem.java:540)
	at org.apache.hadoop.fs.FilterFileSystem.setPermission(FilterFileSystem.java:353)
	at org.apache.hadoop.fs.FileSystem.mkdirs(FileSystem.java:428)
	at org.apache.hadoop.mapreduce.JobSubmitter.copyAndConfigureFiles(JobSubmitter.java:166)
	at org.apache.hadoop.mapreduce.JobSubmitter.copyAndConfigureFiles(JobSubmitter.java:283)
	at org.apache.hadoop.mapreduce.JobSubmitter.submitJobInternal(JobSubmitter.java:350)
	at org.apache.hadoop.mapreduce.Job$2.run(Job.java:1037)
	at org.apache.hadoop.mapreduce.Job$2.run(Job.java:1034)
	at java.security.AccessController.doPrivileged(Native Method)
	at javax.security.auth.Subject.doAs(Subject.java:396)
	at org.apache.hadoop.security.UserGroupInformation.doAs(UserGroupInformation.java:1142)
	at org.apache.hadoop.mapreduce.Job.submit(Job.java:1034)
	at org.apache.hadoop.mapreduce.Job.waitForCompletion(Job.java:1054)
	at org.apache.hadoop.mapreduce.TestMapCollection.runTest(TestMapCollection.java:326)
	at org.apache.hadoop.mapreduce.TestMapCollection.runTest(TestMapCollection.java:309)
	at org.apache.hadoop.mapreduce.TestMapCollection.__CLR3_0_28yt0g6nrr(TestMapCollection.java:346)
	at org.apache.hadoop.mapreduce.TestMapCollection.testSpillPer2B(TestMapCollection.java:344)


FAILED:  org.apache.hadoop.mapreduce.TestMapCollection.testZeroVal

Error Message:
chmod: cannot access `/tmp/hadoop-hudson/mapred/staging/hudson992818213/.staging/job_local_0004': No such file or directory 

Stack Trace:
org.apache.hadoop.util.Shell$ExitCodeException: chmod: cannot access `/tmp/hadoop-hudson/mapred/staging/hudson992818213/.staging/job_local_0004': No such file or directory

	at org.apache.hadoop.util.Shell.runCommand(Shell.java:261)
	at org.apache.hadoop.util.Shell.run(Shell.java:188)
	at org.apache.hadoop.util.Shell$ShellCommandExecutor.execute(Shell.java:381)
	at org.apache.hadoop.util.Shell.execCommand(Shell.java:467)
	at org.apache.hadoop.util.Shell.execCommand(Shell.java:450)
	at org.apache.hadoop.fs.RawLocalFileSystem.execCommand(RawLocalFileSystem.java:549)
	at org.apache.hadoop.fs.RawLocalFileSystem.setPermission(RawLocalFileSystem.java:540)
	at org.apache.hadoop.fs.FilterFileSystem.setPermission(FilterFileSystem.java:353)
	at org.apache.hadoop.fs.FileSystem.mkdirs(FileSystem.java:428)
	at org.apache.hadoop.mapreduce.JobSubmitter.copyAndConfigureFiles(JobSubmitter.java:166)
	at org.apache.hadoop.mapreduce.JobSubmitter.copyAndConfigureFiles(JobSubmitter.java:283)
	at org.apache.hadoop.mapreduce.JobSubmitter.submitJobInternal(JobSubmitter.java:350)
	at org.apache.hadoop.mapreduce.Job$2.run(Job.java:1037)
	at org.apache.hadoop.mapreduce.Job$2.run(Job.java:1034)
	at java.security.AccessController.doPrivileged(Native Method)
	at javax.security.auth.Subject.doAs(Subject.java:396)
	at org.apache.hadoop.security.UserGroupInformation.doAs(UserGroupInformation.java:1142)
	at org.apache.hadoop.mapreduce.Job.submit(Job.java:1034)
	at org.apache.hadoop.mapreduce.Job.waitForCompletion(Job.java:1054)
	at org.apache.hadoop.mapreduce.TestMapCollection.runTest(TestMapCollection.java:326)
	at org.apache.hadoop.mapreduce.TestMapCollection.runTest(TestMapCollection.java:309)
	at org.apache.hadoop.mapreduce.TestMapCollection.__CLR3_0_2u5xn7ynrw(TestMapCollection.java:355)
	at org.apache.hadoop.mapreduce.TestMapCollection.testZeroVal(TestMapCollection.java:353)


FAILED:  org.apache.hadoop.mapreduce.TestMapCollection.testSingleRecord

Error Message:
chmod: cannot access `/tmp/hadoop-hudson/mapred/staging/hudson-1540577700/.staging/job_local_0005': No such file or directory 

Stack Trace:
org.apache.hadoop.util.Shell$ExitCodeException: chmod: cannot access `/tmp/hadoop-hudson/mapred/staging/hudson-1540577700/.staging/job_local_0005': No such file or directory

	at org.apache.hadoop.util.Shell.runCommand(Shell.java:261)
	at org.apache.hadoop.util.Shell.run(Shell.java:188)
	at org.apache.hadoop.util.Shell$ShellCommandExecutor.execute(Shell.java:381)
	at org.apache.hadoop.util.Shell.execCommand(Shell.java:467)
	at org.apache.hadoop.util.Shell.execCommand(Shell.java:450)
	at org.apache.hadoop.fs.RawLocalFileSystem.execCommand(RawLocalFileSystem.java:549)
	at org.apache.hadoop.fs.RawLocalFileSystem.setPermission(RawLocalFileSystem.java:540)
	at org.apache.hadoop.fs.FilterFileSystem.setPermission(FilterFileSystem.java:353)
	at org.apache.hadoop.fs.FileSystem.mkdirs(FileSystem.java:428)
	at org.apache.hadoop.mapreduce.JobSubmitter.copyAndConfigureFiles(JobSubmitter.java:166)
	at org.apache.hadoop.mapreduce.JobSubmitter.copyAndConfigureFiles(JobSubmitter.java:283)
	at org.apache.hadoop.mapreduce.JobSubmitter.submitJobInternal(JobSubmitter.java:350)
	at org.apache.hadoop.mapreduce.Job$2.run(Job.java:1037)
	at org.apache.hadoop.mapreduce.Job$2.run(Job.java:1034)
	at java.security.AccessController.doPrivileged(Native Method)
	at javax.security.auth.Subject.doAs(Subject.java:396)
	at org.apache.hadoop.security.UserGroupInformation.doAs(UserGroupInformation.java:1142)
	at org.apache.hadoop.mapreduce.Job.submit(Job.java:1034)
	at org.apache.hadoop.mapreduce.Job.waitForCompletion(Job.java:1054)
	at org.apache.hadoop.mapreduce.TestMapCollection.runTest(TestMapCollection.java:326)
	at org.apache.hadoop.mapreduce.TestMapCollection.runTest(TestMapCollection.java:309)
	at org.apache.hadoop.mapreduce.TestMapCollection.__CLR3_0_2db2s32ns1(TestMapCollection.java:363)
	at org.apache.hadoop.mapreduce.TestMapCollection.testSingleRecord(TestMapCollection.java:362)


FAILED:  org.apache.hadoop.mapreduce.TestMapCollection.testLowSpill

Error Message:
chmod: cannot access `/tmp/hadoop-hudson/mapred/staging/hudson-1320481134/.staging/job_local_0006': No such file or directory 

Stack Trace:
org.apache.hadoop.util.Shell$ExitCodeException: chmod: cannot access `/tmp/hadoop-hudson/mapred/staging/hudson-1320481134/.staging/job_local_0006': No such file or directory

	at org.apache.hadoop.util.Shell.runCommand(Shell.java:261)
	at org.apache.hadoop.util.Shell.run(Shell.java:188)
	at org.apache.hadoop.util.Shell$ShellCommandExecutor.execute(Shell.java:381)
	at org.apache.hadoop.util.Shell.execCommand(Shell.java:467)
	at org.apache.hadoop.util.Shell.execCommand(Shell.java:450)
	at org.apache.hadoop.fs.RawLocalFileSystem.execCommand(RawLocalFileSystem.java:549)
	at org.apache.hadoop.fs.RawLocalFileSystem.setPermission(RawLocalFileSystem.java:540)
	at org.apache.hadoop.fs.FilterFileSystem.setPermission(FilterFileSystem.java:353)
	at org.apache.hadoop.fs.FileSystem.mkdirs(FileSystem.java:428)
	at org.apache.hadoop.mapreduce.JobSubmitter.copyAndConfigureFiles(JobSubmitter.java:166)
	at org.apache.hadoop.mapreduce.JobSubmitter.copyAndConfigureFiles(JobSubmitter.java:283)
	at org.apache.hadoop.mapreduce.JobSubmitter.submitJobInternal(JobSubmitter.java:350)
	at org.apache.hadoop.mapreduce.Job$2.run(Job.java:1037)
	at org.apache.hadoop.mapreduce.Job$2.run(Job.java:1034)
	at java.security.AccessController.doPrivileged(Native Method)
	at javax.security.auth.Subject.doAs(Subject.java:396)
	at org.apache.hadoop.security.UserGroupInformation.doAs(UserGroupInformation.java:1142)
	at org.apache.hadoop.mapreduce.Job.submit(Job.java:1034)
	at org.apache.hadoop.mapreduce.Job.waitForCompletion(Job.java:1054)
	at org.apache.hadoop.mapreduce.TestMapCollection.runTest(TestMapCollection.java:326)
	at org.apache.hadoop.mapreduce.TestMapCollection.runTest(TestMapCollection.java:309)
	at org.apache.hadoop.mapreduce.TestMapCollection.__CLR3_0_2z3qgi7ns4(TestMapCollection.java:369)
	at org.apache.hadoop.mapreduce.TestMapCollection.testLowSpill(TestMapCollection.java:368)


FAILED:  org.apache.hadoop.mapreduce.TestMapCollection.testSplitMetaSpill

Error Message:
chmod: cannot access `/tmp/hadoop-hudson/mapred/staging/hudson-1103915783/.staging/job_local_0007': No such file or directory 

Stack Trace:
org.apache.hadoop.util.Shell$ExitCodeException: chmod: cannot access `/tmp/hadoop-hudson/mapred/staging/hudson-1103915783/.staging/job_local_0007': No such file or directory

	at org.apache.hadoop.util.Shell.runCommand(Shell.java:261)
	at org.apache.hadoop.util.Shell.run(Shell.java:188)
	at org.apache.hadoop.util.Shell$ShellCommandExecutor.execute(Shell.java:381)
	at org.apache.hadoop.util.Shell.execCommand(Shell.java:467)
	at org.apache.hadoop.util.Shell.execCommand(Shell.java:450)
	at org.apache.hadoop.fs.RawLocalFileSystem.execCommand(RawLocalFileSystem.java:549)
	at org.apache.hadoop.fs.RawLocalFileSystem.setPermission(RawLocalFileSystem.java:540)
	at org.apache.hadoop.fs.FilterFileSystem.setPermission(FilterFileSystem.java:353)
	at org.apache.hadoop.fs.FileSystem.mkdirs(FileSystem.java:428)
	at org.apache.hadoop.mapreduce.JobSubmitter.copyAndConfigureFiles(JobSubmitter.java:166)
	at org.apache.hadoop.mapreduce.JobSubmitter.copyAndConfigureFiles(JobSubmitter.java:283)
	at org.apache.hadoop.mapreduce.JobSubmitter.submitJobInternal(JobSubmitter.java:350)
	at org.apache.hadoop.mapreduce.Job$2.run(Job.java:1037)
	at org.apache.hadoop.mapreduce.Job$2.run(Job.java:1034)
	at java.security.AccessController.doPrivileged(Native Method)
	at javax.security.auth.Subject.doAs(Subject.java:396)
	at org.apache.hadoop.security.UserGroupInformation.doAs(UserGroupInformation.java:1142)
	at org.apache.hadoop.mapreduce.Job.submit(Job.java:1034)
	at org.apache.hadoop.mapreduce.Job.waitForCompletion(Job.java:1054)
	at org.apache.hadoop.mapreduce.TestMapCollection.runTest(TestMapCollection.java:326)
	at org.apache.hadoop.mapreduce.TestMapCollection.runTest(TestMapCollection.java:309)
	at org.apache.hadoop.mapreduce.TestMapCollection.__CLR3_0_2molruins6(TestMapCollection.java:374)
	at org.apache.hadoop.mapreduce.TestMapCollection.testSplitMetaSpill(TestMapCollection.java:373)


FAILED:  org.apache.hadoop.mapreduce.TestMapCollection.testPostSpillMeta

Error Message:
chmod: cannot access `/tmp/hadoop-hudson/mapred/staging/hudson8657840/.staging/job_local_0008': No such file or directory 

Stack Trace:
org.apache.hadoop.util.Shell$ExitCodeException: chmod: cannot access `/tmp/hadoop-hudson/mapred/staging/hudson8657840/.staging/job_local_0008': No such file or directory

	at org.apache.hadoop.util.Shell.runCommand(Shell.java:261)
	at org.apache.hadoop.util.Shell.run(Shell.java:188)
	at org.apache.hadoop.util.Shell$ShellCommandExecutor.execute(Shell.java:381)
	at org.apache.hadoop.util.Shell.execCommand(Shell.java:467)
	at org.apache.hadoop.util.Shell.execCommand(Shell.java:450)
	at org.apache.hadoop.fs.RawLocalFileSystem.execCommand(RawLocalFileSystem.java:549)
	at org.apache.hadoop.fs.RawLocalFileSystem.setPermission(RawLocalFileSystem.java:540)
	at org.apache.hadoop.fs.FilterFileSystem.setPermission(FilterFileSystem.java:353)
	at org.apache.hadoop.fs.FileSystem.mkdirs(FileSystem.java:428)
	at org.apache.hadoop.mapreduce.JobSubmitter.copyAndConfigureFiles(JobSubmitter.java:166)
	at org.apache.hadoop.mapreduce.JobSubmitter.copyAndConfigureFiles(JobSubmitter.java:283)
	at org.apache.hadoop.mapreduce.JobSubmitter.submitJobInternal(JobSubmitter.java:350)
	at org.apache.hadoop.mapreduce.Job$2.run(Job.java:1037)
	at org.apache.hadoop.mapreduce.Job$2.run(Job.java:1034)
	at java.security.AccessController.doPrivileged(Native Method)
	at javax.security.auth.Subject.doAs(Subject.java:396)
	at org.apache.hadoop.security.UserGroupInformation.doAs(UserGroupInformation.java:1142)
	at org.apache.hadoop.mapreduce.Job.submit(Job.java:1034)
	at org.apache.hadoop.mapreduce.Job.waitForCompletion(Job.java:1054)
	at org.apache.hadoop.mapreduce.TestMapCollection.runTest(TestMapCollection.java:326)
	at org.apache.hadoop.mapreduce.TestMapCollection.__CLR3_0_266dm6enss(TestMapCollection.java:423)
	at org.apache.hadoop.mapreduce.TestMapCollection.testPostSpillMeta(TestMapCollection.java:407)


FAILED:  org.apache.hadoop.mapreduce.TestMapCollection.testLargeRecConcurrent

Error Message:
chmod: cannot access `/tmp/hadoop-hudson/mapred/staging/hudson1508727800/.staging/job_local_0009': No such file or directory 

Stack Trace:
org.apache.hadoop.util.Shell$ExitCodeException: chmod: cannot access `/tmp/hadoop-hudson/mapred/staging/hudson1508727800/.staging/job_local_0009': No such file or directory

	at org.apache.hadoop.util.Shell.runCommand(Shell.java:261)
	at org.apache.hadoop.util.Shell.run(Shell.java:188)
	at org.apache.hadoop.util.Shell$ShellCommandExecutor.execute(Shell.java:381)
	at org.apache.hadoop.util.Shell.execCommand(Shell.java:467)
	at org.apache.hadoop.util.Shell.execCommand(Shell.java:450)
	at org.apache.hadoop.fs.RawLocalFileSystem.execCommand(RawLocalFileSystem.java:549)
	at org.apache.hadoop.fs.RawLocalFileSystem.setPermission(RawLocalFileSystem.java:540)
	at org.apache.hadoop.fs.FilterFileSystem.setPermission(FilterFileSystem.java:353)
	at org.apache.hadoop.fs.FileSystem.mkdirs(FileSystem.java:428)
	at org.apache.hadoop.mapreduce.JobSubmitter.copyAndConfigureFiles(JobSubmitter.java:166)
	at org.apache.hadoop.mapreduce.JobSubmitter.copyAndConfigureFiles(JobSubmitter.java:283)
	at org.apache.hadoop.mapreduce.JobSubmitter.submitJobInternal(JobSubmitter.java:350)
	at org.apache.hadoop.mapreduce.Job$2.run(Job.java:1037)
	at org.apache.hadoop.mapreduce.Job$2.run(Job.java:1034)
	at java.security.AccessController.doPrivileged(Native Method)
	at javax.security.auth.Subject.doAs(Subject.java:396)
	at org.apache.hadoop.security.UserGroupInformation.doAs(UserGroupInformation.java:1142)
	at org.apache.hadoop.mapreduce.Job.submit(Job.java:1034)
	at org.apache.hadoop.mapreduce.Job.waitForCompletion(Job.java:1054)
	at org.apache.hadoop.mapreduce.TestMapCollection.runTest(TestMapCollection.java:326)
	at org.apache.hadoop.mapreduce.TestMapCollection.__CLR3_0_2qefqudnt5(TestMapCollection.java:440)
	at org.apache.hadoop.mapreduce.TestMapCollection.testLargeRecConcurrent(TestMapCollection.java:427)


FAILED:  org.apache.hadoop.mapreduce.TestMapCollection.testRandom

Error Message:
chmod: cannot access `/tmp/hadoop-hudson/mapred/staging/hudson844187293/.staging/job_local_0010': No such file or directory 

Stack Trace:
org.apache.hadoop.util.Shell$ExitCodeException: chmod: cannot access `/tmp/hadoop-hudson/mapred/staging/hudson844187293/.staging/job_local_0010': No such file or directory

	at org.apache.hadoop.util.Shell.runCommand(Shell.java:261)
	at org.apache.hadoop.util.Shell.run(Shell.java:188)
	at org.apache.hadoop.util.Shell$ShellCommandExecutor.execute(Shell.java:381)
	at org.apache.hadoop.util.Shell.execCommand(Shell.java:467)
	at org.apache.hadoop.util.Shell.execCommand(Shell.java:450)
	at org.apache.hadoop.fs.RawLocalFileSystem.execCommand(RawLocalFileSystem.java:549)
	at org.apache.hadoop.fs.RawLocalFileSystem.setPermission(RawLocalFileSystem.java:540)
	at org.apache.hadoop.fs.FilterFileSystem.setPermission(FilterFileSystem.java:353)
	at org.apache.hadoop.fs.FileSystem.mkdirs(FileSystem.java:428)
	at org.apache.hadoop.mapreduce.JobSubmitter.copyAndConfigureFiles(JobSubmitter.java:166)
	at org.apache.hadoop.mapreduce.JobSubmitter.copyAndConfigureFiles(JobSubmitter.java:283)
	at org.apache.hadoop.mapreduce.JobSubmitter.submitJobInternal(JobSubmitter.java:350)
	at org.apache.hadoop.mapreduce.Job$2.run(Job.java:1037)
	at org.apache.hadoop.mapreduce.Job$2.run(Job.java:1034)
	at java.security.AccessController.doPrivileged(Native Method)
	at javax.security.auth.Subject.doAs(Subject.java:396)
	at org.apache.hadoop.security.UserGroupInformation.doAs(UserGroupInformation.java:1142)
	at org.apache.hadoop.mapreduce.Job.submit(Job.java:1034)
	at org.apache.hadoop.mapreduce.Job.waitForCompletion(Job.java:1054)
	at org.apache.hadoop.mapreduce.TestMapCollection.runTest(TestMapCollection.java:326)
	at org.apache.hadoop.mapreduce.TestMapCollection.__CLR3_0_2ujoeasnun(TestMapCollection.java:513)
	at org.apache.hadoop.mapreduce.TestMapCollection.testRandom(TestMapCollection.java:496)


FAILED:  org.apache.hadoop.mapreduce.TestMapCollection.testRandomCompress

Error Message:
chmod: cannot access `/tmp/hadoop-hudson/mapred/staging/hudson-1513798925/.staging/job_local_0011': No such file or directory 

Stack Trace:
org.apache.hadoop.util.Shell$ExitCodeException: chmod: cannot access `/tmp/hadoop-hudson/mapred/staging/hudson-1513798925/.staging/job_local_0011': No such file or directory

	at org.apache.hadoop.util.Shell.runCommand(Shell.java:261)
	at org.apache.hadoop.util.Shell.run(Shell.java:188)
	at org.apache.hadoop.util.Shell$ShellCommandExecutor.execute(Shell.java:381)
	at org.apache.hadoop.util.Shell.execCommand(Shell.java:467)
	at org.apache.hadoop.util.Shell.execCommand(Shell.java:450)
	at org.apache.hadoop.fs.RawLocalFileSystem.execCommand(RawLocalFileSystem.java:549)
	at org.apache.hadoop.fs.RawLocalFileSystem.setPermission(RawLocalFileSystem.java:540)
	at org.apache.hadoop.fs.FilterFileSystem.setPermission(FilterFileSystem.java:353)
	at org.apache.hadoop.fs.FileSystem.mkdirs(FileSystem.java:428)
	at org.apache.hadoop.mapreduce.JobSubmitter.copyAndConfigureFiles(JobSubmitter.java:166)
	at org.apache.hadoop.mapreduce.JobSubmitter.copyAndConfigureFiles(JobSubmitter.java:283)
	at org.apache.hadoop.mapreduce.JobSubmitter.submitJobInternal(JobSubmitter.java:350)
	at org.apache.hadoop.mapreduce.Job$2.run(Job.java:1037)
	at org.apache.hadoop.mapreduce.Job$2.run(Job.java:1034)
	at java.security.AccessController.doPrivileged(Native Method)
	at javax.security.auth.Subject.doAs(Subject.java:396)
	at org.apache.hadoop.security.UserGroupInformation.doAs(UserGroupInformation.java:1142)
	at org.apache.hadoop.mapreduce.Job.submit(Job.java:1034)
	at org.apache.hadoop.mapreduce.Job.waitForCompletion(Job.java:1054)
	at org.apache.hadoop.mapreduce.TestMapCollection.runTest(TestMapCollection.java:326)
	at org.apache.hadoop.mapreduce.TestMapCollection.__CLR3_0_2vyg2zmnv3(TestMapCollection.java:535)
	at org.apache.hadoop.mapreduce.TestMapCollection.testRandomCompress(TestMapCollection.java:517)


FAILED:  org.apache.hadoop.mapreduce.TestMapReduce.testMapred

Error Message:
chmod: cannot access `/tmp/hadoop-hudson/mapred/staging/hudson700058986/.staging/job_local_0001': No such file or directory 

Stack Trace:
org.apache.hadoop.util.Shell$ExitCodeException: chmod: cannot access `/tmp/hadoop-hudson/mapred/staging/hudson700058986/.staging/job_local_0001': No such file or directory

	at org.apache.hadoop.util.Shell.runCommand(Shell.java:261)
	at org.apache.hadoop.util.Shell.run(Shell.java:188)
	at org.apache.hadoop.util.Shell$ShellCommandExecutor.execute(Shell.java:381)
	at org.apache.hadoop.util.Shell.execCommand(Shell.java:467)
	at org.apache.hadoop.util.Shell.execCommand(Shell.java:450)
	at org.apache.hadoop.fs.RawLocalFileSystem.execCommand(RawLocalFileSystem.java:549)
	at org.apache.hadoop.fs.RawLocalFileSystem.setPermission(RawLocalFileSystem.java:540)
	at org.apache.hadoop.fs.FilterFileSystem.setPermission(FilterFileSystem.java:353)
	at org.apache.hadoop.fs.FileSystem.mkdirs(FileSystem.java:428)
	at org.apache.hadoop.mapreduce.JobSubmitter.copyAndConfigureFiles(JobSubmitter.java:166)
	at org.apache.hadoop.mapreduce.JobSubmitter.copyAndConfigureFiles(JobSubmitter.java:283)
	at org.apache.hadoop.mapreduce.JobSubmitter.submitJobInternal(JobSubmitter.java:350)
	at org.apache.hadoop.mapreduce.Job$2.run(Job.java:1037)
	at org.apache.hadoop.mapreduce.Job$2.run(Job.java:1034)
	at java.security.AccessController.doPrivileged(Native Method)
	at javax.security.auth.Subject.doAs(Subject.java:396)
	at org.apache.hadoop.security.UserGroupInformation.doAs(UserGroupInformation.java:1142)
	at org.apache.hadoop.mapreduce.Job.submit(Job.java:1034)
	at org.apache.hadoop.mapreduce.Job.waitForCompletion(Job.java:1054)
	at org.apache.hadoop.mapreduce.TestMapReduce.launch(TestMapReduce.java:300)
	at org.apache.hadoop.mapreduce.TestMapReduce.__CLR3_0_2vmf1hqepc(TestMapReduce.java:219)
	at org.apache.hadoop.mapreduce.TestMapReduce.testMapred(TestMapReduce.java:218)


FAILED:  org.apache.hadoop.mapreduce.TestValueIterReset.testValueIterReset

Error Message:
null

Stack Trace:
junit.framework.AssertionFailedError: null
	at org.apache.hadoop.mapreduce.TestValueIterReset.__CLR3_0_2hu3rohsuy(TestValueIterReset.java:547)
	at org.apache.hadoop.mapreduce.TestValueIterReset.testValueIterReset(TestValueIterReset.java:521)


FAILED:  org.apache.hadoop.mapreduce.lib.aggregate.TestMapReduceAggregates.testAggregates

Error Message:
chmod: cannot access `/tmp/hadoop-hudson/mapred/staging/hudson-771612165/.staging/job_local_0001': No such file or directory 

Stack Trace:
org.apache.hadoop.util.Shell$ExitCodeException: chmod: cannot access `/tmp/hadoop-hudson/mapred/staging/hudson-771612165/.staging/job_local_0001': No such file or directory

	at org.apache.hadoop.util.Shell.runCommand(Shell.java:261)
	at org.apache.hadoop.util.Shell.run(Shell.java:188)
	at org.apache.hadoop.util.Shell$ShellCommandExecutor.execute(Shell.java:381)
	at org.apache.hadoop.util.Shell.execCommand(Shell.java:467)
	at org.apache.hadoop.util.Shell.execCommand(Shell.java:450)
	at org.apache.hadoop.fs.RawLocalFileSystem.execCommand(RawLocalFileSystem.java:549)
	at org.apache.hadoop.fs.RawLocalFileSystem.setPermission(RawLocalFileSystem.java:540)
	at org.apache.hadoop.fs.FilterFileSystem.setPermission(FilterFileSystem.java:353)
	at org.apache.hadoop.fs.FileSystem.mkdirs(FileSystem.java:428)
	at org.apache.hadoop.mapreduce.JobSubmitter.copyAndConfigureFiles(JobSubmitter.java:166)
	at org.apache.hadoop.mapreduce.JobSubmitter.copyAndConfigureFiles(JobSubmitter.java:283)
	at org.apache.hadoop.mapreduce.JobSubmitter.submitJobInternal(JobSubmitter.java:350)
	at org.apache.hadoop.mapreduce.Job$2.run(Job.java:1037)
	at org.apache.hadoop.mapreduce.Job$2.run(Job.java:1034)
	at java.security.AccessController.doPrivileged(Native Method)
	at javax.security.auth.Subject.doAs(Subject.java:396)
	at org.apache.hadoop.security.UserGroupInformation.doAs(UserGroupInformation.java:1142)
	at org.apache.hadoop.mapreduce.Job.submit(Job.java:1034)
	at org.apache.hadoop.mapreduce.Job.waitForCompletion(Job.java:1054)
	at org.apache.hadoop.mapreduce.lib.aggregate.TestMapReduceAggregates.launch(TestMapReduceAggregates.java:108)
	at org.apache.hadoop.mapreduce.lib.aggregate.TestMapReduceAggregates.__CLR3_0_21uoc3b7n(TestMapReduceAggregates.java:46)
	at org.apache.hadoop.mapreduce.lib.aggregate.TestMapReduceAggregates.testAggregates(TestMapReduceAggregates.java:45)


FAILED:  org.apache.hadoop.mapreduce.lib.chain.TestChainErrors.testChainFail

Error Message:
chmod: cannot access `/tmp/hadoop-hudson/mapred/staging/hudson1458791292/.staging/job_local_0001': No such file or directory 

Stack Trace:
org.apache.hadoop.util.Shell$ExitCodeException: chmod: cannot access `/tmp/hadoop-hudson/mapred/staging/hudson1458791292/.staging/job_local_0001': No such file or directory

	at org.apache.hadoop.util.Shell.runCommand(Shell.java:261)
	at org.apache.hadoop.util.Shell.run(Shell.java:188)
	at org.apache.hadoop.util.Shell$ShellCommandExecutor.execute(Shell.java:381)
	at org.apache.hadoop.util.Shell.execCommand(Shell.java:467)
	at org.apache.hadoop.util.Shell.execCommand(Shell.java:450)
	at org.apache.hadoop.fs.RawLocalFileSystem.execCommand(RawLocalFileSystem.java:549)
	at org.apache.hadoop.fs.RawLocalFileSystem.setPermission(RawLocalFileSystem.java:540)
	at org.apache.hadoop.fs.FilterFileSystem.setPermission(FilterFileSystem.java:353)
	at org.apache.hadoop.fs.FileSystem.mkdirs(FileSystem.java:428)
	at org.apache.hadoop.mapreduce.JobSubmitter.copyAndConfigureFiles(JobSubmitter.java:166)
	at org.apache.hadoop.mapreduce.JobSubmitter.copyAndConfigureFiles(JobSubmitter.java:283)
	at org.apache.hadoop.mapreduce.JobSubmitter.submitJobInternal(JobSubmitter.java:350)
	at org.apache.hadoop.mapreduce.Job$2.run(Job.java:1037)
	at org.apache.hadoop.mapreduce.Job$2.run(Job.java:1034)
	at java.security.AccessController.doPrivileged(Native Method)
	at javax.security.auth.Subject.doAs(Subject.java:396)
	at org.apache.hadoop.security.UserGroupInformation.doAs(UserGroupInformation.java:1142)
	at org.apache.hadoop.mapreduce.Job.submit(Job.java:1034)
	at org.apache.hadoop.mapreduce.Job.waitForCompletion(Job.java:1054)
	at org.apache.hadoop.mapreduce.lib.chain.TestChainErrors.__CLR3_0_2bnfjqsh1k(TestChainErrors.java:108)
	at org.apache.hadoop.mapreduce.lib.chain.TestChainErrors.testChainFail(TestChainErrors.java:92)


FAILED:  org.apache.hadoop.mapreduce.lib.chain.TestChainErrors.testReducerFail

Error Message:
chmod: cannot access `/tmp/hadoop-hudson/mapred/staging/hudson1623340574/.staging/job_local_0002': No such file or directory 

Stack Trace:
org.apache.hadoop.util.Shell$ExitCodeException: chmod: cannot access `/tmp/hadoop-hudson/mapred/staging/hudson1623340574/.staging/job_local_0002': No such file or directory

	at org.apache.hadoop.util.Shell.runCommand(Shell.java:261)
	at org.apache.hadoop.util.Shell.run(Shell.java:188)
	at org.apache.hadoop.util.Shell$ShellCommandExecutor.execute(Shell.java:381)
	at org.apache.hadoop.util.Shell.execCommand(Shell.java:467)
	at org.apache.hadoop.util.Shell.execCommand(Shell.java:450)
	at org.apache.hadoop.fs.RawLocalFileSystem.execCommand(RawLocalFileSystem.java:549)
	at org.apache.hadoop.fs.RawLocalFileSystem.setPermission(RawLocalFileSystem.java:540)
	at org.apache.hadoop.fs.FilterFileSystem.setPermission(FilterFileSystem.java:353)
	at org.apache.hadoop.fs.FileSystem.mkdirs(FileSystem.java:428)
	at org.apache.hadoop.mapreduce.JobSubmitter.copyAndConfigureFiles(JobSubmitter.java:166)
	at org.apache.hadoop.mapreduce.JobSubmitter.copyAndConfigureFiles(JobSubmitter.java:283)
	at org.apache.hadoop.mapreduce.JobSubmitter.submitJobInternal(JobSubmitter.java:350)
	at org.apache.hadoop.mapreduce.Job$2.run(Job.java:1037)
	at org.apache.hadoop.mapreduce.Job$2.run(Job.java:1034)
	at java.security.AccessController.doPrivileged(Native Method)
	at javax.security.auth.Subject.doAs(Subject.java:396)
	at org.apache.hadoop.security.UserGroupInformation.doAs(UserGroupInformation.java:1142)
	at org.apache.hadoop.mapreduce.Job.submit(Job.java:1034)
	at org.apache.hadoop.mapreduce.Job.waitForCompletion(Job.java:1054)
	at org.apache.hadoop.mapreduce.lib.chain.TestChainErrors.__CLR3_0_25ewwv3h1t(TestChainErrors.java:133)
	at org.apache.hadoop.mapreduce.lib.chain.TestChainErrors.testReducerFail(TestChainErrors.java:117)


FAILED:  org.apache.hadoop.mapreduce.lib.chain.TestChainErrors.testChainMapNoOuptut

Error Message:
chmod: cannot access `/tmp/hadoop-hudson/mapred/staging/hudson1124911955/.staging/job_local_0003': No such file or directory 

Stack Trace:
org.apache.hadoop.util.Shell$ExitCodeException: chmod: cannot access `/tmp/hadoop-hudson/mapred/staging/hudson1124911955/.staging/job_local_0003': No such file or directory

	at org.apache.hadoop.util.Shell.runCommand(Shell.java:261)
	at org.apache.hadoop.util.Shell.run(Shell.java:188)
	at org.apache.hadoop.util.Shell$ShellCommandExecutor.execute(Shell.java:381)
	at org.apache.hadoop.util.Shell.execCommand(Shell.java:467)
	at org.apache.hadoop.util.Shell.execCommand(Shell.java:450)
	at org.apache.hadoop.fs.RawLocalFileSystem.execCommand(RawLocalFileSystem.java:549)
	at org.apache.hadoop.fs.RawLocalFileSystem.setPermission(RawLocalFileSystem.java:540)
	at org.apache.hadoop.fs.FilterFileSystem.setPermission(FilterFileSystem.java:353)
	at org.apache.hadoop.fs.FileSystem.mkdirs(FileSystem.java:428)
	at org.apache.hadoop.mapreduce.JobSubmitter.copyAndConfigureFiles(JobSubmitter.java:166)
	at org.apache.hadoop.mapreduce.JobSubmitter.copyAndConfigureFiles(JobSubmitter.java:283)
	at org.apache.hadoop.mapreduce.JobSubmitter.submitJobInternal(JobSubmitter.java:350)
	at org.apache.hadoop.mapreduce.Job$2.run(Job.java:1037)
	at org.apache.hadoop.mapreduce.Job$2.run(Job.java:1034)
	at java.security.AccessController.doPrivileged(Native Method)
	at javax.security.auth.Subject.doAs(Subject.java:396)
	at org.apache.hadoop.security.UserGroupInformation.doAs(UserGroupInformation.java:1142)
	at org.apache.hadoop.mapreduce.Job.submit(Job.java:1034)
	at org.apache.hadoop.mapreduce.Job.waitForCompletion(Job.java:1054)
	at org.apache.hadoop.mapreduce.lib.chain.TestChainErrors.__CLR3_0_2mbjvwih22(TestChainErrors.java:155)
	at org.apache.hadoop.mapreduce.lib.chain.TestChainErrors.testChainMapNoOuptut(TestChainErrors.java:142)


FAILED:  org.apache.hadoop.mapreduce.lib.chain.TestChainErrors.testChainReduceNoOuptut

Error Message:
chmod: cannot access `/tmp/hadoop-hudson/mapred/staging/hudson-1148945814/.staging/job_local_0004': No such file or directory 

Stack Trace:
org.apache.hadoop.util.Shell$ExitCodeException: chmod: cannot access `/tmp/hadoop-hudson/mapred/staging/hudson-1148945814/.staging/job_local_0004': No such file or directory

	at org.apache.hadoop.util.Shell.runCommand(Shell.java:261)
	at org.apache.hadoop.util.Shell.run(Shell.java:188)
	at org.apache.hadoop.util.Shell$ShellCommandExecutor.execute(Shell.java:381)
	at org.apache.hadoop.util.Shell.execCommand(Shell.java:467)
	at org.apache.hadoop.util.Shell.execCommand(Shell.java:450)
	at org.apache.hadoop.fs.RawLocalFileSystem.execCommand(RawLocalFileSystem.java:549)
	at org.apache.hadoop.fs.RawLocalFileSystem.setPermission(RawLocalFileSystem.java:540)
	at org.apache.hadoop.fs.FilterFileSystem.setPermission(FilterFileSystem.java:353)
	at org.apache.hadoop.fs.FileSystem.mkdirs(FileSystem.java:428)
	at org.apache.hadoop.mapreduce.JobSubmitter.copyAndConfigureFiles(JobSubmitter.java:166)
	at org.apache.hadoop.mapreduce.JobSubmitter.copyAndConfigureFiles(JobSubmitter.java:283)
	at org.apache.hadoop.mapreduce.JobSubmitter.submitJobInternal(JobSubmitter.java:350)
	at org.apache.hadoop.mapreduce.Job$2.run(Job.java:1037)
	at org.apache.hadoop.mapreduce.Job$2.run(Job.java:1034)
	at java.security.AccessController.doPrivileged(Native Method)
	at javax.security.auth.Subject.doAs(Subject.java:396)
	at org.apache.hadoop.security.UserGroupInformation.doAs(UserGroupInformation.java:1142)
	at org.apache.hadoop.mapreduce.Job.submit(Job.java:1034)
	at org.apache.hadoop.mapreduce.Job.waitForCompletion(Job.java:1054)
	at org.apache.hadoop.mapreduce.lib.chain.TestChainErrors.__CLR3_0_24qjj5yh2c(TestChainErrors.java:182)
	at org.apache.hadoop.mapreduce.lib.chain.TestChainErrors.testChainReduceNoOuptut(TestChainErrors.java:166)


FAILED:  org.apache.hadoop.mapreduce.lib.chain.TestMapReduceChain.testChain

Error Message:
chmod: cannot access `/tmp/hadoop-hudson/mapred/staging/hudson669724873/.staging/job_local_0001': No such file or directory 

Stack Trace:
org.apache.hadoop.util.Shell$ExitCodeException: chmod: cannot access `/tmp/hadoop-hudson/mapred/staging/hudson669724873/.staging/job_local_0001': No such file or directory

	at org.apache.hadoop.util.Shell.runCommand(Shell.java:261)
	at org.apache.hadoop.util.Shell.run(Shell.java:188)
	at org.apache.hadoop.util.Shell$ShellCommandExecutor.execute(Shell.java:381)
	at org.apache.hadoop.util.Shell.execCommand(Shell.java:467)
	at org.apache.hadoop.util.Shell.execCommand(Shell.java:450)
	at org.apache.hadoop.fs.RawLocalFileSystem.execCommand(RawLocalFileSystem.java:549)
	at org.apache.hadoop.fs.RawLocalFileSystem.setPermission(RawLocalFileSystem.java:540)
	at org.apache.hadoop.fs.FilterFileSystem.setPermission(FilterFileSystem.java:353)
	at org.apache.hadoop.fs.FileSystem.mkdirs(FileSystem.java:428)
	at org.apache.hadoop.mapreduce.JobSubmitter.copyAndConfigureFiles(JobSubmitter.java:166)
	at org.apache.hadoop.mapreduce.JobSubmitter.copyAndConfigureFiles(JobSubmitter.java:283)
	at org.apache.hadoop.mapreduce.JobSubmitter.submitJobInternal(JobSubmitter.java:350)
	at org.apache.hadoop.mapreduce.Job$2.run(Job.java:1037)
	at org.apache.hadoop.mapreduce.Job$2.run(Job.java:1034)
	at java.security.AccessController.doPrivileged(Native Method)
	at javax.security.auth.Subject.doAs(Subject.java:396)
	at org.apache.hadoop.security.UserGroupInformation.doAs(UserGroupInformation.java:1142)
	at org.apache.hadoop.mapreduce.Job.submit(Job.java:1034)
	at org.apache.hadoop.mapreduce.Job.waitForCompletion(Job.java:1054)
	at org.apache.hadoop.mapreduce.lib.chain.TestMapReduceChain.__CLR3_0_2ke5z1ypkf(TestMapReduceChain.java:106)
	at org.apache.hadoop.mapreduce.lib.chain.TestMapReduceChain.testChain(TestMapReduceChain.java:66)


FAILED:  org.apache.hadoop.mapreduce.lib.chain.TestSingleElementChain.testNoChain

Error Message:
chmod: cannot access `/tmp/hadoop-hudson/mapred/staging/hudson-1032900632/.staging/job_local_0001': No such file or directory 

Stack Trace:
org.apache.hadoop.util.Shell$ExitCodeException: chmod: cannot access `/tmp/hadoop-hudson/mapred/staging/hudson-1032900632/.staging/job_local_0001': No such file or directory

	at org.apache.hadoop.util.Shell.runCommand(Shell.java:261)
	at org.apache.hadoop.util.Shell.run(Shell.java:188)
	at org.apache.hadoop.util.Shell$ShellCommandExecutor.execute(Shell.java:381)
	at org.apache.hadoop.util.Shell.execCommand(Shell.java:467)
	at org.apache.hadoop.util.Shell.execCommand(Shell.java:450)
	at org.apache.hadoop.fs.RawLocalFileSystem.execCommand(RawLocalFileSystem.java:549)
	at org.apache.hadoop.fs.RawLocalFileSystem.setPermission(RawLocalFileSystem.java:540)
	at org.apache.hadoop.fs.FilterFileSystem.setPermission(FilterFileSystem.java:353)
	at org.apache.hadoop.fs.FileSystem.mkdirs(FileSystem.java:428)
	at org.apache.hadoop.mapreduce.JobSubmitter.copyAndConfigureFiles(JobSubmitter.java:166)
	at org.apache.hadoop.mapreduce.JobSubmitter.copyAndConfigureFiles(JobSubmitter.java:283)
	at org.apache.hadoop.mapreduce.JobSubmitter.submitJobInternal(JobSubmitter.java:350)
	at org.apache.hadoop.mapreduce.Job$2.run(Job.java:1037)
	at org.apache.hadoop.mapreduce.Job$2.run(Job.java:1034)
	at java.security.AccessController.doPrivileged(Native Method)
	at javax.security.auth.Subject.doAs(Subject.java:396)
	at org.apache.hadoop.security.UserGroupInformation.doAs(UserGroupInformation.java:1142)
	at org.apache.hadoop.mapreduce.Job.submit(Job.java:1034)
	at org.apache.hadoop.mapreduce.Job.waitForCompletion(Job.java:1054)
	at org.apache.hadoop.mapreduce.lib.chain.TestSingleElementChain.__CLR3_0_2tfhzhngg0(TestSingleElementChain.java:62)
	at org.apache.hadoop.mapreduce.lib.chain.TestSingleElementChain.testNoChain(TestSingleElementChain.java:45)


FAILED:  org.apache.hadoop.mapreduce.lib.db.TestDBJob.testRun

Error Message:
chmod: cannot access `/tmp/hadoop-hudson/mapred/staging/hudson1872584355/.staging/job_local_0001': No such file or directory 

Stack Trace:
org.apache.hadoop.util.Shell$ExitCodeException: chmod: cannot access `/tmp/hadoop-hudson/mapred/staging/hudson1872584355/.staging/job_local_0001': No such file or directory

	at org.apache.hadoop.util.Shell.runCommand(Shell.java:261)
	at org.apache.hadoop.util.Shell.run(Shell.java:188)
	at org.apache.hadoop.util.Shell$ShellCommandExecutor.execute(Shell.java:381)
	at org.apache.hadoop.util.Shell.execCommand(Shell.java:467)
	at org.apache.hadoop.util.Shell.execCommand(Shell.java:450)
	at org.apache.hadoop.fs.RawLocalFileSystem.execCommand(RawLocalFileSystem.java:549)
	at org.apache.hadoop.fs.RawLocalFileSystem.setPermission(RawLocalFileSystem.java:540)
	at org.apache.hadoop.fs.FilterFileSystem.setPermission(FilterFileSystem.java:353)
	at org.apache.hadoop.fs.FileSystem.mkdirs(FileSystem.java:428)
	at org.apache.hadoop.mapreduce.JobSubmitter.copyAndConfigureFiles(JobSubmitter.java:166)
	at org.apache.hadoop.mapreduce.JobSubmitter.copyAndConfigureFiles(JobSubmitter.java:283)
	at org.apache.hadoop.mapreduce.JobSubmitter.submitJobInternal(JobSubmitter.java:350)
	at org.apache.hadoop.mapreduce.Job$2.run(Job.java:1037)
	at org.apache.hadoop.mapreduce.Job$2.run(Job.java:1034)
	at java.security.AccessController.doPrivileged(Native Method)
	at javax.security.auth.Subject.doAs(Subject.java:396)
	at org.apache.hadoop.security.UserGroupInformation.doAs(UserGroupInformation.java:1142)
	at org.apache.hadoop.mapreduce.Job.submit(Job.java:1034)
	at org.apache.hadoop.mapreduce.Job.waitForCompletion(Job.java:1054)
	at org.apache.hadoop.examples.DBCountPageView.run(DBCountPageView.java:409)
	at org.apache.hadoop.util.ToolRunner.run(ToolRunner.java:69)
	at org.apache.hadoop.mapreduce.lib.db.TestDBJob.__CLR3_0_2yzvxa8lsn(TestDBJob.java:36)
	at org.apache.hadoop.mapreduce.lib.db.TestDBJob.testRun(TestDBJob.java:34)


FAILED:  org.apache.hadoop.mapreduce.lib.db.TestDataDrivenDBInputFormat.testDateSplits

Error Message:
chmod: cannot access `/tmp/hadoop-hudson/mapred/staging/hudson-521804714/.staging/job_local_0001': No such file or directory 

Stack Trace:
org.apache.hadoop.util.Shell$ExitCodeException: chmod: cannot access `/tmp/hadoop-hudson/mapred/staging/hudson-521804714/.staging/job_local_0001': No such file or directory

	at org.apache.hadoop.util.Shell.runCommand(Shell.java:261)
	at org.apache.hadoop.util.Shell.run(Shell.java:188)
	at org.apache.hadoop.util.Shell$ShellCommandExecutor.execute(Shell.java:381)
	at org.apache.hadoop.util.Shell.execCommand(Shell.java:467)
	at org.apache.hadoop.util.Shell.execCommand(Shell.java:450)
	at org.apache.hadoop.fs.RawLocalFileSystem.execCommand(RawLocalFileSystem.java:549)
	at org.apache.hadoop.fs.RawLocalFileSystem.setPermission(RawLocalFileSystem.java:540)
	at org.apache.hadoop.fs.FilterFileSystem.setPermission(FilterFileSystem.java:353)
	at org.apache.hadoop.fs.FileSystem.mkdirs(FileSystem.java:428)
	at org.apache.hadoop.mapreduce.JobSubmitter.copyAndConfigureFiles(JobSubmitter.java:166)
	at org.apache.hadoop.mapreduce.JobSubmitter.copyAndConfigureFiles(JobSubmitter.java:283)
	at org.apache.hadoop.mapreduce.JobSubmitter.submitJobInternal(JobSubmitter.java:350)
	at org.apache.hadoop.mapreduce.Job$2.run(Job.java:1037)
	at org.apache.hadoop.mapreduce.Job$2.run(Job.java:1034)
	at java.security.AccessController.doPrivileged(Native Method)
	at javax.security.auth.Subject.doAs(Subject.java:396)
	at org.apache.hadoop.security.UserGroupInformation.doAs(UserGroupInformation.java:1142)
	at org.apache.hadoop.mapreduce.Job.submit(Job.java:1034)
	at org.apache.hadoop.mapreduce.Job.waitForCompletion(Job.java:1054)
	at org.apache.hadoop.mapreduce.lib.db.TestDataDrivenDBInputFormat.__CLR3_0_2klofnkshz(TestDataDrivenDBInputFormat.java:214)
	at org.apache.hadoop.mapreduce.lib.db.TestDataDrivenDBInputFormat.testDateSplits(TestDataDrivenDBInputFormat.java:173)


FAILED:  org.apache.hadoop.mapreduce.lib.fieldsel.TestMRFieldSelection.testFieldSelection

Error Message:
chmod: cannot access `/tmp/hadoop-hudson/mapred/staging/hudson-480000457/.staging/job_local_0001': No such file or directory 

Stack Trace:
org.apache.hadoop.util.Shell$ExitCodeException: chmod: cannot access `/tmp/hadoop-hudson/mapred/staging/hudson-480000457/.staging/job_local_0001': No such file or directory

	at org.apache.hadoop.util.Shell.runCommand(Shell.java:261)
	at org.apache.hadoop.util.Shell.run(Shell.java:188)
	at org.apache.hadoop.util.Shell$ShellCommandExecutor.execute(Shell.java:381)
	at org.apache.hadoop.util.Shell.execCommand(Shell.java:467)
	at org.apache.hadoop.util.Shell.execCommand(Shell.java:450)
	at org.apache.hadoop.fs.RawLocalFileSystem.execCommand(RawLocalFileSystem.java:549)
	at org.apache.hadoop.fs.RawLocalFileSystem.setPermission(RawLocalFileSystem.java:540)
	at org.apache.hadoop.fs.FilterFileSystem.setPermission(FilterFileSystem.java:353)
	at org.apache.hadoop.fs.FileSystem.mkdirs(FileSystem.java:428)
	at org.apache.hadoop.mapreduce.JobSubmitter.copyAndConfigureFiles(JobSubmitter.java:166)
	at org.apache.hadoop.mapreduce.JobSubmitter.copyAndConfigureFiles(JobSubmitter.java:283)
	at org.apache.hadoop.mapreduce.JobSubmitter.submitJobInternal(JobSubmitter.java:350)
	at org.apache.hadoop.mapreduce.Job$2.run(Job.java:1037)
	at org.apache.hadoop.mapreduce.Job$2.run(Job.java:1034)
	at java.security.AccessController.doPrivileged(Native Method)
	at javax.security.auth.Subject.doAs(Subject.java:396)
	at org.apache.hadoop.security.UserGroupInformation.doAs(UserGroupInformation.java:1142)
	at org.apache.hadoop.mapreduce.Job.submit(Job.java:1034)
	at org.apache.hadoop.mapreduce.Job.waitForCompletion(Job.java:1054)
	at org.apache.hadoop.mapreduce.lib.fieldsel.TestMRFieldSelection.launch(TestMRFieldSelection.java:67)
	at org.apache.hadoop.mapreduce.lib.fieldsel.TestMRFieldSelection.__CLR3_0_2asm65nlmi(TestMRFieldSelection.java:38)
	at org.apache.hadoop.mapreduce.lib.fieldsel.TestMRFieldSelection.testFieldSelection(TestMRFieldSelection.java:37)


FAILED:  org.apache.hadoop.mapreduce.lib.input.TestLineRecordReader.testCustomRecordDelimiters

Error Message:
chmod: cannot access `/tmp/hadoop-hudson/mapred/staging/hudson-1102238218/.staging/job_local_0001': No such file or directory 

Stack Trace:
org.apache.hadoop.util.Shell$ExitCodeException: chmod: cannot access `/tmp/hadoop-hudson/mapred/staging/hudson-1102238218/.staging/job_local_0001': No such file or directory

	at org.apache.hadoop.util.Shell.runCommand(Shell.java:261)
	at org.apache.hadoop.util.Shell.run(Shell.java:188)
	at org.apache.hadoop.util.Shell$ShellCommandExecutor.execute(Shell.java:381)
	at org.apache.hadoop.util.Shell.execCommand(Shell.java:467)
	at org.apache.hadoop.util.Shell.execCommand(Shell.java:450)
	at org.apache.hadoop.fs.RawLocalFileSystem.execCommand(RawLocalFileSystem.java:549)
	at org.apache.hadoop.fs.RawLocalFileSystem.setPermission(RawLocalFileSystem.java:540)
	at org.apache.hadoop.fs.FilterFileSystem.setPermission(FilterFileSystem.java:353)
	at org.apache.hadoop.fs.FileSystem.mkdirs(FileSystem.java:428)
	at org.apache.hadoop.mapreduce.JobSubmitter.copyAndConfigureFiles(JobSubmitter.java:166)
	at org.apache.hadoop.mapreduce.JobSubmitter.copyAndConfigureFiles(JobSubmitter.java:283)
	at org.apache.hadoop.mapreduce.JobSubmitter.submitJobInternal(JobSubmitter.java:350)
	at org.apache.hadoop.mapreduce.Job$2.run(Job.java:1037)
	at org.apache.hadoop.mapreduce.Job$2.run(Job.java:1034)
	at java.security.AccessController.doPrivileged(Native Method)
	at javax.security.auth.Subject.doAs(Subject.java:396)
	at org.apache.hadoop.security.UserGroupInformation.doAs(UserGroupInformation.java:1142)
	at org.apache.hadoop.mapreduce.Job.submit(Job.java:1034)
	at org.apache.hadoop.mapreduce.Job.waitForCompletion(Job.java:1054)
	at org.apache.hadoop.mapreduce.lib.input.TestLineRecordReader.createAndRunJob(TestLineRecordReader.java:92)
	at org.apache.hadoop.mapreduce.lib.input.TestLineRecordReader.__CLR3_0_2xdlwnbtol(TestLineRecordReader.java:113)
	at org.apache.hadoop.mapreduce.lib.input.TestLineRecordReader.testCustomRecordDelimiters(TestLineRecordReader.java:105)


FAILED:  org.apache.hadoop.mapreduce.lib.input.TestLineRecordReader.testDefaultRecordDelimiters

Error Message:
chmod: cannot access `/tmp/hadoop-hudson/mapred/staging/hudson140547242/.staging/job_local_0002': No such file or directory 

Stack Trace:
org.apache.hadoop.util.Shell$ExitCodeException: chmod: cannot access `/tmp/hadoop-hudson/mapred/staging/hudson140547242/.staging/job_local_0002': No such file or directory

	at org.apache.hadoop.util.Shell.runCommand(Shell.java:261)
	at org.apache.hadoop.util.Shell.run(Shell.java:188)
	at org.apache.hadoop.util.Shell$ShellCommandExecutor.execute(Shell.java:381)
	at org.apache.hadoop.util.Shell.execCommand(Shell.java:467)
	at org.apache.hadoop.util.Shell.execCommand(Shell.java:450)
	at org.apache.hadoop.fs.RawLocalFileSystem.execCommand(RawLocalFileSystem.java:549)
	at org.apache.hadoop.fs.RawLocalFileSystem.setPermission(RawLocalFileSystem.java:540)
	at org.apache.hadoop.fs.FilterFileSystem.setPermission(FilterFileSystem.java:353)
	at org.apache.hadoop.fs.FileSystem.mkdirs(FileSystem.java:428)
	at org.apache.hadoop.mapreduce.JobSubmitter.copyAndConfigureFiles(JobSubmitter.java:166)
	at org.apache.hadoop.mapreduce.JobSubmitter.copyAndConfigureFiles(JobSubmitter.java:283)
	at org.apache.hadoop.mapreduce.JobSubmitter.submitJobInternal(JobSubmitter.java:350)
	at org.apache.hadoop.mapreduce.Job$2.run(Job.java:1037)
	at org.apache.hadoop.mapreduce.Job$2.run(Job.java:1034)
	at java.security.AccessController.doPrivileged(Native Method)
	at javax.security.auth.Subject.doAs(Subject.java:396)
	at org.apache.hadoop.security.UserGroupInformation.doAs(UserGroupInformation.java:1142)
	at org.apache.hadoop.mapreduce.Job.submit(Job.java:1034)
	at org.apache.hadoop.mapreduce.Job.waitForCompletion(Job.java:1054)
	at org.apache.hadoop.mapreduce.lib.input.TestLineRecordReader.createAndRunJob(TestLineRecordReader.java:92)
	at org.apache.hadoop.mapreduce.lib.input.TestLineRecordReader.__CLR3_0_2qb6z77tou(TestLineRecordReader.java:135)
	at org.apache.hadoop.mapreduce.lib.input.TestLineRecordReader.testDefaultRecordDelimiters(TestLineRecordReader.java:128)


FAILED:  org.apache.hadoop.mapreduce.lib.input.TestMultipleInputs.testDoMultipleInputs

Error Message:
chmod: cannot access `/tmp/hadoop-hudson/mapred/staging/hudson455392072/.staging/job_local_0001': No such file or directory 

Stack Trace:
org.apache.hadoop.util.Shell$ExitCodeException: chmod: cannot access `/tmp/hadoop-hudson/mapred/staging/hudson455392072/.staging/job_local_0001': No such file or directory

	at org.apache.hadoop.util.Shell.runCommand(Shell.java:261)
	at org.apache.hadoop.util.Shell.run(Shell.java:188)
	at org.apache.hadoop.util.Shell$ShellCommandExecutor.execute(Shell.java:381)
	at org.apache.hadoop.util.Shell.execCommand(Shell.java:467)
	at org.apache.hadoop.util.Shell.execCommand(Shell.java:450)
	at org.apache.hadoop.fs.RawLocalFileSystem.execCommand(RawLocalFileSystem.java:549)
	at org.apache.hadoop.fs.RawLocalFileSystem.setPermission(RawLocalFileSystem.java:540)
	at org.apache.hadoop.fs.FilterFileSystem.setPermission(FilterFileSystem.java:353)
	at org.apache.hadoop.fs.FileSystem.mkdirs(FileSystem.java:428)
	at org.apache.hadoop.mapreduce.JobSubmitter.copyAndConfigureFiles(JobSubmitter.java:166)
	at org.apache.hadoop.mapreduce.JobSubmitter.copyAndConfigureFiles(JobSubmitter.java:283)
	at org.apache.hadoop.mapreduce.JobSubmitter.submitJobInternal(JobSubmitter.java:350)
	at org.apache.hadoop.mapreduce.Job$2.run(Job.java:1037)
	at org.apache.hadoop.mapreduce.Job$2.run(Job.java:1034)
	at java.security.AccessController.doPrivileged(Native Method)
	at javax.security.auth.Subject.doAs(Subject.java:396)
	at org.apache.hadoop.security.UserGroupInformation.doAs(UserGroupInformation.java:1142)
	at org.apache.hadoop.mapreduce.Job.submit(Job.java:1034)
	at org.apache.hadoop.mapreduce.Job.waitForCompletion(Job.java:1054)
	at org.apache.hadoop.mapreduce.lib.input.TestMultipleInputs.__CLR3_0_2l9fkqlcrn(TestMultipleInputs.java:122)
	at org.apache.hadoop.mapreduce.lib.input.TestMultipleInputs.testDoMultipleInputs(TestMultipleInputs.java:85)


FAILED:  org.apache.hadoop.mapreduce.lib.jobcontrol.TestMapReduceJobControl.testJobControlWithKillJob

Error Message:
Timeout occurred. Please note the time in the report does not reflect the time until the timeout.

Stack Trace:
junit.framework.AssertionFailedError: Timeout occurred. Please note the time in the report does not reflect the time until the timeout.


FAILED:  org.apache.hadoop.mapreduce.lib.join.TestJoinDatamerge.testSimpleInnerJoin

Error Message:
chmod: cannot access `/tmp/hadoop-hudson/mapred/staging/hudson724771305/.staging/job_local_0001': No such file or directory 

Stack Trace:
org.apache.hadoop.util.Shell$ExitCodeException: chmod: cannot access `/tmp/hadoop-hudson/mapred/staging/hudson724771305/.staging/job_local_0001': No such file or directory

	at org.apache.hadoop.util.Shell.runCommand(Shell.java:261)
	at org.apache.hadoop.util.Shell.run(Shell.java:188)
	at org.apache.hadoop.util.Shell$ShellCommandExecutor.execute(Shell.java:381)
	at org.apache.hadoop.util.Shell.execCommand(Shell.java:467)
	at org.apache.hadoop.util.Shell.execCommand(Shell.java:450)
	at org.apache.hadoop.fs.RawLocalFileSystem.execCommand(RawLocalFileSystem.java:549)
	at org.apache.hadoop.fs.RawLocalFileSystem.setPermission(RawLocalFileSystem.java:540)
	at org.apache.hadoop.fs.FilterFileSystem.setPermission(FilterFileSystem.java:353)
	at org.apache.hadoop.fs.FileSystem.mkdirs(FileSystem.java:428)
	at org.apache.hadoop.mapreduce.JobSubmitter.copyAndConfigureFiles(JobSubmitter.java:166)
	at org.apache.hadoop.mapreduce.JobSubmitter.copyAndConfigureFiles(JobSubmitter.java:283)
	at org.apache.hadoop.mapreduce.JobSubmitter.submitJobInternal(JobSubmitter.java:350)
	at org.apache.hadoop.mapreduce.Job$2.run(Job.java:1037)
	at org.apache.hadoop.mapreduce.Job$2.run(Job.java:1034)
	at java.security.AccessController.doPrivileged(Native Method)
	at javax.security.auth.Subject.doAs(Subject.java:396)
	at org.apache.hadoop.security.UserGroupInformation.doAs(UserGroupInformation.java:1142)
	at org.apache.hadoop.mapreduce.Job.submit(Job.java:1034)
	at org.apache.hadoop.mapreduce.Job.waitForCompletion(Job.java:1054)
	at org.apache.hadoop.mapreduce.lib.join.TestJoinDatamerge.joinAs(TestJoinDatamerge.java:267)
	at org.apache.hadoop.mapreduce.lib.join.TestJoinDatamerge.__CLR3_0_239fxnhf4h(TestJoinDatamerge.java:276)
	at org.apache.hadoop.mapreduce.lib.join.TestJoinDatamerge.testSimpleInnerJoin(TestJoinDatamerge.java:275)
	at junit.extensions.TestDecorator.basicRun(TestDecorator.java:24)
	at junit.extensions.TestSetup$1.protect(TestSetup.java:23)
	at junit.extensions.TestSetup.run(TestSetup.java:27)


FAILED:  org.apache.hadoop.mapreduce.lib.join.TestJoinDatamerge.testSimpleOuterJoin

Error Message:
chmod: cannot access `/tmp/hadoop-hudson/mapred/staging/hudson-1567010945/.staging/job_local_0002': No such file or directory 

Stack Trace:
org.apache.hadoop.util.Shell$ExitCodeException: chmod: cannot access `/tmp/hadoop-hudson/mapred/staging/hudson-1567010945/.staging/job_local_0002': No such file or directory

	at org.apache.hadoop.util.Shell.runCommand(Shell.java:261)
	at org.apache.hadoop.util.Shell.run(Shell.java:188)
	at org.apache.hadoop.util.Shell$ShellCommandExecutor.execute(Shell.java:381)
	at org.apache.hadoop.util.Shell.execCommand(Shell.java:467)
	at org.apache.hadoop.util.Shell.execCommand(Shell.java:450)
	at org.apache.hadoop.fs.RawLocalFileSystem.execCommand(RawLocalFileSystem.java:549)
	at org.apache.hadoop.fs.RawLocalFileSystem.setPermission(RawLocalFileSystem.java:540)
	at org.apache.hadoop.fs.FilterFileSystem.setPermission(FilterFileSystem.java:353)
	at org.apache.hadoop.fs.FileSystem.mkdirs(FileSystem.java:428)
	at org.apache.hadoop.mapreduce.JobSubmitter.copyAndConfigureFiles(JobSubmitter.java:166)
	at org.apache.hadoop.mapreduce.JobSubmitter.copyAndConfigureFiles(JobSubmitter.java:283)
	at org.apache.hadoop.mapreduce.JobSubmitter.submitJobInternal(JobSubmitter.java:350)
	at org.apache.hadoop.mapreduce.Job$2.run(Job.java:1037)
	at org.apache.hadoop.mapreduce.Job$2.run(Job.java:1034)
	at java.security.AccessController.doPrivileged(Native Method)
	at javax.security.auth.Subject.doAs(Subject.java:396)
	at org.apache.hadoop.security.UserGroupInformation.doAs(UserGroupInformation.java:1142)
	at org.apache.hadoop.mapreduce.Job.submit(Job.java:1034)
	at org.apache.hadoop.mapreduce.Job.waitForCompletion(Job.java:1054)
	at org.apache.hadoop.mapreduce.lib.join.TestJoinDatamerge.joinAs(TestJoinDatamerge.java:267)
	at org.apache.hadoop.mapreduce.lib.join.TestJoinDatamerge.__CLR3_0_2abzcwof4j(TestJoinDatamerge.java:280)
	at org.apache.hadoop.mapreduce.lib.join.TestJoinDatamerge.testSimpleOuterJoin(TestJoinDatamerge.java:279)
	at junit.extensions.TestDecorator.basicRun(TestDecorator.java:24)
	at junit.extensions.TestSetup$1.protect(TestSetup.java:23)
	at junit.extensions.TestSetup.run(TestSetup.java:27)


FAILED:  org.apache.hadoop.mapreduce.lib.join.TestJoinDatamerge.testSimpleOverride

Error Message:
chmod: cannot access `/tmp/hadoop-hudson/mapred/staging/hudson491872079/.staging/job_local_0003': No such file or directory 

Stack Trace:
org.apache.hadoop.util.Shell$ExitCodeException: chmod: cannot access `/tmp/hadoop-hudson/mapred/staging/hudson491872079/.staging/job_local_0003': No such file or directory

	at org.apache.hadoop.util.Shell.runCommand(Shell.java:261)
	at org.apache.hadoop.util.Shell.run(Shell.java:188)
	at org.apache.hadoop.util.Shell$ShellCommandExecutor.execute(Shell.java:381)
	at org.apache.hadoop.util.Shell.execCommand(Shell.java:467)
	at org.apache.hadoop.util.Shell.execCommand(Shell.java:450)
	at org.apache.hadoop.fs.RawLocalFileSystem.execCommand(RawLocalFileSystem.java:549)
	at org.apache.hadoop.fs.RawLocalFileSystem.setPermission(RawLocalFileSystem.java:540)
	at org.apache.hadoop.fs.FilterFileSystem.setPermission(FilterFileSystem.java:353)
	at org.apache.hadoop.fs.FileSystem.mkdirs(FileSystem.java:428)
	at org.apache.hadoop.mapreduce.JobSubmitter.copyAndConfigureFiles(JobSubmitter.java:166)
	at org.apache.hadoop.mapreduce.JobSubmitter.copyAndConfigureFiles(JobSubmitter.java:283)
	at org.apache.hadoop.mapreduce.JobSubmitter.submitJobInternal(JobSubmitter.java:350)
	at org.apache.hadoop.mapreduce.Job$2.run(Job.java:1037)
	at org.apache.hadoop.mapreduce.Job$2.run(Job.java:1034)
	at java.security.AccessController.doPrivileged(Native Method)
	at javax.security.auth.Subject.doAs(Subject.java:396)
	at org.apache.hadoop.security.UserGroupInformation.doAs(UserGroupInformation.java:1142)
	at org.apache.hadoop.mapreduce.Job.submit(Job.java:1034)
	at org.apache.hadoop.mapreduce.Job.waitForCompletion(Job.java:1054)
	at org.apache.hadoop.mapreduce.lib.join.TestJoinDatamerge.joinAs(TestJoinDatamerge.java:267)
	at org.apache.hadoop.mapreduce.lib.join.TestJoinDatamerge.__CLR3_0_2a19allf5i(TestJoinDatamerge.java:327)
	at org.apache.hadoop.mapreduce.lib.join.TestJoinDatamerge.testSimpleOverride(TestJoinDatamerge.java:326)
	at junit.extensions.TestDecorator.basicRun(TestDecorator.java:24)
	at junit.extensions.TestSetup$1.protect(TestSetup.java:23)
	at junit.extensions.TestSetup.run(TestSetup.java:27)


FAILED:  org.apache.hadoop.mapreduce.lib.join.TestJoinDatamerge.testNestedJoin

Error Message:
chmod: cannot access `/tmp/hadoop-hudson/mapred/staging/hudson-332503967/.staging/job_local_0004': No such file or directory 

Stack Trace:
org.apache.hadoop.util.Shell$ExitCodeException: chmod: cannot access `/tmp/hadoop-hudson/mapred/staging/hudson-332503967/.staging/job_local_0004': No such file or directory

	at org.apache.hadoop.util.Shell.runCommand(Shell.java:261)
	at org.apache.hadoop.util.Shell.run(Shell.java:188)
	at org.apache.hadoop.util.Shell$ShellCommandExecutor.execute(Shell.java:381)
	at org.apache.hadoop.util.Shell.execCommand(Shell.java:467)
	at org.apache.hadoop.util.Shell.execCommand(Shell.java:450)
	at org.apache.hadoop.fs.RawLocalFileSystem.execCommand(RawLocalFileSystem.java:549)
	at org.apache.hadoop.fs.RawLocalFileSystem.setPermission(RawLocalFileSystem.java:540)
	at org.apache.hadoop.fs.FilterFileSystem.setPermission(FilterFileSystem.java:353)
	at org.apache.hadoop.fs.FileSystem.mkdirs(FileSystem.java:428)
	at org.apache.hadoop.mapreduce.JobSubmitter.copyAndConfigureFiles(JobSubmitter.java:166)
	at org.apache.hadoop.mapreduce.JobSubmitter.copyAndConfigureFiles(JobSubmitter.java:283)
	at org.apache.hadoop.mapreduce.JobSubmitter.submitJobInternal(JobSubmitter.java:350)
	at org.apache.hadoop.mapreduce.Job$2.run(Job.java:1037)
	at org.apache.hadoop.mapreduce.Job$2.run(Job.java:1034)
	at java.security.AccessController.doPrivileged(Native Method)
	at javax.security.auth.Subject.doAs(Subject.java:396)
	at org.apache.hadoop.security.UserGroupInformation.doAs(UserGroupInformation.java:1142)
	at org.apache.hadoop.mapreduce.Job.submit(Job.java:1034)
	at org.apache.hadoop.mapreduce.Job.waitForCompletion(Job.java:1054)
	at org.apache.hadoop.mapreduce.lib.join.TestJoinDatamerge.__CLR3_0_2fidujef5k(TestJoinDatamerge.java:390)
	at org.apache.hadoop.mapreduce.lib.join.TestJoinDatamerge.testNestedJoin(TestJoinDatamerge.java:330)
	at junit.extensions.TestDecorator.basicRun(TestDecorator.java:24)
	at junit.extensions.TestSetup$1.protect(TestSetup.java:23)
	at junit.extensions.TestSetup.run(TestSetup.java:27)


FAILED:  org.apache.hadoop.mapreduce.lib.join.TestJoinDatamerge.testEmptyJoin

Error Message:
chmod: cannot access `/tmp/hadoop-hudson/mapred/staging/hudson-1324835140/.staging/job_local_0005': No such file or directory 

Stack Trace:
org.apache.hadoop.util.Shell$ExitCodeException: chmod: cannot access `/tmp/hadoop-hudson/mapred/staging/hudson-1324835140/.staging/job_local_0005': No such file or directory

	at org.apache.hadoop.util.Shell.runCommand(Shell.java:261)
	at org.apache.hadoop.util.Shell.run(Shell.java:188)
	at org.apache.hadoop.util.Shell$ShellCommandExecutor.execute(Shell.java:381)
	at org.apache.hadoop.util.Shell.execCommand(Shell.java:467)
	at org.apache.hadoop.util.Shell.execCommand(Shell.java:450)
	at org.apache.hadoop.fs.RawLocalFileSystem.execCommand(RawLocalFileSystem.java:549)
	at org.apache.hadoop.fs.RawLocalFileSystem.setPermission(RawLocalFileSystem.java:540)
	at org.apache.hadoop.fs.FilterFileSystem.setPermission(FilterFileSystem.java:353)
	at org.apache.hadoop.fs.FileSystem.mkdirs(FileSystem.java:428)
	at org.apache.hadoop.mapreduce.JobSubmitter.copyAndConfigureFiles(JobSubmitter.java:166)
	at org.apache.hadoop.mapreduce.JobSubmitter.copyAndConfigureFiles(JobSubmitter.java:283)
	at org.apache.hadoop.mapreduce.JobSubmitter.submitJobInternal(JobSubmitter.java:350)
	at org.apache.hadoop.mapreduce.Job$2.run(Job.java:1037)
	at org.apache.hadoop.mapreduce.Job$2.run(Job.java:1034)
	at java.security.AccessController.doPrivileged(Native Method)
	at javax.security.auth.Subject.doAs(Subject.java:396)
	at org.apache.hadoop.security.UserGroupInformation.doAs(UserGroupInformation.java:1142)
	at org.apache.hadoop.mapreduce.Job.submit(Job.java:1034)
	at org.apache.hadoop.mapreduce.Job.waitForCompletion(Job.java:1054)
	at org.apache.hadoop.mapreduce.lib.join.TestJoinDatamerge.__CLR3_0_2f6b0b0f86(TestJoinDatamerge.java:442)
	at org.apache.hadoop.mapreduce.lib.join.TestJoinDatamerge.testEmptyJoin(TestJoinDatamerge.java:425)
	at junit.extensions.TestDecorator.basicRun(TestDecorator.java:24)
	at junit.extensions.TestSetup$1.protect(TestSetup.java:23)
	at junit.extensions.TestSetup.run(TestSetup.java:27)


FAILED:  org.apache.hadoop.mapreduce.lib.map.TestMultithreadedMapper.testOKRun

Error Message:
chmod: cannot access `/tmp/hadoop-hudson/mapred/staging/hudson1555171823/.staging/job_local_0001': No such file or directory 

Stack Trace:
org.apache.hadoop.util.Shell$ExitCodeException: chmod: cannot access `/tmp/hadoop-hudson/mapred/staging/hudson1555171823/.staging/job_local_0001': No such file or directory

	at org.apache.hadoop.util.Shell.runCommand(Shell.java:261)
	at org.apache.hadoop.util.Shell.run(Shell.java:188)
	at org.apache.hadoop.util.Shell$ShellCommandExecutor.execute(Shell.java:381)
	at org.apache.hadoop.util.Shell.execCommand(Shell.java:467)
	at org.apache.hadoop.util.Shell.execCommand(Shell.java:450)
	at org.apache.hadoop.fs.RawLocalFileSystem.execCommand(RawLocalFileSystem.java:549)
	at org.apache.hadoop.fs.RawLocalFileSystem.setPermission(RawLocalFileSystem.java:540)
	at org.apache.hadoop.fs.FilterFileSystem.setPermission(FilterFileSystem.java:353)
	at org.apache.hadoop.fs.FileSystem.mkdirs(FileSystem.java:428)
	at org.apache.hadoop.mapreduce.JobSubmitter.copyAndConfigureFiles(JobSubmitter.java:166)
	at org.apache.hadoop.mapreduce.JobSubmitter.copyAndConfigureFiles(JobSubmitter.java:283)
	at org.apache.hadoop.mapreduce.JobSubmitter.submitJobInternal(JobSubmitter.java:350)
	at org.apache.hadoop.mapreduce.Job$2.run(Job.java:1037)
	at org.apache.hadoop.mapreduce.Job$2.run(Job.java:1034)
	at java.security.AccessController.doPrivileged(Native Method)
	at javax.security.auth.Subject.doAs(Subject.java:396)
	at org.apache.hadoop.security.UserGroupInformation.doAs(UserGroupInformation.java:1142)
	at org.apache.hadoop.mapreduce.Job.submit(Job.java:1034)
	at org.apache.hadoop.mapreduce.Job.waitForCompletion(Job.java:1054)
	at org.apache.hadoop.mapreduce.lib.map.TestMultithreadedMapper.run(TestMultithreadedMapper.java:69)
	at org.apache.hadoop.mapreduce.lib.map.TestMultithreadedMapper.__CLR3_0_2dhspycp6h(TestMultithreadedMapper.java:37)
	at org.apache.hadoop.mapreduce.lib.map.TestMultithreadedMapper.testOKRun(TestMultithreadedMapper.java:36)


FAILED:  org.apache.hadoop.mapreduce.lib.map.TestMultithreadedMapper.testIOExRun

Error Message:
chmod: cannot access `/tmp/hadoop-hudson/mapred/staging/hudson-1511792688/.staging/job_local_0002': No such file or directory 

Stack Trace:
org.apache.hadoop.util.Shell$ExitCodeException: chmod: cannot access `/tmp/hadoop-hudson/mapred/staging/hudson-1511792688/.staging/job_local_0002': No such file or directory

	at org.apache.hadoop.util.Shell.runCommand(Shell.java:261)
	at org.apache.hadoop.util.Shell.run(Shell.java:188)
	at org.apache.hadoop.util.Shell$ShellCommandExecutor.execute(Shell.java:381)
	at org.apache.hadoop.util.Shell.execCommand(Shell.java:467)
	at org.apache.hadoop.util.Shell.execCommand(Shell.java:450)
	at org.apache.hadoop.fs.RawLocalFileSystem.execCommand(RawLocalFileSystem.java:549)
	at org.apache.hadoop.fs.RawLocalFileSystem.setPermission(RawLocalFileSystem.java:540)
	at org.apache.hadoop.fs.FilterFileSystem.setPermission(FilterFileSystem.java:353)
	at org.apache.hadoop.fs.FileSystem.mkdirs(FileSystem.java:428)
	at org.apache.hadoop.mapreduce.JobSubmitter.copyAndConfigureFiles(JobSubmitter.java:166)
	at org.apache.hadoop.mapreduce.JobSubmitter.copyAndConfigureFiles(JobSubmitter.java:283)
	at org.apache.hadoop.mapreduce.JobSubmitter.submitJobInternal(JobSubmitter.java:350)
	at org.apache.hadoop.mapreduce.Job$2.run(Job.java:1037)
	at org.apache.hadoop.mapreduce.Job$2.run(Job.java:1034)
	at java.security.AccessController.doPrivileged(Native Method)
	at javax.security.auth.Subject.doAs(Subject.java:396)
	at org.apache.hadoop.security.UserGroupInformation.doAs(UserGroupInformation.java:1142)
	at org.apache.hadoop.mapreduce.Job.submit(Job.java:1034)
	at org.apache.hadoop.mapreduce.Job.waitForCompletion(Job.java:1054)
	at org.apache.hadoop.mapreduce.lib.map.TestMultithreadedMapper.run(TestMultithreadedMapper.java:69)
	at org.apache.hadoop.mapreduce.lib.map.TestMultithreadedMapper.__CLR3_0_21nnwsnp6j(TestMultithreadedMapper.java:41)
	at org.apache.hadoop.mapreduce.lib.map.TestMultithreadedMapper.testIOExRun(TestMultithreadedMapper.java:40)


FAILED:  org.apache.hadoop.mapreduce.lib.map.TestMultithreadedMapper.testRuntimeExRun

Error Message:
chmod: cannot access `/tmp/hadoop-hudson/mapred/staging/hudson-1447077494/.staging/job_local_0003': No such file or directory 

Stack Trace:
org.apache.hadoop.util.Shell$ExitCodeException: chmod: cannot access `/tmp/hadoop-hudson/mapred/staging/hudson-1447077494/.staging/job_local_0003': No such file or directory

	at org.apache.hadoop.util.Shell.runCommand(Shell.java:261)
	at org.apache.hadoop.util.Shell.run(Shell.java:188)
	at org.apache.hadoop.util.Shell$ShellCommandExecutor.execute(Shell.java:381)
	at org.apache.hadoop.util.Shell.execCommand(Shell.java:467)
	at org.apache.hadoop.util.Shell.execCommand(Shell.java:450)
	at org.apache.hadoop.fs.RawLocalFileSystem.execCommand(RawLocalFileSystem.java:549)
	at org.apache.hadoop.fs.RawLocalFileSystem.setPermission(RawLocalFileSystem.java:540)
	at org.apache.hadoop.fs.FilterFileSystem.setPermission(FilterFileSystem.java:353)
	at org.apache.hadoop.fs.FileSystem.mkdirs(FileSystem.java:428)
	at org.apache.hadoop.mapreduce.JobSubmitter.copyAndConfigureFiles(JobSubmitter.java:166)
	at org.apache.hadoop.mapreduce.JobSubmitter.copyAndConfigureFiles(JobSubmitter.java:283)
	at org.apache.hadoop.mapreduce.JobSubmitter.submitJobInternal(JobSubmitter.java:350)
	at org.apache.hadoop.mapreduce.Job$2.run(Job.java:1037)
	at org.apache.hadoop.mapreduce.Job$2.run(Job.java:1034)
	at java.security.AccessController.doPrivileged(Native Method)
	at javax.security.auth.Subject.doAs(Subject.java:396)
	at org.apache.hadoop.security.UserGroupInformation.doAs(UserGroupInformation.java:1142)
	at org.apache.hadoop.mapreduce.Job.submit(Job.java:1034)
	at org.apache.hadoop.mapreduce.Job.waitForCompletion(Job.java:1054)
	at org.apache.hadoop.mapreduce.lib.map.TestMultithreadedMapper.run(TestMultithreadedMapper.java:69)
	at org.apache.hadoop.mapreduce.lib.map.TestMultithreadedMapper.__CLR3_0_2zf5zzbp6l(TestMultithreadedMapper.java:44)
	at org.apache.hadoop.mapreduce.lib.map.TestMultithreadedMapper.testRuntimeExRun(TestMultithreadedMapper.java:43)


FAILED:  org.apache.hadoop.mapreduce.lib.output.TestMRMultipleOutputs.testWithoutCounters

Error Message:
chmod: cannot access `/tmp/hadoop-hudson/mapred/staging/hudson-66300045/.staging/job_local_0001': No such file or directory 

Stack Trace:
org.apache.hadoop.util.Shell$ExitCodeException: chmod: cannot access `/tmp/hadoop-hudson/mapred/staging/hudson-66300045/.staging/job_local_0001': No such file or directory

	at org.apache.hadoop.util.Shell.runCommand(Shell.java:261)
	at org.apache.hadoop.util.Shell.run(Shell.java:188)
	at org.apache.hadoop.util.Shell$ShellCommandExecutor.execute(Shell.java:381)
	at org.apache.hadoop.util.Shell.execCommand(Shell.java:467)
	at org.apache.hadoop.util.Shell.execCommand(Shell.java:450)
	at org.apache.hadoop.fs.RawLocalFileSystem.execCommand(RawLocalFileSystem.java:549)
	at org.apache.hadoop.fs.RawLocalFileSystem.setPermission(RawLocalFileSystem.java:540)
	at org.apache.hadoop.fs.FilterFileSystem.setPermission(FilterFileSystem.java:353)
	at org.apache.hadoop.fs.FileSystem.mkdirs(FileSystem.java:428)
	at org.apache.hadoop.mapreduce.JobSubmitter.copyAndConfigureFiles(JobSubmitter.java:166)
	at org.apache.hadoop.mapreduce.JobSubmitter.copyAndConfigureFiles(JobSubmitter.java:283)
	at org.apache.hadoop.mapreduce.JobSubmitter.submitJobInternal(JobSubmitter.java:350)
	at org.apache.hadoop.mapreduce.Job$2.run(Job.java:1037)
	at org.apache.hadoop.mapreduce.Job$2.run(Job.java:1034)
	at java.security.AccessController.doPrivileged(Native Method)
	at javax.security.auth.Subject.doAs(Subject.java:396)
	at org.apache.hadoop.security.UserGroupInformation.doAs(UserGroupInformation.java:1142)
	at org.apache.hadoop.mapreduce.Job.submit(Job.java:1034)
	at org.apache.hadoop.mapreduce.Job.waitForCompletion(Job.java:1054)
	at org.apache.hadoop.mapreduce.lib.output.TestMRMultipleOutputs._testMultipleOutputs(TestMRMultipleOutputs.java:169)
	at org.apache.hadoop.mapreduce.lib.output.TestMRMultipleOutputs.__CLR3_0_27rxkdonds(TestMRMultipleOutputs.java:43)
	at org.apache.hadoop.mapreduce.lib.output.TestMRMultipleOutputs.testWithoutCounters(TestMRMultipleOutputs.java:42)


FAILED:  org.apache.hadoop.mapreduce.lib.output.TestMRMultipleOutputs.testWithCounters

Error Message:
chmod: cannot access `/tmp/hadoop-hudson/mapred/staging/hudson-21640667/.staging/job_local_0002': No such file or directory 

Stack Trace:
org.apache.hadoop.util.Shell$ExitCodeException: chmod: cannot access `/tmp/hadoop-hudson/mapred/staging/hudson-21640667/.staging/job_local_0002': No such file or directory

	at org.apache.hadoop.util.Shell.runCommand(Shell.java:261)
	at org.apache.hadoop.util.Shell.run(Shell.java:188)
	at org.apache.hadoop.util.Shell$ShellCommandExecutor.execute(Shell.java:381)
	at org.apache.hadoop.util.Shell.execCommand(Shell.java:467)
	at org.apache.hadoop.util.Shell.execCommand(Shell.java:450)
	at org.apache.hadoop.fs.RawLocalFileSystem.execCommand(RawLocalFileSystem.java:549)
	at org.apache.hadoop.fs.RawLocalFileSystem.setPermission(RawLocalFileSystem.java:540)
	at org.apache.hadoop.fs.FilterFileSystem.setPermission(FilterFileSystem.java:353)
	at org.apache.hadoop.fs.FileSystem.mkdirs(FileSystem.java:428)
	at org.apache.hadoop.mapreduce.JobSubmitter.copyAndConfigureFiles(JobSubmitter.java:166)
	at org.apache.hadoop.mapreduce.JobSubmitter.copyAndConfigureFiles(JobSubmitter.java:283)
	at org.apache.hadoop.mapreduce.JobSubmitter.submitJobInternal(JobSubmitter.java:350)
	at org.apache.hadoop.mapreduce.Job$2.run(Job.java:1037)
	at org.apache.hadoop.mapreduce.Job$2.run(Job.java:1034)
	at java.security.AccessController.doPrivileged(Native Method)
	at javax.security.auth.Subject.doAs(Subject.java:396)
	at org.apache.hadoop.security.UserGroupInformation.doAs(UserGroupInformation.java:1142)
	at org.apache.hadoop.mapreduce.Job.submit(Job.java:1034)
	at org.apache.hadoop.mapreduce.Job.waitForCompletion(Job.java:1054)
	at org.apache.hadoop.mapreduce.lib.output.TestMRMultipleOutputs._testMultipleOutputs(TestMRMultipleOutputs.java:169)
	at org.apache.hadoop.mapreduce.lib.output.TestMRMultipleOutputs.__CLR3_0_2435lo6ndv(TestMRMultipleOutputs.java:48)
	at org.apache.hadoop.mapreduce.lib.output.TestMRMultipleOutputs.testWithCounters(TestMRMultipleOutputs.java:47)


FAILED:  org.apache.hadoop.mapreduce.lib.partition.TestMRKeyFieldBasedComparator.testBasicUnixComparator

Error Message:
chmod: cannot access `/tmp/hadoop-hudson/mapred/staging/hudson-466184653/.staging/job_local_0001': No such file or directory 

Stack Trace:
org.apache.hadoop.util.Shell$ExitCodeException: chmod: cannot access `/tmp/hadoop-hudson/mapred/staging/hudson-466184653/.staging/job_local_0001': No such file or directory

	at org.apache.hadoop.util.Shell.runCommand(Shell.java:261)
	at org.apache.hadoop.util.Shell.run(Shell.java:188)
	at org.apache.hadoop.util.Shell$ShellCommandExecutor.execute(Shell.java:381)
	at org.apache.hadoop.util.Shell.execCommand(Shell.java:467)
	at org.apache.hadoop.util.Shell.execCommand(Shell.java:450)
	at org.apache.hadoop.fs.RawLocalFileSystem.execCommand(RawLocalFileSystem.java:549)
	at org.apache.hadoop.fs.RawLocalFileSystem.setPermission(RawLocalFileSystem.java:540)
	at org.apache.hadoop.fs.FilterFileSystem.setPermission(FilterFileSystem.java:353)
	at org.apache.hadoop.fs.FileSystem.mkdirs(FileSystem.java:428)
	at org.apache.hadoop.mapreduce.JobSubmitter.copyAndConfigureFiles(JobSubmitter.java:166)
	at org.apache.hadoop.mapreduce.JobSubmitter.copyAndConfigureFiles(JobSubmitter.java:283)
	at org.apache.hadoop.mapreduce.JobSubmitter.submitJobInternal(JobSubmitter.java:350)
	at org.apache.hadoop.mapreduce.Job$2.run(Job.java:1037)
	at org.apache.hadoop.mapreduce.Job$2.run(Job.java:1034)
	at java.security.AccessController.doPrivileged(Native Method)
	at javax.security.auth.Subject.doAs(Subject.java:396)
	at org.apache.hadoop.security.UserGroupInformation.doAs(UserGroupInformation.java:1142)
	at org.apache.hadoop.mapreduce.Job.submit(Job.java:1034)
	at org.apache.hadoop.mapreduce.Job.waitForCompletion(Job.java:1054)
	at org.apache.hadoop.mapreduce.lib.partition.TestMRKeyFieldBasedComparator.testComparator(TestMRKeyFieldBasedComparator.java:68)
	at org.apache.hadoop.mapreduce.lib.partition.TestMRKeyFieldBasedComparator.__CLR3_0_2efq8inc0j(TestMRKeyFieldBasedComparator.java:98)
	at org.apache.hadoop.mapreduce.lib.partition.TestMRKeyFieldBasedComparator.testBasicUnixComparator(TestMRKeyFieldBasedComparator.java:97)


FAILED:  org.apache.hadoop.record.TestRecordMR.testMapred

Error Message:
chmod: cannot access `/tmp/hadoop-hudson/mapred/staging/hudson1472047611/.staging/job_local_0001': No such file or directory 

Stack Trace:
org.apache.hadoop.util.Shell$ExitCodeException: chmod: cannot access `/tmp/hadoop-hudson/mapred/staging/hudson1472047611/.staging/job_local_0001': No such file or directory

	at org.apache.hadoop.util.Shell.runCommand(Shell.java:261)
	at org.apache.hadoop.util.Shell.run(Shell.java:188)
	at org.apache.hadoop.util.Shell$ShellCommandExecutor.execute(Shell.java:381)
	at org.apache.hadoop.util.Shell.execCommand(Shell.java:467)
	at org.apache.hadoop.util.Shell.execCommand(Shell.java:450)
	at org.apache.hadoop.fs.RawLocalFileSystem.execCommand(RawLocalFileSystem.java:549)
	at org.apache.hadoop.fs.RawLocalFileSystem.setPermission(RawLocalFileSystem.java:540)
	at org.apache.hadoop.fs.FilterFileSystem.setPermission(FilterFileSystem.java:353)
	at org.apache.hadoop.fs.FileSystem.mkdirs(FileSystem.java:428)
	at org.apache.hadoop.mapreduce.JobSubmitter.copyAndConfigureFiles(JobSubmitter.java:166)
	at org.apache.hadoop.mapreduce.JobSubmitter.copyAndConfigureFiles(JobSubmitter.java:283)
	at org.apache.hadoop.mapreduce.JobSubmitter.submitJobInternal(JobSubmitter.java:350)
	at org.apache.hadoop.mapreduce.Job$2.run(Job.java:1037)
	at org.apache.hadoop.mapreduce.Job$2.run(Job.java:1034)
	at java.security.AccessController.doPrivileged(Native Method)
	at javax.security.auth.Subject.doAs(Subject.java:396)
	at org.apache.hadoop.security.UserGroupInformation.doAs(UserGroupInformation.java:1142)
	at org.apache.hadoop.mapreduce.Job.submit(Job.java:1034)
	at org.apache.hadoop.mapred.JobClient.submitJob(JobClient.java:536)
	at org.apache.hadoop.mapred.JobClient.runJob(JobClient.java:781)
	at org.apache.hadoop.record.TestRecordMR.launch(TestRecordMR.java:322)
	at org.apache.hadoop.record.TestRecordMR.__CLR3_0_2vmf1hqbvf(TestRecordMR.java:237)
	at org.apache.hadoop.record.TestRecordMR.testMapred(TestRecordMR.java:236)


FAILED:  org.apache.hadoop.tools.TestCopyFiles.testCopyFromLocalToLocal

Error Message:
File /grid/0/hudson/hudson-slave/workspace/Hadoop-Mapreduce-trunk/trunk/build/test/data/destdat/zero/5278322512784049324 does not exist.

Stack Trace:
java.io.FileNotFoundException: File /grid/0/hudson/hudson-slave/workspace/Hadoop-Mapreduce-trunk/trunk/build/test/data/destdat/zero/5278322512784049324 does not exist.
	at org.apache.hadoop.fs.RawLocalFileSystem.getFileStatus(RawLocalFileSystem.java:424)
	at org.apache.hadoop.fs.FilterFileSystem.getFileStatus(FilterFileSystem.java:311)
	at org.apache.hadoop.tools.TestCopyFiles.checkFiles(TestCopyFiles.java:169)
	at org.apache.hadoop.tools.TestCopyFiles.checkFiles(TestCopyFiles.java:159)
	at org.apache.hadoop.tools.TestCopyFiles.__CLR3_0_2qikfc3w5s(TestCopyFiles.java:271)
	at org.apache.hadoop.tools.TestCopyFiles.testCopyFromLocalToLocal(TestCopyFiles.java:264)


FAILED:  org.apache.hadoop.tools.TestCopyFiles.testCopyFromDfsToDfs

Error Message:
File does not exist: /destdat/4171355447368913763

Stack Trace:
java.io.FileNotFoundException: File does not exist: /destdat/4171355447368913763
	at org.apache.hadoop.hdfs.DistributedFileSystem.getFileStatus(DistributedFileSystem.java:745)
	at org.apache.hadoop.tools.TestCopyFiles.checkFiles(TestCopyFiles.java:169)
	at org.apache.hadoop.tools.TestCopyFiles.checkFiles(TestCopyFiles.java:159)
	at org.apache.hadoop.tools.TestCopyFiles.__CLR3_0_2e6yof1w60(TestCopyFiles.java:293)
	at org.apache.hadoop.tools.TestCopyFiles.testCopyFromDfsToDfs(TestCopyFiles.java:278)


FAILED:  org.apache.hadoop.tools.TestCopyFiles.testEmptyDir

Error Message:
Destination directory does not exist.

Stack Trace:
junit.framework.AssertionFailedError: Destination directory does not exist.
	at org.apache.hadoop.tools.TestCopyFiles.__CLR3_0_2v5ob47w6n(TestCopyFiles.java:327)
	at org.apache.hadoop.tools.TestCopyFiles.testEmptyDir(TestCopyFiles.java:308)


FAILED:  org.apache.hadoop.tools.TestCopyFiles.testCopyFromLocalToDfs

Error Message:
File does not exist: /destdat/8810291630201465037

Stack Trace:
java.io.FileNotFoundException: File does not exist: /destdat/8810291630201465037
	at org.apache.hadoop.hdfs.DistributedFileSystem.getFileStatus(DistributedFileSystem.java:745)
	at org.apache.hadoop.tools.TestCopyFiles.checkFiles(TestCopyFiles.java:169)
	at org.apache.hadoop.tools.TestCopyFiles.checkFiles(TestCopyFiles.java:159)
	at org.apache.hadoop.tools.TestCopyFiles.__CLR3_0_2hl9wyrw7a(TestCopyFiles.java:353)
	at org.apache.hadoop.tools.TestCopyFiles.testCopyFromLocalToDfs(TestCopyFiles.java:339)


FAILED:  org.apache.hadoop.tools.TestCopyFiles.testCopyFromDfsToLocal

Error Message:
File /grid/0/hudson/hudson-slave/workspace/Hadoop-Mapreduce-trunk/trunk/build/test/data/destdat/4960508457517487496 does not exist.

Stack Trace:
java.io.FileNotFoundException: File /grid/0/hudson/hudson-slave/workspace/Hadoop-Mapreduce-trunk/trunk/build/test/data/destdat/4960508457517487496 does not exist.
	at org.apache.hadoop.fs.RawLocalFileSystem.getFileStatus(RawLocalFileSystem.java:424)
	at org.apache.hadoop.fs.FilterFileSystem.getFileStatus(FilterFileSystem.java:311)
	at org.apache.hadoop.tools.TestCopyFiles.checkFiles(TestCopyFiles.java:169)
	at org.apache.hadoop.tools.TestCopyFiles.checkFiles(TestCopyFiles.java:159)
	at org.apache.hadoop.tools.TestCopyFiles.__CLR3_0_2o5d2y1w7v(TestCopyFiles.java:382)
	at org.apache.hadoop.tools.TestCopyFiles.testCopyFromDfsToLocal(TestCopyFiles.java:367)


FAILED:  org.apache.hadoop.tools.TestCopyFiles.testCopyDfsToDfsUpdateOverwrite

Error Message:
File does not exist: /destdat/zero/5336652090485741973

Stack Trace:
java.io.FileNotFoundException: File does not exist: /destdat/zero/5336652090485741973
	at org.apache.hadoop.hdfs.DistributedFileSystem.getFileStatus(DistributedFileSystem.java:745)
	at org.apache.hadoop.tools.TestCopyFiles.checkFiles(TestCopyFiles.java:169)
	at org.apache.hadoop.tools.TestCopyFiles.checkFiles(TestCopyFiles.java:159)
	at org.apache.hadoop.tools.TestCopyFiles.__CLR3_0_2ddsv4zw8h(TestCopyFiles.java:410)
	at org.apache.hadoop.tools.TestCopyFiles.testCopyDfsToDfsUpdateOverwrite(TestCopyFiles.java:395)


FAILED:  org.apache.hadoop.tools.TestCopyFiles.testCopyDfsToDfsUpdateWithSkipCRC

Error Message:
Dest did not get overwritten without skip crc

Stack Trace:
junit.framework.AssertionFailedError: Dest did not get overwritten without skip crc
	at org.apache.hadoop.tools.TestCopyFiles.__CLR3_0_29z237lw9e(TestCopyFiles.java:517)
	at org.apache.hadoop.tools.TestCopyFiles.testCopyDfsToDfsUpdateWithSkipCRC(TestCopyFiles.java:455)


FAILED:  org.apache.hadoop.tools.TestCopyFiles.testCopyDuplication

Error Message:
File /grid/0/hudson/hudson-slave/workspace/Hadoop-Mapreduce-trunk/trunk/build/test/data/src2/srcdat/4661044465689404554 does not exist.

Stack Trace:
java.io.FileNotFoundException: File /grid/0/hudson/hudson-slave/workspace/Hadoop-Mapreduce-trunk/trunk/build/test/data/src2/srcdat/4661044465689404554 does not exist.
	at org.apache.hadoop.fs.RawLocalFileSystem.getFileStatus(RawLocalFileSystem.java:424)
	at org.apache.hadoop.fs.FilterFileSystem.getFileStatus(FilterFileSystem.java:311)
	at org.apache.hadoop.tools.TestCopyFiles.checkFiles(TestCopyFiles.java:169)
	at org.apache.hadoop.tools.TestCopyFiles.checkFiles(TestCopyFiles.java:159)
	at org.apache.hadoop.tools.TestCopyFiles.__CLR3_0_2px84yawal(TestCopyFiles.java:537)
	at org.apache.hadoop.tools.TestCopyFiles.testCopyDuplication(TestCopyFiles.java:530)


FAILED:  org.apache.hadoop.tools.TestCopyFiles.testCopySingleFile

Error Message:
File /grid/0/hudson/hudson-slave/workspace/Hadoop-Mapreduce-trunk/trunk/build/test/data/destdat/four/5409337892328837065 does not exist.

Stack Trace:
java.io.FileNotFoundException: File /grid/0/hudson/hudson-slave/workspace/Hadoop-Mapreduce-trunk/trunk/build/test/data/destdat/four/5409337892328837065 does not exist.
	at org.apache.hadoop.fs.RawLocalFileSystem.getFileStatus(RawLocalFileSystem.java:424)
	at org.apache.hadoop.fs.FilterFileSystem.getFileStatus(FilterFileSystem.java:311)
	at org.apache.hadoop.tools.TestCopyFiles.checkFiles(TestCopyFiles.java:169)
	at org.apache.hadoop.tools.TestCopyFiles.checkFiles(TestCopyFiles.java:159)
	at org.apache.hadoop.tools.TestCopyFiles.__CLR3_0_29cq27iwav(TestCopyFiles.java:562)
	at org.apache.hadoop.tools.TestCopyFiles.testCopySingleFile(TestCopyFiles.java:553)


FAILED:  org.apache.hadoop.tools.TestCopyFiles.testBasedir

Error Message:
File does not exist: /destdat/middle/srcdat/4088433437640297400

Stack Trace:
java.io.FileNotFoundException: File does not exist: /destdat/middle/srcdat/4088433437640297400
	at org.apache.hadoop.hdfs.DistributedFileSystem.getFileStatus(DistributedFileSystem.java:745)
	at org.apache.hadoop.tools.TestCopyFiles.checkFiles(TestCopyFiles.java:169)
	at org.apache.hadoop.tools.TestCopyFiles.checkFiles(TestCopyFiles.java:159)
	at org.apache.hadoop.tools.TestCopyFiles.__CLR3_0_2rlzv7zwbo(TestCopyFiles.java:627)
	at org.apache.hadoop.tools.TestCopyFiles.testBasedir(TestCopyFiles.java:612)


FAILED:  org.apache.hadoop.tools.TestCopyFiles.testPreserveOption

Error Message:
File does not exist: /destdat/five/1351770230757528526

Stack Trace:
java.io.FileNotFoundException: File does not exist: /destdat/five/1351770230757528526
	at org.apache.hadoop.hdfs.DistributedFileSystem.getFileStatus(DistributedFileSystem.java:745)
	at org.apache.hadoop.tools.TestCopyFiles.checkFiles(TestCopyFiles.java:169)
	at org.apache.hadoop.tools.TestCopyFiles.checkFiles(TestCopyFiles.java:159)
	at org.apache.hadoop.tools.TestCopyFiles.__CLR3_0_2p0v3lywc9(TestCopyFiles.java:654)
	at org.apache.hadoop.tools.TestCopyFiles.testPreserveOption(TestCopyFiles.java:638)


FAILED:  org.apache.hadoop.tools.TestCopyFiles.testLimits

Error Message:
expected:<10> but was:<0>

Stack Trace:
junit.framework.AssertionFailedError: expected:<10> but was:<0>
	at org.apache.hadoop.tools.TestCopyFiles.__CLR3_0_2gnl1gvwff(TestCopyFiles.java:816)
	at org.apache.hadoop.tools.TestCopyFiles.testLimits(TestCopyFiles.java:789)


FAILED:  org.apache.hadoop.tools.TestCopyFiles.testDelete

Error Message:
null expected:</[1177177055099874752 /2584183815896940601 /4522422113308227135 /7030275444536795505 /eight /eight/six /eight/six/563069486957197101 /eight/zero /eight/zero/5167254492864578339 /five /five/zero /five/zero/1551287907426088228 /four /four/1985255132538496974 /nine /nine/six /nine/six/5674690209740147842 /one /one/two /one/two/8796253466087430815 /seven /seven/5257263541138287530 /six /six/412912172739866608 /six/nine /six/nine/9205616552710330644 /six/seven /six/seven/5121514797188574932 /six/six /six/six/7794523081823027704 /six/three /six/three/4835646422771641351 /three /three/4915519354916668670 /three/6997202327034035914 /zero /zero/8714580794172598869 /zero/one /zero/one/3241611236187016567] > but was:</[2908707034248719856 /6498228008050291075 /8436841171532526298 /five /five/zero /five/zero/9095653046628149031 /four /four/3045181838643633884 /four/3207190551578623250 /four/781156846311455590 /nine /nine/4882597703463860900 /nine/742808028324524394 /one /one/3102599712045942630 /seven /seven/4174992421279177355 /seven/two /seven/two/8605265968775339288 /six /six/9050880427371019463 /three /three/nine /three/nine/7869749358999611026 /two /two/1596420523419720924 /two/five /two/five/1454510131269817535 /two/five/567503184693800681 /two/six /two/six/6171275936434477501 /two/two /two/two/494554067706578103 /zero /zero/9100941242292665862] >

Stack Trace:
junit.framework.ComparisonFailure: null expected:</[1177177055099874752
/2584183815896940601
/4522422113308227135
/7030275444536795505
/eight
/eight/six
/eight/six/563069486957197101
/eight/zero
/eight/zero/5167254492864578339
/five
/five/zero
/five/zero/1551287907426088228
/four
/four/1985255132538496974
/nine
/nine/six
/nine/six/5674690209740147842
/one
/one/two
/one/two/8796253466087430815
/seven
/seven/5257263541138287530
/six
/six/412912172739866608
/six/nine
/six/nine/9205616552710330644
/six/seven
/six/seven/5121514797188574932
/six/six
/six/six/7794523081823027704
/six/three
/six/three/4835646422771641351
/three
/three/4915519354916668670
/three/6997202327034035914
/zero
/zero/8714580794172598869
/zero/one
/zero/one/3241611236187016567]
> but was:</[2908707034248719856
/6498228008050291075
/8436841171532526298
/five
/five/zero
/five/zero/9095653046628149031
/four
/four/3045181838643633884
/four/3207190551578623250
/four/781156846311455590
/nine
/nine/4882597703463860900
/nine/742808028324524394
/one
/one/3102599712045942630
/seven
/seven/4174992421279177355
/seven/two
/seven/two/8605265968775339288
/six
/six/9050880427371019463
/three
/three/nine
/three/nine/7869749358999611026
/two
/two/1596420523419720924
/two/five
/two/five/1454510131269817535
/two/five/567503184693800681
/two/six
/two/six/6171275936434477501
/two/two
/two/two/494554067706578103
/zero
/zero/9100941242292665862]
>
	at org.apache.hadoop.tools.TestCopyFiles.__CLR3_0_2yilj0cwim(TestCopyFiles.java:989)
	at org.apache.hadoop.tools.TestCopyFiles.testDelete(TestCopyFiles.java:952)


FAILED:  org.apache.hadoop.tools.TestCopyFiles.testDeleteLocal

Error Message:
File /grid/0/hudson/hudson-slave/workspace/Hadoop-Mapreduce-trunk/trunk/build/test/data/destdat/7002277062039651529 does not exist.

Stack Trace:
java.io.FileNotFoundException: File /grid/0/hudson/hudson-slave/workspace/Hadoop-Mapreduce-trunk/trunk/build/test/data/destdat/7002277062039651529 does not exist.
	at org.apache.hadoop.fs.RawLocalFileSystem.getFileStatus(RawLocalFileSystem.java:424)
	at org.apache.hadoop.fs.FilterFileSystem.getFileStatus(FilterFileSystem.java:311)
	at org.apache.hadoop.tools.TestCopyFiles.checkFiles(TestCopyFiles.java:169)
	at org.apache.hadoop.tools.TestCopyFiles.checkFiles(TestCopyFiles.java:159)
	at org.apache.hadoop.tools.TestCopyFiles.__CLR3_0_2tkhgbvwjq(TestCopyFiles.java:1043)
	at org.apache.hadoop.tools.TestCopyFiles.testDeleteLocal(TestCopyFiles.java:1024)


FAILED:  org.apache.hadoop.tools.TestCopyFiles.testGlobbing

Error Message:
File does not exist: /destdat/two/two/4011865914815069203

Stack Trace:
java.io.FileNotFoundException: File does not exist: /destdat/two/two/4011865914815069203
	at org.apache.hadoop.hdfs.DistributedFileSystem.getFileStatus(DistributedFileSystem.java:745)
	at org.apache.hadoop.tools.TestCopyFiles.checkFiles(TestCopyFiles.java:169)
	at org.apache.hadoop.tools.TestCopyFiles.checkFiles(TestCopyFiles.java:159)
	at org.apache.hadoop.tools.TestCopyFiles.__CLR3_0_23k01ovwke(TestCopyFiles.java:1072)
	at org.apache.hadoop.tools.TestCopyFiles.testGlobbing(TestCopyFiles.java:1057)




Mime
View raw message