hadoop-mapreduce-dev mailing list archives

Site index · List index
Message view « Date » · « Thread »
Top « Date » · « Thread »
From Apache Jenkins Server <hud...@hudson.apache.org>
Subject Hadoop-Mapreduce-trunk - Build # 657 - Failure
Date Fri, 22 Apr 2011 14:45:23 GMT
See https://builds.apache.org/hudson/job/Hadoop-Mapreduce-trunk/657/

###################################################################################
########################## LAST 60 LINES OF THE CONSOLE ###########################
[...truncated 191439 lines...]
    [junit]    0.8:96530
    [junit]    0.85:96549
    [junit]    0.9:96658
    [junit]    0.95:96670
    [junit] Failed Reduce CDF --------
    [junit] 0: -9223372036854775808--9223372036854775807
    [junit] map attempts to success -- 0.6567164179104478, 0.3283582089552239, 0.014925373134328358, 
    [junit] ===============
    [junit] 2011-04-22 14:41:42,996 WARN  rumen.ZombieJob (ZombieJob.java:sanitizeLoggedTask(318)) - Task task_200904211745_0004_r_000025 has nulll TaskStatus
    [junit] 2011-04-22 14:41:42,996 WARN  rumen.ZombieJob (ZombieJob.java:sanitizeLoggedTask(318)) - Task task_200904211745_0004_r_000028 has nulll TaskStatus
    [junit] 2011-04-22 14:41:42,997 WARN  rumen.ZombieJob (ZombieJob.java:sanitizeLoggedTask(318)) - Task task_200904211745_0004_r_000029 has nulll TaskStatus
    [junit] 2011-04-22 14:41:42,997 WARN  rumen.ZombieJob (ZombieJob.java:sanitizeLoggedTask(318)) - Task task_200904211745_0004_r_000030 has nulll TaskStatus
    [junit] 2011-04-22 14:41:42,997 WARN  rumen.ZombieJob (ZombieJob.java:sanitizeLoggedTask(318)) - Task task_200904211745_0004_r_000031 has nulll TaskStatus
    [junit] 2011-04-22 14:41:42,998 WARN  rumen.ZombieJob (ZombieJob.java:sanitizeLoggedTask(318)) - Task task_200904211745_0004_r_000032 has nulll TaskStatus
    [junit] 2011-04-22 14:41:42,998 WARN  rumen.ZombieJob (ZombieJob.java:sanitizeLoggedTask(318)) - Task task_200904211745_0004_r_000033 has nulll TaskStatus
    [junit] 2011-04-22 14:41:42,998 WARN  rumen.ZombieJob (ZombieJob.java:sanitizeLoggedTask(318)) - Task task_200904211745_0004_r_000034 has nulll TaskStatus
    [junit] 2011-04-22 14:41:42,999 WARN  rumen.ZombieJob (ZombieJob.java:sanitizeLoggedTask(318)) - Task task_200904211745_0004_r_000035 has nulll TaskStatus
    [junit] 2011-04-22 14:41:42,999 WARN  rumen.ZombieJob (ZombieJob.java:sanitizeLoggedTask(318)) - Task task_200904211745_0004_r_000036 has nulll TaskStatus
    [junit] 2011-04-22 14:41:43,000 WARN  rumen.ZombieJob (ZombieJob.java:sanitizeLoggedTask(318)) - Task task_200904211745_0004_r_000037 has nulll TaskStatus
    [junit] 2011-04-22 14:41:43,000 WARN  rumen.ZombieJob (ZombieJob.java:sanitizeLoggedTask(318)) - Task task_200904211745_0004_r_000038 has nulll TaskStatus
    [junit] 2011-04-22 14:41:43,000 WARN  rumen.ZombieJob (ZombieJob.java:sanitizeLoggedTask(318)) - Task task_200904211745_0004_r_000039 has nulll TaskStatus
    [junit] 2011-04-22 14:41:43,001 WARN  rumen.ZombieJob (ZombieJob.java:sanitizeLoggedTask(318)) - Task task_200904211745_0004_r_000040 has nulll TaskStatus
    [junit] 2011-04-22 14:41:43,001 WARN  rumen.ZombieJob (ZombieJob.java:sanitizeLoggedTask(318)) - Task task_200904211745_0004_r_000041 has nulll TaskStatus
    [junit] 2011-04-22 14:41:43,002 WARN  rumen.ZombieJob (ZombieJob.java:sanitizeLoggedTask(318)) - Task task_200904211745_0004_r_000042 has nulll TaskStatus
    [junit] 2011-04-22 14:41:43,002 WARN  rumen.ZombieJob (ZombieJob.java:sanitizeLoggedTask(318)) - Task task_200904211745_0004_r_000043 has nulll TaskStatus
    [junit] 2011-04-22 14:41:43,002 WARN  rumen.ZombieJob (ZombieJob.java:sanitizeLoggedTask(318)) - Task task_200904211745_0004_r_000044 has nulll TaskStatus
    [junit] 2011-04-22 14:41:43,003 WARN  rumen.ZombieJob (ZombieJob.java:sanitizeLoggedTask(318)) - Task task_200904211745_0004_r_000045 has nulll TaskStatus
    [junit] 2011-04-22 14:41:43,003 WARN  rumen.ZombieJob (ZombieJob.java:sanitizeLoggedTask(318)) - Task task_200904211745_0004_r_000046 has nulll TaskStatus
    [junit] generated failed map runtime distribution
    [junit] 100000: 18592--18592
    [junit]    0.1:18592
    [junit]    0.5:18592
    [junit]    0.9:18592
    [junit] Tests run: 5, Failures: 0, Errors: 0, Time elapsed: 3.078 sec
    [junit] Running org.apache.hadoop.util.TestReflectionUtils
    [junit] Tests run: 1, Failures: 0, Errors: 0, Time elapsed: 0.344 sec
    [junit] Running org.apache.hadoop.util.TestRunJar
    [junit] Creating file/grid/0/hudson/hudson-slave/workspace/Hadoop-Mapreduce-trunk/trunk/build/test/data/out
    [junit] Tests run: 1, Failures: 0, Errors: 0, Time elapsed: 0.302 sec

checkfailure:

run-test-mapred-all-withtestcaseonly:

run-test-mapred:

BUILD FAILED
/grid/0/hudson/hudson-slave/workspace/Hadoop-Mapreduce-trunk/trunk/build.xml:830: Tests failed!

Total time: 97 minutes 23 seconds
[FINDBUGS] Skipping publisher since build result is FAILURE
Recording fingerprints
Archiving artifacts
Recording test results
Publishing Javadoc
Publishing Clover coverage report...
No Clover report will be published due to a Build Failure
Email was triggered for: Failure
Sending email for trigger: Failure



###################################################################################
############################## FAILED TESTS (if any) ##############################
103 tests failed.
REGRESSION:  org.apache.hadoop.cli.TestMRCLI.testAll

Error Message:
One of the tests failed. See the Detailed results to identify the command that failed

Stack Trace:
junit.framework.AssertionFailedError: One of the tests failed. See the Detailed results to identify the command that failed
	at org.apache.hadoop.cli.CLITestHelper.displayResults(CLITestHelper.java:264)
	at org.apache.hadoop.cli.CLITestHelper.tearDown(CLITestHelper.java:126)
	at org.apache.hadoop.cli.TestHDFSCLI.tearDown(TestHDFSCLI.java:81)
	at org.apache.hadoop.cli.TestMRCLI.tearDown(TestMRCLI.java:56)


REGRESSION:  org.apache.hadoop.fs.TestDFSIO.testIOs

Error Message:
chmod: cannot access `/tmp/hadoop-hudson/mapred/staging/hudson1108959780/.staging/job_local_0001': No such file or directory 

Stack Trace:
org.apache.hadoop.util.Shell$ExitCodeException: chmod: cannot access `/tmp/hadoop-hudson/mapred/staging/hudson1108959780/.staging/job_local_0001': No such file or directory

	at org.apache.hadoop.util.Shell.runCommand(Shell.java:261)
	at org.apache.hadoop.util.Shell.run(Shell.java:188)
	at org.apache.hadoop.util.Shell$ShellCommandExecutor.execute(Shell.java:381)
	at org.apache.hadoop.util.Shell.execCommand(Shell.java:467)
	at org.apache.hadoop.util.Shell.execCommand(Shell.java:450)
	at org.apache.hadoop.fs.RawLocalFileSystem.execCommand(RawLocalFileSystem.java:549)
	at org.apache.hadoop.fs.RawLocalFileSystem.setPermission(RawLocalFileSystem.java:540)
	at org.apache.hadoop.fs.FilterFileSystem.setPermission(FilterFileSystem.java:353)
	at org.apache.hadoop.fs.FileSystem.mkdirs(FileSystem.java:428)
	at org.apache.hadoop.mapreduce.JobSubmitter.copyAndConfigureFiles(JobSubmitter.java:166)
	at org.apache.hadoop.mapreduce.JobSubmitter.copyAndConfigureFiles(JobSubmitter.java:283)
	at org.apache.hadoop.mapreduce.JobSubmitter.submitJobInternal(JobSubmitter.java:350)
	at org.apache.hadoop.mapreduce.Job$2.run(Job.java:1037)
	at org.apache.hadoop.mapreduce.Job$2.run(Job.java:1034)
	at java.security.AccessController.doPrivileged(Native Method)
	at javax.security.auth.Subject.doAs(Subject.java:396)
	at org.apache.hadoop.security.UserGroupInformation.doAs(UserGroupInformation.java:1142)
	at org.apache.hadoop.mapreduce.Job.submit(Job.java:1034)
	at org.apache.hadoop.mapred.JobClient.submitJob(JobClient.java:536)
	at org.apache.hadoop.mapred.JobClient.runJob(JobClient.java:781)
	at org.apache.hadoop.fs.TestDFSIO.runIOTest(TestDFSIO.java:340)
	at org.apache.hadoop.fs.TestDFSIO.writeTest(TestDFSIO.java:321)
	at org.apache.hadoop.fs.TestDFSIO.testIOs(TestDFSIO.java:188)
	at org.apache.hadoop.fs.TestDFSIO.__CLR3_0_27nynfmgho(TestDFSIO.java:168)
	at org.apache.hadoop.fs.TestDFSIO.testIOs(TestDFSIO.java:166)


REGRESSION:  org.apache.hadoop.fs.TestFileSystem.testFs

Error Message:
chmod: cannot access `/tmp/hadoop-hudson/mapred/staging/hudson-258353500/.staging/job_local_0001': No such file or directory 

Stack Trace:
org.apache.hadoop.util.Shell$ExitCodeException: chmod: cannot access `/tmp/hadoop-hudson/mapred/staging/hudson-258353500/.staging/job_local_0001': No such file or directory

	at org.apache.hadoop.util.Shell.runCommand(Shell.java:261)
	at org.apache.hadoop.util.Shell.run(Shell.java:188)
	at org.apache.hadoop.util.Shell$ShellCommandExecutor.execute(Shell.java:381)
	at org.apache.hadoop.util.Shell.execCommand(Shell.java:467)
	at org.apache.hadoop.util.Shell.execCommand(Shell.java:450)
	at org.apache.hadoop.fs.RawLocalFileSystem.execCommand(RawLocalFileSystem.java:549)
	at org.apache.hadoop.fs.RawLocalFileSystem.setPermission(RawLocalFileSystem.java:540)
	at org.apache.hadoop.fs.FilterFileSystem.setPermission(FilterFileSystem.java:353)
	at org.apache.hadoop.fs.FileSystem.mkdirs(FileSystem.java:428)
	at org.apache.hadoop.mapreduce.JobSubmitter.copyAndConfigureFiles(JobSubmitter.java:166)
	at org.apache.hadoop.mapreduce.JobSubmitter.copyAndConfigureFiles(JobSubmitter.java:283)
	at org.apache.hadoop.mapreduce.JobSubmitter.submitJobInternal(JobSubmitter.java:350)
	at org.apache.hadoop.mapreduce.Job$2.run(Job.java:1037)
	at org.apache.hadoop.mapreduce.Job$2.run(Job.java:1034)
	at java.security.AccessController.doPrivileged(Native Method)
	at javax.security.auth.Subject.doAs(Subject.java:396)
	at org.apache.hadoop.security.UserGroupInformation.doAs(UserGroupInformation.java:1142)
	at org.apache.hadoop.mapreduce.Job.submit(Job.java:1034)
	at org.apache.hadoop.mapred.JobClient.submitJob(JobClient.java:536)
	at org.apache.hadoop.mapred.JobClient.runJob(JobClient.java:781)
	at org.apache.hadoop.fs.TestFileSystem.writeTest(TestFileSystem.java:237)
	at org.apache.hadoop.fs.TestFileSystem.testFs(TestFileSystem.java:83)
	at org.apache.hadoop.fs.TestFileSystem.__CLR3_0_2jwa3javh3(TestFileSystem.java:69)
	at org.apache.hadoop.fs.TestFileSystem.testFs(TestFileSystem.java:68)


REGRESSION:  org.apache.hadoop.fs.slive.TestSlive.testMRFlow

Error Message:
null

Stack Trace:
junit.framework.AssertionFailedError: 
	at org.apache.hadoop.fs.slive.TestSlive.__CLR3_0_234abe46no(TestSlive.java:409)
	at org.apache.hadoop.fs.slive.TestSlive.testMRFlow(TestSlive.java:405)


REGRESSION:  org.apache.hadoop.mapred.TestCollect.testCollect

Error Message:
chmod: cannot access `/tmp/hadoop-hudson/mapred/staging/hudson876201071/.staging/job_local_0001': No such file or directory 

Stack Trace:
org.apache.hadoop.util.Shell$ExitCodeException: chmod: cannot access `/tmp/hadoop-hudson/mapred/staging/hudson876201071/.staging/job_local_0001': No such file or directory

	at org.apache.hadoop.util.Shell.runCommand(Shell.java:261)
	at org.apache.hadoop.util.Shell.run(Shell.java:188)
	at org.apache.hadoop.util.Shell$ShellCommandExecutor.execute(Shell.java:381)
	at org.apache.hadoop.util.Shell.execCommand(Shell.java:467)
	at org.apache.hadoop.util.Shell.execCommand(Shell.java:450)
	at org.apache.hadoop.fs.RawLocalFileSystem.execCommand(RawLocalFileSystem.java:549)
	at org.apache.hadoop.fs.RawLocalFileSystem.setPermission(RawLocalFileSystem.java:540)
	at org.apache.hadoop.fs.FilterFileSystem.setPermission(FilterFileSystem.java:353)
	at org.apache.hadoop.fs.FileSystem.mkdirs(FileSystem.java:428)
	at org.apache.hadoop.mapreduce.JobSubmitter.copyAndConfigureFiles(JobSubmitter.java:166)
	at org.apache.hadoop.mapreduce.JobSubmitter.copyAndConfigureFiles(JobSubmitter.java:283)
	at org.apache.hadoop.mapreduce.JobSubmitter.submitJobInternal(JobSubmitter.java:350)
	at org.apache.hadoop.mapreduce.Job$2.run(Job.java:1037)
	at org.apache.hadoop.mapreduce.Job$2.run(Job.java:1034)
	at java.security.AccessController.doPrivileged(Native Method)
	at javax.security.auth.Subject.doAs(Subject.java:396)
	at org.apache.hadoop.security.UserGroupInformation.doAs(UserGroupInformation.java:1142)
	at org.apache.hadoop.mapreduce.Job.submit(Job.java:1034)
	at org.apache.hadoop.mapred.JobClient.submitJob(JobClient.java:536)
	at org.apache.hadoop.mapred.JobClient.runJob(JobClient.java:781)
	at org.apache.hadoop.mapred.TestCollect.__CLR3_0_21ivclbuv5(TestCollect.java:133)
	at org.apache.hadoop.mapred.TestCollect.testCollect(TestCollect.java:129)


REGRESSION:  org.apache.hadoop.mapred.TestComparators.testDefaultMRComparator

Error Message:
chmod: cannot access `/tmp/hadoop-hudson/mapred/staging/hudson-1473155953/.staging/job_local_0001': No such file or directory 

Stack Trace:
org.apache.hadoop.util.Shell$ExitCodeException: chmod: cannot access `/tmp/hadoop-hudson/mapred/staging/hudson-1473155953/.staging/job_local_0001': No such file or directory

	at org.apache.hadoop.util.Shell.runCommand(Shell.java:261)
	at org.apache.hadoop.util.Shell.run(Shell.java:188)
	at org.apache.hadoop.util.Shell$ShellCommandExecutor.execute(Shell.java:381)
	at org.apache.hadoop.util.Shell.execCommand(Shell.java:467)
	at org.apache.hadoop.util.Shell.execCommand(Shell.java:450)
	at org.apache.hadoop.fs.RawLocalFileSystem.execCommand(RawLocalFileSystem.java:549)
	at org.apache.hadoop.fs.RawLocalFileSystem.setPermission(RawLocalFileSystem.java:540)
	at org.apache.hadoop.fs.FilterFileSystem.setPermission(FilterFileSystem.java:353)
	at org.apache.hadoop.fs.FileSystem.mkdirs(FileSystem.java:428)
	at org.apache.hadoop.mapreduce.JobSubmitter.copyAndConfigureFiles(JobSubmitter.java:166)
	at org.apache.hadoop.mapreduce.JobSubmitter.copyAndConfigureFiles(JobSubmitter.java:283)
	at org.apache.hadoop.mapreduce.JobSubmitter.submitJobInternal(JobSubmitter.java:350)
	at org.apache.hadoop.mapreduce.Job$2.run(Job.java:1037)
	at org.apache.hadoop.mapreduce.Job$2.run(Job.java:1034)
	at java.security.AccessController.doPrivileged(Native Method)
	at javax.security.auth.Subject.doAs(Subject.java:396)
	at org.apache.hadoop.security.UserGroupInformation.doAs(UserGroupInformation.java:1142)
	at org.apache.hadoop.mapreduce.Job.submit(Job.java:1034)
	at org.apache.hadoop.mapred.JobClient.submitJob(JobClient.java:536)
	at org.apache.hadoop.mapred.TestComparators.__CLR3_0_2x7bh2pwzy(TestComparators.java:345)
	at org.apache.hadoop.mapred.TestComparators.testDefaultMRComparator(TestComparators.java:340)


REGRESSION:  org.apache.hadoop.mapred.TestComparators.testUserMRComparator

Error Message:
chmod: cannot access `/tmp/hadoop-hudson/mapred/staging/hudson2098586950/.staging/job_local_0002': No such file or directory 

Stack Trace:
org.apache.hadoop.util.Shell$ExitCodeException: chmod: cannot access `/tmp/hadoop-hudson/mapred/staging/hudson2098586950/.staging/job_local_0002': No such file or directory

	at org.apache.hadoop.util.Shell.runCommand(Shell.java:261)
	at org.apache.hadoop.util.Shell.run(Shell.java:188)
	at org.apache.hadoop.util.Shell$ShellCommandExecutor.execute(Shell.java:381)
	at org.apache.hadoop.util.Shell.execCommand(Shell.java:467)
	at org.apache.hadoop.util.Shell.execCommand(Shell.java:450)
	at org.apache.hadoop.fs.RawLocalFileSystem.execCommand(RawLocalFileSystem.java:549)
	at org.apache.hadoop.fs.RawLocalFileSystem.setPermission(RawLocalFileSystem.java:540)
	at org.apache.hadoop.fs.FilterFileSystem.setPermission(FilterFileSystem.java:353)
	at org.apache.hadoop.fs.FileSystem.mkdirs(FileSystem.java:428)
	at org.apache.hadoop.mapreduce.JobSubmitter.copyAndConfigureFiles(JobSubmitter.java:166)
	at org.apache.hadoop.mapreduce.JobSubmitter.copyAndConfigureFiles(JobSubmitter.java:283)
	at org.apache.hadoop.mapreduce.JobSubmitter.submitJobInternal(JobSubmitter.java:350)
	at org.apache.hadoop.mapreduce.Job$2.run(Job.java:1037)
	at org.apache.hadoop.mapreduce.Job$2.run(Job.java:1034)
	at java.security.AccessController.doPrivileged(Native Method)
	at javax.security.auth.Subject.doAs(Subject.java:396)
	at org.apache.hadoop.security.UserGroupInformation.doAs(UserGroupInformation.java:1142)
	at org.apache.hadoop.mapreduce.Job.submit(Job.java:1034)
	at org.apache.hadoop.mapred.JobClient.submitJob(JobClient.java:536)
	at org.apache.hadoop.mapred.TestComparators.__CLR3_0_2ljmb1dx0b(TestComparators.java:367)
	at org.apache.hadoop.mapred.TestComparators.testUserMRComparator(TestComparators.java:361)


REGRESSION:  org.apache.hadoop.mapred.TestComparators.testUserValueGroupingComparator

Error Message:
chmod: cannot access `/tmp/hadoop-hudson/mapred/staging/hudson-180121702/.staging/job_local_0003': No such file or directory 

Stack Trace:
org.apache.hadoop.util.Shell$ExitCodeException: chmod: cannot access `/tmp/hadoop-hudson/mapred/staging/hudson-180121702/.staging/job_local_0003': No such file or directory

	at org.apache.hadoop.util.Shell.runCommand(Shell.java:261)
	at org.apache.hadoop.util.Shell.run(Shell.java:188)
	at org.apache.hadoop.util.Shell$ShellCommandExecutor.execute(Shell.java:381)
	at org.apache.hadoop.util.Shell.execCommand(Shell.java:467)
	at org.apache.hadoop.util.Shell.execCommand(Shell.java:450)
	at org.apache.hadoop.fs.RawLocalFileSystem.execCommand(RawLocalFileSystem.java:549)
	at org.apache.hadoop.fs.RawLocalFileSystem.setPermission(RawLocalFileSystem.java:540)
	at org.apache.hadoop.fs.FilterFileSystem.setPermission(FilterFileSystem.java:353)
	at org.apache.hadoop.fs.FileSystem.mkdirs(FileSystem.java:428)
	at org.apache.hadoop.mapreduce.JobSubmitter.copyAndConfigureFiles(JobSubmitter.java:166)
	at org.apache.hadoop.mapreduce.JobSubmitter.copyAndConfigureFiles(JobSubmitter.java:283)
	at org.apache.hadoop.mapreduce.JobSubmitter.submitJobInternal(JobSubmitter.java:350)
	at org.apache.hadoop.mapreduce.Job$2.run(Job.java:1037)
	at org.apache.hadoop.mapreduce.Job$2.run(Job.java:1034)
	at java.security.AccessController.doPrivileged(Native Method)
	at javax.security.auth.Subject.doAs(Subject.java:396)
	at org.apache.hadoop.security.UserGroupInformation.doAs(UserGroupInformation.java:1142)
	at org.apache.hadoop.mapreduce.Job.submit(Job.java:1034)
	at org.apache.hadoop.mapred.JobClient.submitJob(JobClient.java:536)
	at org.apache.hadoop.mapred.TestComparators.__CLR3_0_2rqt6a4x0p(TestComparators.java:390)
	at org.apache.hadoop.mapred.TestComparators.testUserValueGroupingComparator(TestComparators.java:384)


REGRESSION:  org.apache.hadoop.mapred.TestComparators.testAllUserComparators

Error Message:
chmod: cannot access `/tmp/hadoop-hudson/mapred/staging/hudson1825646157/.staging/job_local_0004': No such file or directory 

Stack Trace:
org.apache.hadoop.util.Shell$ExitCodeException: chmod: cannot access `/tmp/hadoop-hudson/mapred/staging/hudson1825646157/.staging/job_local_0004': No such file or directory

	at org.apache.hadoop.util.Shell.runCommand(Shell.java:261)
	at org.apache.hadoop.util.Shell.run(Shell.java:188)
	at org.apache.hadoop.util.Shell$ShellCommandExecutor.execute(Shell.java:381)
	at org.apache.hadoop.util.Shell.execCommand(Shell.java:467)
	at org.apache.hadoop.util.Shell.execCommand(Shell.java:450)
	at org.apache.hadoop.fs.RawLocalFileSystem.execCommand(RawLocalFileSystem.java:549)
	at org.apache.hadoop.fs.RawLocalFileSystem.setPermission(RawLocalFileSystem.java:540)
	at org.apache.hadoop.fs.FilterFileSystem.setPermission(FilterFileSystem.java:353)
	at org.apache.hadoop.fs.FileSystem.mkdirs(FileSystem.java:428)
	at org.apache.hadoop.mapreduce.JobSubmitter.copyAndConfigureFiles(JobSubmitter.java:166)
	at org.apache.hadoop.mapreduce.JobSubmitter.copyAndConfigureFiles(JobSubmitter.java:283)
	at org.apache.hadoop.mapreduce.JobSubmitter.submitJobInternal(JobSubmitter.java:350)
	at org.apache.hadoop.mapreduce.Job$2.run(Job.java:1037)
	at org.apache.hadoop.mapreduce.Job$2.run(Job.java:1034)
	at java.security.AccessController.doPrivileged(Native Method)
	at javax.security.auth.Subject.doAs(Subject.java:396)
	at org.apache.hadoop.security.UserGroupInformation.doAs(UserGroupInformation.java:1142)
	at org.apache.hadoop.mapreduce.Job.submit(Job.java:1034)
	at org.apache.hadoop.mapred.JobClient.submitJob(JobClient.java:536)
	at org.apache.hadoop.mapred.TestComparators.__CLR3_0_2mq9wl2x13(TestComparators.java:416)
	at org.apache.hadoop.mapred.TestComparators.testAllUserComparators(TestComparators.java:409)


REGRESSION:  org.apache.hadoop.mapred.TestFieldSelection.testFieldSelection

Error Message:
chmod: cannot access `/tmp/hadoop-hudson/mapred/staging/hudson219219512/.staging/job_local_0001': No such file or directory 

Stack Trace:
org.apache.hadoop.util.Shell$ExitCodeException: chmod: cannot access `/tmp/hadoop-hudson/mapred/staging/hudson219219512/.staging/job_local_0001': No such file or directory

	at org.apache.hadoop.util.Shell.runCommand(Shell.java:261)
	at org.apache.hadoop.util.Shell.run(Shell.java:188)
	at org.apache.hadoop.util.Shell$ShellCommandExecutor.execute(Shell.java:381)
	at org.apache.hadoop.util.Shell.execCommand(Shell.java:467)
	at org.apache.hadoop.util.Shell.execCommand(Shell.java:450)
	at org.apache.hadoop.fs.RawLocalFileSystem.execCommand(RawLocalFileSystem.java:549)
	at org.apache.hadoop.fs.RawLocalFileSystem.setPermission(RawLocalFileSystem.java:540)
	at org.apache.hadoop.fs.FilterFileSystem.setPermission(FilterFileSystem.java:353)
	at org.apache.hadoop.fs.FileSystem.mkdirs(FileSystem.java:428)
	at org.apache.hadoop.mapreduce.JobSubmitter.copyAndConfigureFiles(JobSubmitter.java:166)
	at org.apache.hadoop.mapreduce.JobSubmitter.copyAndConfigureFiles(JobSubmitter.java:283)
	at org.apache.hadoop.mapreduce.JobSubmitter.submitJobInternal(JobSubmitter.java:350)
	at org.apache.hadoop.mapreduce.Job$2.run(Job.java:1037)
	at org.apache.hadoop.mapreduce.Job$2.run(Job.java:1034)
	at java.security.AccessController.doPrivileged(Native Method)
	at javax.security.auth.Subject.doAs(Subject.java:396)
	at org.apache.hadoop.security.UserGroupInformation.doAs(UserGroupInformation.java:1142)
	at org.apache.hadoop.mapreduce.Job.submit(Job.java:1034)
	at org.apache.hadoop.mapred.JobClient.submitJob(JobClient.java:536)
	at org.apache.hadoop.mapred.JobClient.runJob(JobClient.java:781)
	at org.apache.hadoop.mapred.TestFieldSelection.launch(TestFieldSelection.java:81)
	at org.apache.hadoop.mapred.TestFieldSelection.__CLR3_0_2asm65nkpn(TestFieldSelection.java:39)
	at org.apache.hadoop.mapred.TestFieldSelection.testFieldSelection(TestFieldSelection.java:38)


REGRESSION:  org.apache.hadoop.mapred.TestFileOutputFormat.testCustomFile

Error Message:
chmod: cannot access `/tmp/hadoop-hudson/mapred/staging/hudson346856076/.staging/job_local_0001': No such file or directory 

Stack Trace:
org.apache.hadoop.util.Shell$ExitCodeException: chmod: cannot access `/tmp/hadoop-hudson/mapred/staging/hudson346856076/.staging/job_local_0001': No such file or directory

	at org.apache.hadoop.util.Shell.runCommand(Shell.java:261)
	at org.apache.hadoop.util.Shell.run(Shell.java:188)
	at org.apache.hadoop.util.Shell$ShellCommandExecutor.execute(Shell.java:381)
	at org.apache.hadoop.util.Shell.execCommand(Shell.java:467)
	at org.apache.hadoop.util.Shell.execCommand(Shell.java:450)
	at org.apache.hadoop.fs.RawLocalFileSystem.execCommand(RawLocalFileSystem.java:549)
	at org.apache.hadoop.fs.RawLocalFileSystem.setPermission(RawLocalFileSystem.java:540)
	at org.apache.hadoop.fs.FilterFileSystem.setPermission(FilterFileSystem.java:353)
	at org.apache.hadoop.fs.FileSystem.mkdirs(FileSystem.java:428)
	at org.apache.hadoop.mapreduce.JobSubmitter.copyAndConfigureFiles(JobSubmitter.java:166)
	at org.apache.hadoop.mapreduce.JobSubmitter.copyAndConfigureFiles(JobSubmitter.java:283)
	at org.apache.hadoop.mapreduce.JobSubmitter.submitJobInternal(JobSubmitter.java:350)
	at org.apache.hadoop.mapreduce.Job$2.run(Job.java:1037)
	at org.apache.hadoop.mapreduce.Job$2.run(Job.java:1034)
	at java.security.AccessController.doPrivileged(Native Method)
	at javax.security.auth.Subject.doAs(Subject.java:396)
	at org.apache.hadoop.security.UserGroupInformation.doAs(UserGroupInformation.java:1142)
	at org.apache.hadoop.mapreduce.Job.submit(Job.java:1034)
	at org.apache.hadoop.mapred.JobClient.submitJob(JobClient.java:536)
	at org.apache.hadoop.mapred.TestFileOutputFormat.__CLR3_0_24yakvaqdi(TestFileOutputFormat.java:84)
	at org.apache.hadoop.mapred.TestFileOutputFormat.testCustomFile(TestFileOutputFormat.java:38)


REGRESSION:  org.apache.hadoop.mapred.TestJavaSerialization.testMapReduceJob

Error Message:
chmod: cannot access `/tmp/hadoop-hudson/mapred/staging/hudson1176397404/.staging/job_local_0001': No such file or directory 

Stack Trace:
org.apache.hadoop.util.Shell$ExitCodeException: chmod: cannot access `/tmp/hadoop-hudson/mapred/staging/hudson1176397404/.staging/job_local_0001': No such file or directory

	at org.apache.hadoop.util.Shell.runCommand(Shell.java:261)
	at org.apache.hadoop.util.Shell.run(Shell.java:188)
	at org.apache.hadoop.util.Shell$ShellCommandExecutor.execute(Shell.java:381)
	at org.apache.hadoop.util.Shell.execCommand(Shell.java:467)
	at org.apache.hadoop.util.Shell.execCommand(Shell.java:450)
	at org.apache.hadoop.fs.RawLocalFileSystem.execCommand(RawLocalFileSystem.java:549)
	at org.apache.hadoop.fs.RawLocalFileSystem.setPermission(RawLocalFileSystem.java:540)
	at org.apache.hadoop.fs.FilterFileSystem.setPermission(FilterFileSystem.java:353)
	at org.apache.hadoop.fs.FileSystem.mkdirs(FileSystem.java:428)
	at org.apache.hadoop.mapreduce.JobSubmitter.copyAndConfigureFiles(JobSubmitter.java:166)
	at org.apache.hadoop.mapreduce.JobSubmitter.copyAndConfigureFiles(JobSubmitter.java:283)
	at org.apache.hadoop.mapreduce.JobSubmitter.submitJobInternal(JobSubmitter.java:350)
	at org.apache.hadoop.mapreduce.Job$2.run(Job.java:1037)
	at org.apache.hadoop.mapreduce.Job$2.run(Job.java:1034)
	at java.security.AccessController.doPrivileged(Native Method)
	at javax.security.auth.Subject.doAs(Subject.java:396)
	at org.apache.hadoop.security.UserGroupInformation.doAs(UserGroupInformation.java:1142)
	at org.apache.hadoop.mapreduce.Job.submit(Job.java:1034)
	at org.apache.hadoop.mapred.JobClient.submitJob(JobClient.java:536)
	at org.apache.hadoop.mapred.JobClient.runJob(JobClient.java:781)
	at org.apache.hadoop.mapred.TestJavaSerialization.__CLR3_0_2nmr1skx68(TestJavaSerialization.java:116)
	at org.apache.hadoop.mapred.TestJavaSerialization.testMapReduceJob(TestJavaSerialization.java:91)


REGRESSION:  org.apache.hadoop.mapred.TestJavaSerialization.testWriteToSequencefile

Error Message:
chmod: cannot access `/tmp/hadoop-hudson/mapred/staging/hudson1946466257/.staging/job_local_0002': No such file or directory 

Stack Trace:
org.apache.hadoop.util.Shell$ExitCodeException: chmod: cannot access `/tmp/hadoop-hudson/mapred/staging/hudson1946466257/.staging/job_local_0002': No such file or directory

	at org.apache.hadoop.util.Shell.runCommand(Shell.java:261)
	at org.apache.hadoop.util.Shell.run(Shell.java:188)
	at org.apache.hadoop.util.Shell$ShellCommandExecutor.execute(Shell.java:381)
	at org.apache.hadoop.util.Shell.execCommand(Shell.java:467)
	at org.apache.hadoop.util.Shell.execCommand(Shell.java:450)
	at org.apache.hadoop.fs.RawLocalFileSystem.execCommand(RawLocalFileSystem.java:549)
	at org.apache.hadoop.fs.RawLocalFileSystem.setPermission(RawLocalFileSystem.java:540)
	at org.apache.hadoop.fs.FilterFileSystem.setPermission(FilterFileSystem.java:353)
	at org.apache.hadoop.fs.FileSystem.mkdirs(FileSystem.java:428)
	at org.apache.hadoop.mapreduce.JobSubmitter.copyAndConfigureFiles(JobSubmitter.java:166)
	at org.apache.hadoop.mapreduce.JobSubmitter.copyAndConfigureFiles(JobSubmitter.java:283)
	at org.apache.hadoop.mapreduce.JobSubmitter.submitJobInternal(JobSubmitter.java:350)
	at org.apache.hadoop.mapreduce.Job$2.run(Job.java:1037)
	at org.apache.hadoop.mapreduce.Job$2.run(Job.java:1034)
	at java.security.AccessController.doPrivileged(Native Method)
	at javax.security.auth.Subject.doAs(Subject.java:396)
	at org.apache.hadoop.security.UserGroupInformation.doAs(UserGroupInformation.java:1142)
	at org.apache.hadoop.mapreduce.Job.submit(Job.java:1034)
	at org.apache.hadoop.mapred.JobClient.submitJob(JobClient.java:536)
	at org.apache.hadoop.mapred.JobClient.runJob(JobClient.java:781)
	at org.apache.hadoop.mapred.TestJavaSerialization.__CLR3_0_2l3txox6v(TestJavaSerialization.java:162)
	at org.apache.hadoop.mapred.TestJavaSerialization.testWriteToSequencefile(TestJavaSerialization.java:137)


REGRESSION:  org.apache.hadoop.mapred.TestJobCounters.testOldCounterA

Error Message:
chmod: cannot access `/tmp/hadoop-hudson/mapred/staging/hudson-558186937/.staging/job_local_0001': No such file or directory 

Stack Trace:
org.apache.hadoop.util.Shell$ExitCodeException: chmod: cannot access `/tmp/hadoop-hudson/mapred/staging/hudson-558186937/.staging/job_local_0001': No such file or directory

	at org.apache.hadoop.util.Shell.runCommand(Shell.java:261)
	at org.apache.hadoop.util.Shell.run(Shell.java:188)
	at org.apache.hadoop.util.Shell$ShellCommandExecutor.execute(Shell.java:381)
	at org.apache.hadoop.util.Shell.execCommand(Shell.java:467)
	at org.apache.hadoop.util.Shell.execCommand(Shell.java:450)
	at org.apache.hadoop.fs.RawLocalFileSystem.execCommand(RawLocalFileSystem.java:549)
	at org.apache.hadoop.fs.RawLocalFileSystem.setPermission(RawLocalFileSystem.java:540)
	at org.apache.hadoop.fs.FilterFileSystem.setPermission(FilterFileSystem.java:353)
	at org.apache.hadoop.fs.FileSystem.mkdirs(FileSystem.java:428)
	at org.apache.hadoop.mapreduce.JobSubmitter.copyAndConfigureFiles(JobSubmitter.java:166)
	at org.apache.hadoop.mapreduce.JobSubmitter.copyAndConfigureFiles(JobSubmitter.java:283)
	at org.apache.hadoop.mapreduce.JobSubmitter.submitJobInternal(JobSubmitter.java:350)
	at org.apache.hadoop.mapreduce.Job$2.run(Job.java:1037)
	at org.apache.hadoop.mapreduce.Job$2.run(Job.java:1034)
	at java.security.AccessController.doPrivileged(Native Method)
	at javax.security.auth.Subject.doAs(Subject.java:396)
	at org.apache.hadoop.security.UserGroupInformation.doAs(UserGroupInformation.java:1142)
	at org.apache.hadoop.mapreduce.Job.submit(Job.java:1034)
	at org.apache.hadoop.mapred.JobClient.submitJob(JobClient.java:536)
	at org.apache.hadoop.mapred.JobClient.runJob(JobClient.java:781)
	at org.apache.hadoop.mapred.TestJobCounters.__CLR3_0_25rygblfjq(TestJobCounters.java:180)
	at org.apache.hadoop.mapred.TestJobCounters.testOldCounterA(TestJobCounters.java:171)


REGRESSION:  org.apache.hadoop.mapred.TestJobCounters.testOldCounterB

Error Message:
chmod: cannot access `/tmp/hadoop-hudson/mapred/staging/hudson966014355/.staging/job_local_0002': No such file or directory 

Stack Trace:
org.apache.hadoop.util.Shell$ExitCodeException: chmod: cannot access `/tmp/hadoop-hudson/mapred/staging/hudson966014355/.staging/job_local_0002': No such file or directory

	at org.apache.hadoop.util.Shell.runCommand(Shell.java:261)
	at org.apache.hadoop.util.Shell.run(Shell.java:188)
	at org.apache.hadoop.util.Shell$ShellCommandExecutor.execute(Shell.java:381)
	at org.apache.hadoop.util.Shell.execCommand(Shell.java:467)
	at org.apache.hadoop.util.Shell.execCommand(Shell.java:450)
	at org.apache.hadoop.fs.RawLocalFileSystem.execCommand(RawLocalFileSystem.java:549)
	at org.apache.hadoop.fs.RawLocalFileSystem.setPermission(RawLocalFileSystem.java:540)
	at org.apache.hadoop.fs.FilterFileSystem.setPermission(FilterFileSystem.java:353)
	at org.apache.hadoop.fs.FileSystem.mkdirs(FileSystem.java:428)
	at org.apache.hadoop.mapreduce.JobSubmitter.copyAndConfigureFiles(JobSubmitter.java:166)
	at org.apache.hadoop.mapreduce.JobSubmitter.copyAndConfigureFiles(JobSubmitter.java:283)
	at org.apache.hadoop.mapreduce.JobSubmitter.submitJobInternal(JobSubmitter.java:350)
	at org.apache.hadoop.mapreduce.Job$2.run(Job.java:1037)
	at org.apache.hadoop.mapreduce.Job$2.run(Job.java:1034)
	at java.security.AccessController.doPrivileged(Native Method)
	at javax.security.auth.Subject.doAs(Subject.java:396)
	at org.apache.hadoop.security.UserGroupInformation.doAs(UserGroupInformation.java:1142)
	at org.apache.hadoop.mapreduce.Job.submit(Job.java:1034)
	at org.apache.hadoop.mapred.JobClient.submitJob(JobClient.java:536)
	at org.apache.hadoop.mapred.JobClient.runJob(JobClient.java:781)
	at org.apache.hadoop.mapred.TestJobCounters.__CLR3_0_290yf42fk1(TestJobCounters.java:219)
	at org.apache.hadoop.mapred.TestJobCounters.testOldCounterB(TestJobCounters.java:209)


REGRESSION:  org.apache.hadoop.mapred.TestJobCounters.testOldCounterC

Error Message:
chmod: cannot access `/tmp/hadoop-hudson/mapred/staging/hudson211747241/.staging/job_local_0003': No such file or directory 

Stack Trace:
org.apache.hadoop.util.Shell$ExitCodeException: chmod: cannot access `/tmp/hadoop-hudson/mapred/staging/hudson211747241/.staging/job_local_0003': No such file or directory

	at org.apache.hadoop.util.Shell.runCommand(Shell.java:261)
	at org.apache.hadoop.util.Shell.run(Shell.java:188)
	at org.apache.hadoop.util.Shell$ShellCommandExecutor.execute(Shell.java:381)
	at org.apache.hadoop.util.Shell.execCommand(Shell.java:467)
	at org.apache.hadoop.util.Shell.execCommand(Shell.java:450)
	at org.apache.hadoop.fs.RawLocalFileSystem.execCommand(RawLocalFileSystem.java:549)
	at org.apache.hadoop.fs.RawLocalFileSystem.setPermission(RawLocalFileSystem.java:540)
	at org.apache.hadoop.fs.FilterFileSystem.setPermission(FilterFileSystem.java:353)
	at org.apache.hadoop.fs.FileSystem.mkdirs(FileSystem.java:428)
	at org.apache.hadoop.mapreduce.JobSubmitter.copyAndConfigureFiles(JobSubmitter.java:166)
	at org.apache.hadoop.mapreduce.JobSubmitter.copyAndConfigureFiles(JobSubmitter.java:283)
	at org.apache.hadoop.mapreduce.JobSubmitter.submitJobInternal(JobSubmitter.java:350)
	at org.apache.hadoop.mapreduce.Job$2.run(Job.java:1037)
	at org.apache.hadoop.mapreduce.Job$2.run(Job.java:1034)
	at java.security.AccessController.doPrivileged(Native Method)
	at javax.security.auth.Subject.doAs(Subject.java:396)
	at org.apache.hadoop.security.UserGroupInformation.doAs(UserGroupInformation.java:1142)
	at org.apache.hadoop.mapreduce.Job.submit(Job.java:1034)
	at org.apache.hadoop.mapred.JobClient.submitJob(JobClient.java:536)
	at org.apache.hadoop.mapred.JobClient.runJob(JobClient.java:781)
	at org.apache.hadoop.mapred.TestJobCounters.__CLR3_0_2c9ydwjfkc(TestJobCounters.java:244)
	at org.apache.hadoop.mapred.TestJobCounters.testOldCounterC(TestJobCounters.java:236)


REGRESSION:  org.apache.hadoop.mapred.TestJobCounters.testNewCounterA

Error Message:
chmod: cannot access `/tmp/hadoop-hudson/mapred/staging/hudson-1889350949/.staging/job_local_0004': No such file or directory 

Stack Trace:
org.apache.hadoop.util.Shell$ExitCodeException: chmod: cannot access `/tmp/hadoop-hudson/mapred/staging/hudson-1889350949/.staging/job_local_0004': No such file or directory

	at org.apache.hadoop.util.Shell.runCommand(Shell.java:261)
	at org.apache.hadoop.util.Shell.run(Shell.java:188)
	at org.apache.hadoop.util.Shell$ShellCommandExecutor.execute(Shell.java:381)
	at org.apache.hadoop.util.Shell.execCommand(Shell.java:467)
	at org.apache.hadoop.util.Shell.execCommand(Shell.java:450)
	at org.apache.hadoop.fs.RawLocalFileSystem.execCommand(RawLocalFileSystem.java:549)
	at org.apache.hadoop.fs.RawLocalFileSystem.setPermission(RawLocalFileSystem.java:540)
	at org.apache.hadoop.fs.FilterFileSystem.setPermission(FilterFileSystem.java:353)
	at org.apache.hadoop.fs.FileSystem.mkdirs(FileSystem.java:428)
	at org.apache.hadoop.mapreduce.JobSubmitter.copyAndConfigureFiles(JobSubmitter.java:166)
	at org.apache.hadoop.mapreduce.JobSubmitter.copyAndConfigureFiles(JobSubmitter.java:283)
	at org.apache.hadoop.mapreduce.JobSubmitter.submitJobInternal(JobSubmitter.java:350)
	at org.apache.hadoop.mapreduce.Job$2.run(Job.java:1037)
	at org.apache.hadoop.mapreduce.Job$2.run(Job.java:1034)
	at java.security.AccessController.doPrivileged(Native Method)
	at javax.security.auth.Subject.doAs(Subject.java:396)
	at org.apache.hadoop.security.UserGroupInformation.doAs(UserGroupInformation.java:1142)
	at org.apache.hadoop.mapreduce.Job.submit(Job.java:1034)
	at org.apache.hadoop.mapreduce.Job.waitForCompletion(Job.java:1054)
	at org.apache.hadoop.mapred.TestJobCounters.__CLR3_0_21grq0qfkn(TestJobCounters.java:267)
	at org.apache.hadoop.mapred.TestJobCounters.testNewCounterA(TestJobCounters.java:257)


REGRESSION:  org.apache.hadoop.mapred.TestJobCounters.testNewCounterB

Error Message:
chmod: cannot access `/tmp/hadoop-hudson/mapred/staging/hudson-572793655/.staging/job_local_0005': No such file or directory 

Stack Trace:
org.apache.hadoop.util.Shell$ExitCodeException: chmod: cannot access `/tmp/hadoop-hudson/mapred/staging/hudson-572793655/.staging/job_local_0005': No such file or directory

	at org.apache.hadoop.util.Shell.runCommand(Shell.java:261)
	at org.apache.hadoop.util.Shell.run(Shell.java:188)
	at org.apache.hadoop.util.Shell$ShellCommandExecutor.execute(Shell.java:381)
	at org.apache.hadoop.util.Shell.execCommand(Shell.java:467)
	at org.apache.hadoop.util.Shell.execCommand(Shell.java:450)
	at org.apache.hadoop.fs.RawLocalFileSystem.execCommand(RawLocalFileSystem.java:549)
	at org.apache.hadoop.fs.RawLocalFileSystem.setPermission(RawLocalFileSystem.java:540)
	at org.apache.hadoop.fs.FilterFileSystem.setPermission(FilterFileSystem.java:353)
	at org.apache.hadoop.fs.FileSystem.mkdirs(FileSystem.java:428)
	at org.apache.hadoop.mapreduce.JobSubmitter.copyAndConfigureFiles(JobSubmitter.java:166)
	at org.apache.hadoop.mapreduce.JobSubmitter.copyAndConfigureFiles(JobSubmitter.java:283)
	at org.apache.hadoop.mapreduce.JobSubmitter.submitJobInternal(JobSubmitter.java:350)
	at org.apache.hadoop.mapreduce.Job$2.run(Job.java:1037)
	at org.apache.hadoop.mapreduce.Job$2.run(Job.java:1034)
	at java.security.AccessController.doPrivileged(Native Method)
	at javax.security.auth.Subject.doAs(Subject.java:396)
	at org.apache.hadoop.security.UserGroupInformation.doAs(UserGroupInformation.java:1142)
	at org.apache.hadoop.mapreduce.Job.submit(Job.java:1034)
	at org.apache.hadoop.mapreduce.Job.waitForCompletion(Job.java:1054)
	at org.apache.hadoop.mapred.TestJobCounters.__CLR3_0_24prot7fky(TestJobCounters.java:283)
	at org.apache.hadoop.mapred.TestJobCounters.testNewCounterB(TestJobCounters.java:273)


REGRESSION:  org.apache.hadoop.mapred.TestJobCounters.testNewCounterC

Error Message:
chmod: cannot access `/tmp/hadoop-hudson/mapred/staging/hudson-1688295741/.staging/job_local_0006': No such file or directory 

Stack Trace:
org.apache.hadoop.util.Shell$ExitCodeException: chmod: cannot access `/tmp/hadoop-hudson/mapred/staging/hudson-1688295741/.staging/job_local_0006': No such file or directory

	at org.apache.hadoop.util.Shell.runCommand(Shell.java:261)
	at org.apache.hadoop.util.Shell.run(Shell.java:188)
	at org.apache.hadoop.util.Shell$ShellCommandExecutor.execute(Shell.java:381)
	at org.apache.hadoop.util.Shell.execCommand(Shell.java:467)
	at org.apache.hadoop.util.Shell.execCommand(Shell.java:450)
	at org.apache.hadoop.fs.RawLocalFileSystem.execCommand(RawLocalFileSystem.java:549)
	at org.apache.hadoop.fs.RawLocalFileSystem.setPermission(RawLocalFileSystem.java:540)
	at org.apache.hadoop.fs.FilterFileSystem.setPermission(FilterFileSystem.java:353)
	at org.apache.hadoop.fs.FileSystem.mkdirs(FileSystem.java:428)
	at org.apache.hadoop.mapreduce.JobSubmitter.copyAndConfigureFiles(JobSubmitter.java:166)
	at org.apache.hadoop.mapreduce.JobSubmitter.copyAndConfigureFiles(JobSubmitter.java:283)
	at org.apache.hadoop.mapreduce.JobSubmitter.submitJobInternal(JobSubmitter.java:350)
	at org.apache.hadoop.mapreduce.Job$2.run(Job.java:1037)
	at org.apache.hadoop.mapreduce.Job$2.run(Job.java:1034)
	at java.security.AccessController.doPrivileged(Native Method)
	at javax.security.auth.Subject.doAs(Subject.java:396)
	at org.apache.hadoop.security.UserGroupInformation.doAs(UserGroupInformation.java:1142)
	at org.apache.hadoop.mapreduce.Job.submit(Job.java:1034)
	at org.apache.hadoop.mapreduce.Job.waitForCompletion(Job.java:1054)
	at org.apache.hadoop.mapred.TestJobCounters.__CLR3_0_27yrnlofl9(TestJobCounters.java:299)
	at org.apache.hadoop.mapred.TestJobCounters.testNewCounterC(TestJobCounters.java:289)


REGRESSION:  org.apache.hadoop.mapred.TestLocalMRNotification.testMR

Error Message:
chmod: cannot access `/tmp/hadoop-hudson/mapred/staging/hudson1938831918/.staging/job_local_0001': No such file or directory 

Stack Trace:
org.apache.hadoop.util.Shell$ExitCodeException: chmod: cannot access `/tmp/hadoop-hudson/mapred/staging/hudson1938831918/.staging/job_local_0001': No such file or directory

	at org.apache.hadoop.util.Shell.runCommand(Shell.java:261)
	at org.apache.hadoop.util.Shell.run(Shell.java:188)
	at org.apache.hadoop.util.Shell$ShellCommandExecutor.execute(Shell.java:381)
	at org.apache.hadoop.util.Shell.execCommand(Shell.java:467)
	at org.apache.hadoop.util.Shell.execCommand(Shell.java:450)
	at org.apache.hadoop.fs.RawLocalFileSystem.execCommand(RawLocalFileSystem.java:549)
	at org.apache.hadoop.fs.RawLocalFileSystem.setPermission(RawLocalFileSystem.java:540)
	at org.apache.hadoop.fs.FilterFileSystem.setPermission(FilterFileSystem.java:353)
	at org.apache.hadoop.fs.FileSystem.mkdirs(FileSystem.java:428)
	at org.apache.hadoop.mapreduce.JobSubmitter.copyAndConfigureFiles(JobSubmitter.java:166)
	at org.apache.hadoop.mapreduce.JobSubmitter.copyAndConfigureFiles(JobSubmitter.java:283)
	at org.apache.hadoop.mapreduce.JobSubmitter.submitJobInternal(JobSubmitter.java:350)
	at org.apache.hadoop.mapreduce.Job$2.run(Job.java:1037)
	at org.apache.hadoop.mapreduce.Job$2.run(Job.java:1034)
	at java.security.AccessController.doPrivileged(Native Method)
	at javax.security.auth.Subject.doAs(Subject.java:396)
	at org.apache.hadoop.security.UserGroupInformation.doAs(UserGroupInformation.java:1142)
	at org.apache.hadoop.mapreduce.Job.submit(Job.java:1034)
	at org.apache.hadoop.mapred.JobClient.submitJob(JobClient.java:536)
	at org.apache.hadoop.mapred.JobClient.runJob(JobClient.java:781)
	at org.apache.hadoop.mapred.NotificationTestCase.launchWordCount(NotificationTestCase.java:220)
	at org.apache.hadoop.mapred.NotificationTestCase.__CLR3_0_2ldwkpup4x(NotificationTestCase.java:150)
	at org.apache.hadoop.mapred.NotificationTestCase.testMR(NotificationTestCase.java:149)


REGRESSION:  org.apache.hadoop.mapred.TestMRWithDistributedCache.testLocalJobRunner

Error Message:
chmod: cannot access `/tmp/hadoop-hudson/mapred/staging/hudson-1306042868/.staging/job_local_0001': No such file or directory 

Stack Trace:
org.apache.hadoop.util.Shell$ExitCodeException: chmod: cannot access `/tmp/hadoop-hudson/mapred/staging/hudson-1306042868/.staging/job_local_0001': No such file or directory

	at org.apache.hadoop.util.Shell.runCommand(Shell.java:261)
	at org.apache.hadoop.util.Shell.run(Shell.java:188)
	at org.apache.hadoop.util.Shell$ShellCommandExecutor.execute(Shell.java:381)
	at org.apache.hadoop.util.Shell.execCommand(Shell.java:467)
	at org.apache.hadoop.util.Shell.execCommand(Shell.java:450)
	at org.apache.hadoop.fs.RawLocalFileSystem.execCommand(RawLocalFileSystem.java:549)
	at org.apache.hadoop.fs.RawLocalFileSystem.setPermission(RawLocalFileSystem.java:540)
	at org.apache.hadoop.fs.FilterFileSystem.setPermission(FilterFileSystem.java:353)
	at org.apache.hadoop.fs.FileSystem.mkdirs(FileSystem.java:428)
	at org.apache.hadoop.mapreduce.JobSubmitter.copyAndConfigureFiles(JobSubmitter.java:166)
	at org.apache.hadoop.mapreduce.JobSubmitter.copyAndConfigureFiles(JobSubmitter.java:283)
	at org.apache.hadoop.mapreduce.JobSubmitter.submitJobInternal(JobSubmitter.java:350)
	at org.apache.hadoop.mapreduce.Job$2.run(Job.java:1037)
	at org.apache.hadoop.mapreduce.Job$2.run(Job.java:1034)
	at java.security.AccessController.doPrivileged(Native Method)
	at javax.security.auth.Subject.doAs(Subject.java:396)
	at org.apache.hadoop.security.UserGroupInformation.doAs(UserGroupInformation.java:1142)
	at org.apache.hadoop.mapreduce.Job.submit(Job.java:1034)
	at org.apache.hadoop.mapred.TestMRWithDistributedCache.testWithConf(TestMRWithDistributedCache.java:154)
	at org.apache.hadoop.mapred.TestMRWithDistributedCache.__CLR3_0_2mk2aclukq(TestMRWithDistributedCache.java:163)
	at org.apache.hadoop.mapred.TestMRWithDistributedCache.testLocalJobRunner(TestMRWithDistributedCache.java:159)


REGRESSION:  org.apache.hadoop.mapred.TestMapOutputType.testKeyMismatch

Error Message:
chmod: cannot access `/tmp/hadoop-hudson/mapred/staging/hudson-266393212/.staging/job_local_0001': No such file or directory 

Stack Trace:
org.apache.hadoop.util.Shell$ExitCodeException: chmod: cannot access `/tmp/hadoop-hudson/mapred/staging/hudson-266393212/.staging/job_local_0001': No such file or directory

	at org.apache.hadoop.util.Shell.runCommand(Shell.java:261)
	at org.apache.hadoop.util.Shell.run(Shell.java:188)
	at org.apache.hadoop.util.Shell$ShellCommandExecutor.execute(Shell.java:381)
	at org.apache.hadoop.util.Shell.execCommand(Shell.java:467)
	at org.apache.hadoop.util.Shell.execCommand(Shell.java:450)
	at org.apache.hadoop.fs.RawLocalFileSystem.execCommand(RawLocalFileSystem.java:549)
	at org.apache.hadoop.fs.RawLocalFileSystem.setPermission(RawLocalFileSystem.java:540)
	at org.apache.hadoop.fs.FilterFileSystem.setPermission(FilterFileSystem.java:353)
	at org.apache.hadoop.fs.FileSystem.mkdirs(FileSystem.java:428)
	at org.apache.hadoop.mapreduce.JobSubmitter.copyAndConfigureFiles(JobSubmitter.java:166)
	at org.apache.hadoop.mapreduce.JobSubmitter.copyAndConfigureFiles(JobSubmitter.java:283)
	at org.apache.hadoop.mapreduce.JobSubmitter.submitJobInternal(JobSubmitter.java:350)
	at org.apache.hadoop.mapreduce.Job$2.run(Job.java:1037)
	at org.apache.hadoop.mapreduce.Job$2.run(Job.java:1034)
	at java.security.AccessController.doPrivileged(Native Method)
	at javax.security.auth.Subject.doAs(Subject.java:396)
	at org.apache.hadoop.security.UserGroupInformation.doAs(UserGroupInformation.java:1142)
	at org.apache.hadoop.mapreduce.Job.submit(Job.java:1034)
	at org.apache.hadoop.mapred.JobClient.submitJob(JobClient.java:536)
	at org.apache.hadoop.mapred.TestMapOutputType.__CLR3_0_2mrrh6m7q3(TestMapOutputType.java:116)
	at org.apache.hadoop.mapred.TestMapOutputType.testKeyMismatch(TestMapOutputType.java:109)


REGRESSION:  org.apache.hadoop.mapred.TestMapOutputType.testValueMismatch

Error Message:
chmod: cannot access `/tmp/hadoop-hudson/mapred/staging/hudson91299339/.staging/job_local_0002': No such file or directory 

Stack Trace:
org.apache.hadoop.util.Shell$ExitCodeException: chmod: cannot access `/tmp/hadoop-hudson/mapred/staging/hudson91299339/.staging/job_local_0002': No such file or directory

	at org.apache.hadoop.util.Shell.runCommand(Shell.java:261)
	at org.apache.hadoop.util.Shell.run(Shell.java:188)
	at org.apache.hadoop.util.Shell$ShellCommandExecutor.execute(Shell.java:381)
	at org.apache.hadoop.util.Shell.execCommand(Shell.java:467)
	at org.apache.hadoop.util.Shell.execCommand(Shell.java:450)
	at org.apache.hadoop.fs.RawLocalFileSystem.execCommand(RawLocalFileSystem.java:549)
	at org.apache.hadoop.fs.RawLocalFileSystem.setPermission(RawLocalFileSystem.java:540)
	at org.apache.hadoop.fs.FilterFileSystem.setPermission(FilterFileSystem.java:353)
	at org.apache.hadoop.fs.FileSystem.mkdirs(FileSystem.java:428)
	at org.apache.hadoop.mapreduce.JobSubmitter.copyAndConfigureFiles(JobSubmitter.java:166)
	at org.apache.hadoop.mapreduce.JobSubmitter.copyAndConfigureFiles(JobSubmitter.java:283)
	at org.apache.hadoop.mapreduce.JobSubmitter.submitJobInternal(JobSubmitter.java:350)
	at org.apache.hadoop.mapreduce.Job$2.run(Job.java:1037)
	at org.apache.hadoop.mapreduce.Job$2.run(Job.java:1034)
	at java.security.AccessController.doPrivileged(Native Method)
	at javax.security.auth.Subject.doAs(Subject.java:396)
	at org.apache.hadoop.security.UserGroupInformation.doAs(UserGroupInformation.java:1142)
	at org.apache.hadoop.mapreduce.Job.submit(Job.java:1034)
	at org.apache.hadoop.mapred.JobClient.submitJob(JobClient.java:536)
	at org.apache.hadoop.mapred.TestMapOutputType.__CLR3_0_2a8ghw47qg(TestMapOutputType.java:133)
	at org.apache.hadoop.mapred.TestMapOutputType.testValueMismatch(TestMapOutputType.java:126)


REGRESSION:  org.apache.hadoop.mapred.TestMapOutputType.testNoMismatch

Error Message:
chmod: cannot access `/tmp/hadoop-hudson/mapred/staging/hudson-1243579010/.staging/job_local_0003': No such file or directory 

Stack Trace:
org.apache.hadoop.util.Shell$ExitCodeException: chmod: cannot access `/tmp/hadoop-hudson/mapred/staging/hudson-1243579010/.staging/job_local_0003': No such file or directory

	at org.apache.hadoop.util.Shell.runCommand(Shell.java:261)
	at org.apache.hadoop.util.Shell.run(Shell.java:188)
	at org.apache.hadoop.util.Shell$ShellCommandExecutor.execute(Shell.java:381)
	at org.apache.hadoop.util.Shell.execCommand(Shell.java:467)
	at org.apache.hadoop.util.Shell.execCommand(Shell.java:450)
	at org.apache.hadoop.fs.RawLocalFileSystem.execCommand(RawLocalFileSystem.java:549)
	at org.apache.hadoop.fs.RawLocalFileSystem.setPermission(RawLocalFileSystem.java:540)
	at org.apache.hadoop.fs.FilterFileSystem.setPermission(FilterFileSystem.java:353)
	at org.apache.hadoop.fs.FileSystem.mkdirs(FileSystem.java:428)
	at org.apache.hadoop.mapreduce.JobSubmitter.copyAndConfigureFiles(JobSubmitter.java:166)
	at org.apache.hadoop.mapreduce.JobSubmitter.copyAndConfigureFiles(JobSubmitter.java:283)
	at org.apache.hadoop.mapreduce.JobSubmitter.submitJobInternal(JobSubmitter.java:350)
	at org.apache.hadoop.mapreduce.Job$2.run(Job.java:1037)
	at org.apache.hadoop.mapreduce.Job$2.run(Job.java:1034)
	at java.security.AccessController.doPrivileged(Native Method)
	at javax.security.auth.Subject.doAs(Subject.java:396)
	at org.apache.hadoop.security.UserGroupInformation.doAs(UserGroupInformation.java:1142)
	at org.apache.hadoop.mapreduce.Job.submit(Job.java:1034)
	at org.apache.hadoop.mapred.JobClient.submitJob(JobClient.java:536)
	at org.apache.hadoop.mapred.TestMapOutputType.__CLR3_0_2wob207qt(TestMapOutputType.java:150)
	at org.apache.hadoop.mapred.TestMapOutputType.testNoMismatch(TestMapOutputType.java:143)


REGRESSION:  org.apache.hadoop.mapred.TestMapRed.testMapred

Error Message:
chmod: cannot access `/tmp/hadoop-hudson/mapred/staging/hudson1139690320/.staging/job_local_0001': No such file or directory 

Stack Trace:
org.apache.hadoop.util.Shell$ExitCodeException: chmod: cannot access `/tmp/hadoop-hudson/mapred/staging/hudson1139690320/.staging/job_local_0001': No such file or directory

	at org.apache.hadoop.util.Shell.runCommand(Shell.java:261)
	at org.apache.hadoop.util.Shell.run(Shell.java:188)
	at org.apache.hadoop.util.Shell$ShellCommandExecutor.execute(Shell.java:381)
	at org.apache.hadoop.util.Shell.execCommand(Shell.java:467)
	at org.apache.hadoop.util.Shell.execCommand(Shell.java:450)
	at org.apache.hadoop.fs.RawLocalFileSystem.execCommand(RawLocalFileSystem.java:549)
	at org.apache.hadoop.fs.RawLocalFileSystem.setPermission(RawLocalFileSystem.java:540)
	at org.apache.hadoop.fs.FilterFileSystem.setPermission(FilterFileSystem.java:353)
	at org.apache.hadoop.fs.FileSystem.mkdirs(FileSystem.java:428)
	at org.apache.hadoop.mapreduce.JobSubmitter.copyAndConfigureFiles(JobSubmitter.java:166)
	at org.apache.hadoop.mapreduce.JobSubmitter.copyAndConfigureFiles(JobSubmitter.java:283)
	at org.apache.hadoop.mapreduce.JobSubmitter.submitJobInternal(JobSubmitter.java:350)
	at org.apache.hadoop.mapreduce.Job$2.run(Job.java:1037)
	at org.apache.hadoop.mapreduce.Job$2.run(Job.java:1034)
	at java.security.AccessController.doPrivileged(Native Method)
	at javax.security.auth.Subject.doAs(Subject.java:396)
	at org.apache.hadoop.security.UserGroupInformation.doAs(UserGroupInformation.java:1142)
	at org.apache.hadoop.mapreduce.Job.submit(Job.java:1034)
	at org.apache.hadoop.mapred.JobClient.submitJob(JobClient.java:536)
	at org.apache.hadoop.mapred.JobClient.runJob(JobClient.java:781)
	at org.apache.hadoop.mapred.TestMapRed.launch(TestMapRed.java:522)
	at org.apache.hadoop.mapred.TestMapRed.__CLR3_0_2vmf1hqxgw(TestMapRed.java:260)
	at org.apache.hadoop.mapred.TestMapRed.testMapred(TestMapRed.java:259)


REGRESSION:  org.apache.hadoop.mapred.TestMapRed.testNullKeys

Error Message:
chmod: cannot access `/tmp/hadoop-hudson/mapred/staging/hudson833373252/.staging/job_local_0002': No such file or directory 

Stack Trace:
org.apache.hadoop.util.Shell$ExitCodeException: chmod: cannot access `/tmp/hadoop-hudson/mapred/staging/hudson833373252/.staging/job_local_0002': No such file or directory

	at org.apache.hadoop.util.Shell.runCommand(Shell.java:261)
	at org.apache.hadoop.util.Shell.run(Shell.java:188)
	at org.apache.hadoop.util.Shell$ShellCommandExecutor.execute(Shell.java:381)
	at org.apache.hadoop.util.Shell.execCommand(Shell.java:467)
	at org.apache.hadoop.util.Shell.execCommand(Shell.java:450)
	at org.apache.hadoop.fs.RawLocalFileSystem.execCommand(RawLocalFileSystem.java:549)
	at org.apache.hadoop.fs.RawLocalFileSystem.setPermission(RawLocalFileSystem.java:540)
	at org.apache.hadoop.fs.FilterFileSystem.setPermission(FilterFileSystem.java:353)
	at org.apache.hadoop.fs.FileSystem.mkdirs(FileSystem.java:428)
	at org.apache.hadoop.mapreduce.JobSubmitter.copyAndConfigureFiles(JobSubmitter.java:166)
	at org.apache.hadoop.mapreduce.JobSubmitter.copyAndConfigureFiles(JobSubmitter.java:283)
	at org.apache.hadoop.mapreduce.JobSubmitter.submitJobInternal(JobSubmitter.java:350)
	at org.apache.hadoop.mapreduce.Job$2.run(Job.java:1037)
	at org.apache.hadoop.mapreduce.Job$2.run(Job.java:1034)
	at java.security.AccessController.doPrivileged(Native Method)
	at javax.security.auth.Subject.doAs(Subject.java:396)
	at org.apache.hadoop.security.UserGroupInformation.doAs(UserGroupInformation.java:1142)
	at org.apache.hadoop.mapreduce.Job.submit(Job.java:1034)
	at org.apache.hadoop.mapred.JobClient.submitJob(JobClient.java:536)
	at org.apache.hadoop.mapred.JobClient.runJob(JobClient.java:781)
	at org.apache.hadoop.mapred.TestMapRed.__CLR3_0_2i5a2rwxhn(TestMapRed.java:355)
	at org.apache.hadoop.mapred.TestMapRed.testNullKeys(TestMapRed.java:324)


REGRESSION:  org.apache.hadoop.mapred.TestMapRed.testCompression

Error Message:
chmod: cannot access `/tmp/hadoop-hudson/mapred/staging/hudson376447353/.staging/job_local_0003': No such file or directory 

Stack Trace:
org.apache.hadoop.util.Shell$ExitCodeException: chmod: cannot access `/tmp/hadoop-hudson/mapred/staging/hudson376447353/.staging/job_local_0003': No such file or directory

	at org.apache.hadoop.util.Shell.runCommand(Shell.java:261)
	at org.apache.hadoop.util.Shell.run(Shell.java:188)
	at org.apache.hadoop.util.Shell$ShellCommandExecutor.execute(Shell.java:381)
	at org.apache.hadoop.util.Shell.execCommand(Shell.java:467)
	at org.apache.hadoop.util.Shell.execCommand(Shell.java:450)
	at org.apache.hadoop.fs.RawLocalFileSystem.execCommand(RawLocalFileSystem.java:549)
	at org.apache.hadoop.fs.RawLocalFileSystem.setPermission(RawLocalFileSystem.java:540)
	at org.apache.hadoop.fs.FilterFileSystem.setPermission(FilterFileSystem.java:353)
	at org.apache.hadoop.fs.FileSystem.mkdirs(FileSystem.java:428)
	at org.apache.hadoop.mapreduce.JobSubmitter.copyAndConfigureFiles(JobSubmitter.java:166)
	at org.apache.hadoop.mapreduce.JobSubmitter.copyAndConfigureFiles(JobSubmitter.java:283)
	at org.apache.hadoop.mapreduce.JobSubmitter.submitJobInternal(JobSubmitter.java:350)
	at org.apache.hadoop.mapreduce.Job$2.run(Job.java:1037)
	at org.apache.hadoop.mapreduce.Job$2.run(Job.java:1034)
	at java.security.AccessController.doPrivileged(Native Method)
	at javax.security.auth.Subject.doAs(Subject.java:396)
	at org.apache.hadoop.security.UserGroupInformation.doAs(UserGroupInformation.java:1142)
	at org.apache.hadoop.mapreduce.Job.submit(Job.java:1034)
	at org.apache.hadoop.mapred.JobClient.submitJob(JobClient.java:536)
	at org.apache.hadoop.mapred.JobClient.runJob(JobClient.java:781)
	at org.apache.hadoop.mapred.TestMapRed.checkCompression(TestMapRed.java:403)
	at org.apache.hadoop.mapred.TestMapRed.__CLR3_0_2rawc05xjw(TestMapRed.java:426)
	at org.apache.hadoop.mapred.TestMapRed.testCompression(TestMapRed.java:421)


REGRESSION:  org.apache.hadoop.mapred.TestMapRed.testSmallInput

Error Message:
Threw exception:org.apache.hadoop.util.Shell$ExitCodeException: chmod: cannot access `/tmp/hadoop-hudson/mapred/staging/hudson1354076236/.staging/job_local_0004': No such file or directory 

Stack Trace:
junit.framework.AssertionFailedError: Threw exception:org.apache.hadoop.util.Shell$ExitCodeException: chmod: cannot access `/tmp/hadoop-hudson/mapred/staging/hudson1354076236/.staging/job_local_0004': No such file or directory


	at org.apache.hadoop.mapred.TestMapRed.runJob(TestMapRed.java:765)
	at org.apache.hadoop.mapred.TestMapRed.__CLR3_0_29c506cxp1(TestMapRed.java:715)
	at org.apache.hadoop.mapred.TestMapRed.testSmallInput(TestMapRed.java:714)


REGRESSION:  org.apache.hadoop.mapred.TestMapRed.testBiggerInput

Error Message:
Threw exception:org.apache.hadoop.util.Shell$ExitCodeException: chmod: cannot access `/tmp/hadoop-hudson/mapred/staging/hudson-115107270/.staging/job_local_0005': No such file or directory 

Stack Trace:
junit.framework.AssertionFailedError: Threw exception:org.apache.hadoop.util.Shell$ExitCodeException: chmod: cannot access `/tmp/hadoop-hudson/mapred/staging/hudson-115107270/.staging/job_local_0005': No such file or directory


	at org.apache.hadoop.mapred.TestMapRed.runJob(TestMapRed.java:765)
	at org.apache.hadoop.mapred.TestMapRed.__CLR3_0_22j0llhxp3(TestMapRed.java:720)
	at org.apache.hadoop.mapred.TestMapRed.testBiggerInput(TestMapRed.java:719)


REGRESSION:  org.apache.hadoop.mapred.TestTaskCommit.testCommitFail

Error Message:
chmod: cannot access `/tmp/hadoop-hudson/mapred/staging/hudson-737900748/.staging/job_local_0001': No such file or directory 

Stack Trace:
org.apache.hadoop.util.Shell$ExitCodeException: chmod: cannot access `/tmp/hadoop-hudson/mapred/staging/hudson-737900748/.staging/job_local_0001': No such file or directory

	at org.apache.hadoop.util.Shell.runCommand(Shell.java:261)
	at org.apache.hadoop.util.Shell.run(Shell.java:188)
	at org.apache.hadoop.util.Shell$ShellCommandExecutor.execute(Shell.java:381)
	at org.apache.hadoop.util.Shell.execCommand(Shell.java:467)
	at org.apache.hadoop.util.Shell.execCommand(Shell.java:450)
	at org.apache.hadoop.fs.RawLocalFileSystem.execCommand(RawLocalFileSystem.java:549)
	at org.apache.hadoop.fs.RawLocalFileSystem.setPermission(RawLocalFileSystem.java:540)
	at org.apache.hadoop.fs.FilterFileSystem.setPermission(FilterFileSystem.java:353)
	at org.apache.hadoop.fs.FileSystem.mkdirs(FileSystem.java:428)
	at org.apache.hadoop.mapreduce.JobSubmitter.copyAndConfigureFiles(JobSubmitter.java:166)
	at org.apache.hadoop.mapreduce.JobSubmitter.copyAndConfigureFiles(JobSubmitter.java:283)
	at org.apache.hadoop.mapreduce.JobSubmitter.submitJobInternal(JobSubmitter.java:350)
	at org.apache.hadoop.mapreduce.Job$2.run(Job.java:1037)
	at org.apache.hadoop.mapreduce.Job$2.run(Job.java:1034)
	at java.security.AccessController.doPrivileged(Native Method)
	at javax.security.auth.Subject.doAs(Subject.java:396)
	at org.apache.hadoop.security.UserGroupInformation.doAs(UserGroupInformation.java:1142)
	at org.apache.hadoop.mapreduce.Job.submit(Job.java:1034)
	at org.apache.hadoop.mapred.JobClient.submitJob(JobClient.java:536)
	at org.apache.hadoop.mapred.UtilsForTests.runJob(UtilsForTests.java:587)
	at org.apache.hadoop.mapred.TestTaskCommit.__CLR3_0_222imwihkm(TestTaskCommit.java:91)
	at org.apache.hadoop.mapred.TestTaskCommit.testCommitFail(TestTaskCommit.java:85)


REGRESSION:  org.apache.hadoop.mapred.TestUserDefinedCounters.testMapReduceJob

Error Message:
chmod: cannot access `/tmp/hadoop-hudson/mapred/staging/hudson-1740601489/.staging/job_local_0001': No such file or directory 

Stack Trace:
org.apache.hadoop.util.Shell$ExitCodeException: chmod: cannot access `/tmp/hadoop-hudson/mapred/staging/hudson-1740601489/.staging/job_local_0001': No such file or directory

	at org.apache.hadoop.util.Shell.runCommand(Shell.java:261)
	at org.apache.hadoop.util.Shell.run(Shell.java:188)
	at org.apache.hadoop.util.Shell$ShellCommandExecutor.execute(Shell.java:381)
	at org.apache.hadoop.util.Shell.execCommand(Shell.java:467)
	at org.apache.hadoop.util.Shell.execCommand(Shell.java:450)
	at org.apache.hadoop.fs.RawLocalFileSystem.execCommand(RawLocalFileSystem.java:549)
	at org.apache.hadoop.fs.RawLocalFileSystem.setPermission(RawLocalFileSystem.java:540)
	at org.apache.hadoop.fs.FilterFileSystem.setPermission(FilterFileSystem.java:353)
	at org.apache.hadoop.fs.FileSystem.mkdirs(FileSystem.java:428)
	at org.apache.hadoop.mapreduce.JobSubmitter.copyAndConfigureFiles(JobSubmitter.java:166)
	at org.apache.hadoop.mapreduce.JobSubmitter.copyAndConfigureFiles(JobSubmitter.java:283)
	at org.apache.hadoop.mapreduce.JobSubmitter.submitJobInternal(JobSubmitter.java:350)
	at org.apache.hadoop.mapreduce.Job$2.run(Job.java:1037)
	at org.apache.hadoop.mapreduce.Job$2.run(Job.java:1034)
	at java.security.AccessController.doPrivileged(Native Method)
	at javax.security.auth.Subject.doAs(Subject.java:396)
	at org.apache.hadoop.security.UserGroupInformation.doAs(UserGroupInformation.java:1142)
	at org.apache.hadoop.mapreduce.Job.submit(Job.java:1034)
	at org.apache.hadoop.mapred.JobClient.submitJob(JobClient.java:536)
	at org.apache.hadoop.mapred.JobClient.runJob(JobClient.java:781)
	at org.apache.hadoop.mapred.TestUserDefinedCounters.__CLR3_0_2nmr1ska2r(TestUserDefinedCounters.java:101)
	at org.apache.hadoop.mapred.TestUserDefinedCounters.testMapReduceJob(TestUserDefinedCounters.java:77)


REGRESSION:  org.apache.hadoop.mapred.jobcontrol.TestLocalJobControl.testLocalJobControlDataCopy

Error Message:
Some jobs failed expected:<0> but was:<4>

Stack Trace:
junit.framework.AssertionFailedError: Some jobs failed expected:<0> but was:<4>
	at org.apache.hadoop.mapred.jobcontrol.TestLocalJobControl.__CLR3_0_22dofof9pc(TestLocalJobControl.java:131)
	at org.apache.hadoop.mapred.jobcontrol.TestLocalJobControl.testLocalJobControlDataCopy(TestLocalJobControl.java:62)


REGRESSION:  org.apache.hadoop.mapred.join.TestDatamerge.testSimpleInnerJoin

Error Message:
chmod: cannot access `/tmp/hadoop-hudson/mapred/staging/hudson-1498655186/.staging/job_local_0001': No such file or directory 

Stack Trace:
org.apache.hadoop.util.Shell$ExitCodeException: chmod: cannot access `/tmp/hadoop-hudson/mapred/staging/hudson-1498655186/.staging/job_local_0001': No such file or directory

	at org.apache.hadoop.util.Shell.runCommand(Shell.java:261)
	at org.apache.hadoop.util.Shell.run(Shell.java:188)
	at org.apache.hadoop.util.Shell$ShellCommandExecutor.execute(Shell.java:381)
	at org.apache.hadoop.util.Shell.execCommand(Shell.java:467)
	at org.apache.hadoop.util.Shell.execCommand(Shell.java:450)
	at org.apache.hadoop.fs.RawLocalFileSystem.execCommand(RawLocalFileSystem.java:549)
	at org.apache.hadoop.fs.RawLocalFileSystem.setPermission(RawLocalFileSystem.java:540)
	at org.apache.hadoop.fs.FilterFileSystem.setPermission(FilterFileSystem.java:353)
	at org.apache.hadoop.fs.FileSystem.mkdirs(FileSystem.java:428)
	at org.apache.hadoop.mapreduce.JobSubmitter.copyAndConfigureFiles(JobSubmitter.java:166)
	at org.apache.hadoop.mapreduce.JobSubmitter.copyAndConfigureFiles(JobSubmitter.java:283)
	at org.apache.hadoop.mapreduce.JobSubmitter.submitJobInternal(JobSubmitter.java:350)
	at org.apache.hadoop.mapreduce.Job$2.run(Job.java:1037)
	at org.apache.hadoop.mapreduce.Job$2.run(Job.java:1034)
	at java.security.AccessController.doPrivileged(Native Method)
	at javax.security.auth.Subject.doAs(Subject.java:396)
	at org.apache.hadoop.security.UserGroupInformation.doAs(UserGroupInformation.java:1142)
	at org.apache.hadoop.mapreduce.Job.submit(Job.java:1034)
	at org.apache.hadoop.mapred.JobClient.submitJob(JobClient.java:536)
	at org.apache.hadoop.mapred.JobClient.runJob(JobClient.java:781)
	at org.apache.hadoop.mapred.join.TestDatamerge.joinAs(TestDatamerge.java:245)
	at org.apache.hadoop.mapred.join.TestDatamerge.__CLR3_0_239fxnh7xp(TestDatamerge.java:250)
	at org.apache.hadoop.mapred.join.TestDatamerge.testSimpleInnerJoin(TestDatamerge.java:249)
	at junit.extensions.TestDecorator.basicRun(TestDecorator.java:24)
	at junit.extensions.TestSetup$1.protect(TestSetup.java:23)
	at junit.extensions.TestSetup.run(TestSetup.java:27)


REGRESSION:  org.apache.hadoop.mapred.join.TestDatamerge.testSimpleOuterJoin

Error Message:
chmod: cannot access `/tmp/hadoop-hudson/mapred/staging/hudson-116424300/.staging/job_local_0002': No such file or directory 

Stack Trace:
org.apache.hadoop.util.Shell$ExitCodeException: chmod: cannot access `/tmp/hadoop-hudson/mapred/staging/hudson-116424300/.staging/job_local_0002': No such file or directory

	at org.apache.hadoop.util.Shell.runCommand(Shell.java:261)
	at org.apache.hadoop.util.Shell.run(Shell.java:188)
	at org.apache.hadoop.util.Shell$ShellCommandExecutor.execute(Shell.java:381)
	at org.apache.hadoop.util.Shell.execCommand(Shell.java:467)
	at org.apache.hadoop.util.Shell.execCommand(Shell.java:450)
	at org.apache.hadoop.fs.RawLocalFileSystem.execCommand(RawLocalFileSystem.java:549)
	at org.apache.hadoop.fs.RawLocalFileSystem.setPermission(RawLocalFileSystem.java:540)
	at org.apache.hadoop.fs.FilterFileSystem.setPermission(FilterFileSystem.java:353)
	at org.apache.hadoop.fs.FileSystem.mkdirs(FileSystem.java:428)
	at org.apache.hadoop.mapreduce.JobSubmitter.copyAndConfigureFiles(JobSubmitter.java:166)
	at org.apache.hadoop.mapreduce.JobSubmitter.copyAndConfigureFiles(JobSubmitter.java:283)
	at org.apache.hadoop.mapreduce.JobSubmitter.submitJobInternal(JobSubmitter.java:350)
	at org.apache.hadoop.mapreduce.Job$2.run(Job.java:1037)
	at org.apache.hadoop.mapreduce.Job$2.run(Job.java:1034)
	at java.security.AccessController.doPrivileged(Native Method)
	at javax.security.auth.Subject.doAs(Subject.java:396)
	at org.apache.hadoop.security.UserGroupInformation.doAs(UserGroupInformation.java:1142)
	at org.apache.hadoop.mapreduce.Job.submit(Job.java:1034)
	at org.apache.hadoop.mapred.JobClient.submitJob(JobClient.java:536)
	at org.apache.hadoop.mapred.JobClient.runJob(JobClient.java:781)
	at org.apache.hadoop.mapred.join.TestDatamerge.joinAs(TestDatamerge.java:245)
	at org.apache.hadoop.mapred.join.TestDatamerge.__CLR3_0_2abzcwo7xr(TestDatamerge.java:254)
	at org.apache.hadoop.mapred.join.TestDatamerge.testSimpleOuterJoin(TestDatamerge.java:253)
	at junit.extensions.TestDecorator.basicRun(TestDecorator.java:24)
	at junit.extensions.TestSetup$1.protect(TestSetup.java:23)
	at junit.extensions.TestSetup.run(TestSetup.java:27)


REGRESSION:  org.apache.hadoop.mapred.join.TestDatamerge.testSimpleOverride

Error Message:
chmod: cannot access `/tmp/hadoop-hudson/mapred/staging/hudson-1362893142/.staging/job_local_0003': No such file or directory 

Stack Trace:
org.apache.hadoop.util.Shell$ExitCodeException: chmod: cannot access `/tmp/hadoop-hudson/mapred/staging/hudson-1362893142/.staging/job_local_0003': No such file or directory

	at org.apache.hadoop.util.Shell.runCommand(Shell.java:261)
	at org.apache.hadoop.util.Shell.run(Shell.java:188)
	at org.apache.hadoop.util.Shell$ShellCommandExecutor.execute(Shell.java:381)
	at org.apache.hadoop.util.Shell.execCommand(Shell.java:467)
	at org.apache.hadoop.util.Shell.execCommand(Shell.java:450)
	at org.apache.hadoop.fs.RawLocalFileSystem.execCommand(RawLocalFileSystem.java:549)
	at org.apache.hadoop.fs.RawLocalFileSystem.setPermission(RawLocalFileSystem.java:540)
	at org.apache.hadoop.fs.FilterFileSystem.setPermission(FilterFileSystem.java:353)
	at org.apache.hadoop.fs.FileSystem.mkdirs(FileSystem.java:428)
	at org.apache.hadoop.mapreduce.JobSubmitter.copyAndConfigureFiles(JobSubmitter.java:166)
	at org.apache.hadoop.mapreduce.JobSubmitter.copyAndConfigureFiles(JobSubmitter.java:283)
	at org.apache.hadoop.mapreduce.JobSubmitter.submitJobInternal(JobSubmitter.java:350)
	at org.apache.hadoop.mapreduce.Job$2.run(Job.java:1037)
	at org.apache.hadoop.mapreduce.Job$2.run(Job.java:1034)
	at java.security.AccessController.doPrivileged(Native Method)
	at javax.security.auth.Subject.doAs(Subject.java:396)
	at org.apache.hadoop.security.UserGroupInformation.doAs(UserGroupInformation.java:1142)
	at org.apache.hadoop.mapreduce.Job.submit(Job.java:1034)
	at org.apache.hadoop.mapred.JobClient.submitJob(JobClient.java:536)
	at org.apache.hadoop.mapred.JobClient.runJob(JobClient.java:781)
	at org.apache.hadoop.mapred.join.TestDatamerge.joinAs(TestDatamerge.java:245)
	at org.apache.hadoop.mapred.join.TestDatamerge.__CLR3_0_2a19all7xt(TestDatamerge.java:258)
	at org.apache.hadoop.mapred.join.TestDatamerge.testSimpleOverride(TestDatamerge.java:257)
	at junit.extensions.TestDecorator.basicRun(TestDecorator.java:24)
	at junit.extensions.TestSetup$1.protect(TestSetup.java:23)
	at junit.extensions.TestSetup.run(TestSetup.java:27)


REGRESSION:  org.apache.hadoop.mapred.join.TestDatamerge.testNestedJoin

Error Message:
chmod: cannot access `/tmp/hadoop-hudson/mapred/staging/hudson738237816/.staging/job_local_0004': No such file or directory 

Stack Trace:
org.apache.hadoop.util.Shell$ExitCodeException: chmod: cannot access `/tmp/hadoop-hudson/mapred/staging/hudson738237816/.staging/job_local_0004': No such file or directory

	at org.apache.hadoop.util.Shell.runCommand(Shell.java:261)
	at org.apache.hadoop.util.Shell.run(Shell.java:188)
	at org.apache.hadoop.util.Shell$ShellCommandExecutor.execute(Shell.java:381)
	at org.apache.hadoop.util.Shell.execCommand(Shell.java:467)
	at org.apache.hadoop.util.Shell.execCommand(Shell.java:450)
	at org.apache.hadoop.fs.RawLocalFileSystem.execCommand(RawLocalFileSystem.java:549)
	at org.apache.hadoop.fs.RawLocalFileSystem.setPermission(RawLocalFileSystem.java:540)
	at org.apache.hadoop.fs.FilterFileSystem.setPermission(FilterFileSystem.java:353)
	at org.apache.hadoop.fs.FileSystem.mkdirs(FileSystem.java:428)
	at org.apache.hadoop.mapreduce.JobSubmitter.copyAndConfigureFiles(JobSubmitter.java:166)
	at org.apache.hadoop.mapreduce.JobSubmitter.copyAndConfigureFiles(JobSubmitter.java:283)
	at org.apache.hadoop.mapreduce.JobSubmitter.submitJobInternal(JobSubmitter.java:350)
	at org.apache.hadoop.mapreduce.Job$2.run(Job.java:1037)
	at org.apache.hadoop.mapreduce.Job$2.run(Job.java:1034)
	at java.security.AccessController.doPrivileged(Native Method)
	at javax.security.auth.Subject.doAs(Subject.java:396)
	at org.apache.hadoop.security.UserGroupInformation.doAs(UserGroupInformation.java:1142)
	at org.apache.hadoop.mapreduce.Job.submit(Job.java:1034)
	at org.apache.hadoop.mapred.JobClient.submitJob(JobClient.java:536)
	at org.apache.hadoop.mapred.JobClient.runJob(JobClient.java:781)
	at org.apache.hadoop.mapred.join.TestDatamerge.__CLR3_0_2fiduje7xv(TestDatamerge.java:319)
	at org.apache.hadoop.mapred.join.TestDatamerge.testNestedJoin(TestDatamerge.java:261)
	at junit.extensions.TestDecorator.basicRun(TestDecorator.java:24)
	at junit.extensions.TestSetup$1.protect(TestSetup.java:23)
	at junit.extensions.TestSetup.run(TestSetup.java:27)


REGRESSION:  org.apache.hadoop.mapred.join.TestDatamerge.testEmptyJoin

Error Message:
chmod: cannot access `/tmp/hadoop-hudson/mapred/staging/hudson-1128476228/.staging/job_local_0005': No such file or directory 

Stack Trace:
org.apache.hadoop.util.Shell$ExitCodeException: chmod: cannot access `/tmp/hadoop-hudson/mapred/staging/hudson-1128476228/.staging/job_local_0005': No such file or directory

	at org.apache.hadoop.util.Shell.runCommand(Shell.java:261)
	at org.apache.hadoop.util.Shell.run(Shell.java:188)
	at org.apache.hadoop.util.Shell$ShellCommandExecutor.execute(Shell.java:381)
	at org.apache.hadoop.util.Shell.execCommand(Shell.java:467)
	at org.apache.hadoop.util.Shell.execCommand(Shell.java:450)
	at org.apache.hadoop.fs.RawLocalFileSystem.execCommand(RawLocalFileSystem.java:549)
	at org.apache.hadoop.fs.RawLocalFileSystem.setPermission(RawLocalFileSystem.java:540)
	at org.apache.hadoop.fs.FilterFileSystem.setPermission(FilterFileSystem.java:353)
	at org.apache.hadoop.fs.FileSystem.mkdirs(FileSystem.java:428)
	at org.apache.hadoop.mapreduce.JobSubmitter.copyAndConfigureFiles(JobSubmitter.java:166)
	at org.apache.hadoop.mapreduce.JobSubmitter.copyAndConfigureFiles(JobSubmitter.java:283)
	at org.apache.hadoop.mapreduce.JobSubmitter.submitJobInternal(JobSubmitter.java:350)
	at org.apache.hadoop.mapreduce.Job$2.run(Job.java:1037)
	at org.apache.hadoop.mapreduce.Job$2.run(Job.java:1034)
	at java.security.AccessController.doPrivileged(Native Method)
	at javax.security.auth.Subject.doAs(Subject.java:396)
	at org.apache.hadoop.security.UserGroupInformation.doAs(UserGroupInformation.java:1142)
	at org.apache.hadoop.mapreduce.Job.submit(Job.java:1034)
	at org.apache.hadoop.mapred.JobClient.submitJob(JobClient.java:536)
	at org.apache.hadoop.mapred.JobClient.runJob(JobClient.java:781)
	at org.apache.hadoop.mapred.join.TestDatamerge.__CLR3_0_2f6b0b080f(TestDatamerge.java:367)
	at org.apache.hadoop.mapred.join.TestDatamerge.testEmptyJoin(TestDatamerge.java:353)
	at junit.extensions.TestDecorator.basicRun(TestDecorator.java:24)
	at junit.extensions.TestSetup$1.protect(TestSetup.java:23)
	at junit.extensions.TestSetup.run(TestSetup.java:27)


REGRESSION:  org.apache.hadoop.mapred.lib.TestChainMapReduce.testChain

Error Message:
chmod: cannot access `/tmp/hadoop-hudson/mapred/staging/hudson-1217686523/.staging/job_local_0001': No such file or directory 

Stack Trace:
org.apache.hadoop.util.Shell$ExitCodeException: chmod: cannot access `/tmp/hadoop-hudson/mapred/staging/hudson-1217686523/.staging/job_local_0001': No such file or directory

	at org.apache.hadoop.util.Shell.runCommand(Shell.java:261)
	at org.apache.hadoop.util.Shell.run(Shell.java:188)
	at org.apache.hadoop.util.Shell$ShellCommandExecutor.execute(Shell.java:381)
	at org.apache.hadoop.util.Shell.execCommand(Shell.java:467)
	at org.apache.hadoop.util.Shell.execCommand(Shell.java:450)
	at org.apache.hadoop.fs.RawLocalFileSystem.execCommand(RawLocalFileSystem.java:549)
	at org.apache.hadoop.fs.RawLocalFileSystem.setPermission(RawLocalFileSystem.java:540)
	at org.apache.hadoop.fs.FilterFileSystem.setPermission(FilterFileSystem.java:353)
	at org.apache.hadoop.fs.FileSystem.mkdirs(FileSystem.java:428)
	at org.apache.hadoop.mapreduce.JobSubmitter.copyAndConfigureFiles(JobSubmitter.java:166)
	at org.apache.hadoop.mapreduce.JobSubmitter.copyAndConfigureFiles(JobSubmitter.java:283)
	at org.apache.hadoop.mapreduce.JobSubmitter.submitJobInternal(JobSubmitter.java:350)
	at org.apache.hadoop.mapreduce.Job$2.run(Job.java:1037)
	at org.apache.hadoop.mapreduce.Job$2.run(Job.java:1034)
	at java.security.AccessController.doPrivileged(Native Method)
	at javax.security.auth.Subject.doAs(Subject.java:396)
	at org.apache.hadoop.security.UserGroupInformation.doAs(UserGroupInformation.java:1142)
	at org.apache.hadoop.mapreduce.Job.submit(Job.java:1034)
	at org.apache.hadoop.mapred.JobClient.submitJob(JobClient.java:536)
	at org.apache.hadoop.mapred.lib.TestChainMapReduce.__CLR3_0_2ke5z1yhnx(TestChainMapReduce.java:130)
	at org.apache.hadoop.mapred.lib.TestChainMapReduce.testChain(TestChainMapReduce.java:70)


REGRESSION:  org.apache.hadoop.mapred.lib.TestKeyFieldBasedComparator.testBasicUnixComparator

Error Message:
chmod: cannot access `/tmp/hadoop-hudson/mapred/staging/hudson1407860924/.staging/job_local_0001': No such file or directory 

Stack Trace:
org.apache.hadoop.util.Shell$ExitCodeException: chmod: cannot access `/tmp/hadoop-hudson/mapred/staging/hudson1407860924/.staging/job_local_0001': No such file or directory

	at org.apache.hadoop.util.Shell.runCommand(Shell.java:261)
	at org.apache.hadoop.util.Shell.run(Shell.java:188)
	at org.apache.hadoop.util.Shell$ShellCommandExecutor.execute(Shell.java:381)
	at org.apache.hadoop.util.Shell.execCommand(Shell.java:467)
	at org.apache.hadoop.util.Shell.execCommand(Shell.java:450)
	at org.apache.hadoop.fs.RawLocalFileSystem.execCommand(RawLocalFileSystem.java:549)
	at org.apache.hadoop.fs.RawLocalFileSystem.setPermission(RawLocalFileSystem.java:540)
	at org.apache.hadoop.fs.FilterFileSystem.setPermission(FilterFileSystem.java:353)
	at org.apache.hadoop.fs.FileSystem.mkdirs(FileSystem.java:428)
	at org.apache.hadoop.mapreduce.JobSubmitter.copyAndConfigureFiles(JobSubmitter.java:166)
	at org.apache.hadoop.mapreduce.JobSubmitter.copyAndConfigureFiles(JobSubmitter.java:283)
	at org.apache.hadoop.mapreduce.JobSubmitter.submitJobInternal(JobSubmitter.java:350)
	at org.apache.hadoop.mapreduce.Job$2.run(Job.java:1037)
	at org.apache.hadoop.mapreduce.Job$2.run(Job.java:1034)
	at java.security.AccessController.doPrivileged(Native Method)
	at javax.security.auth.Subject.doAs(Subject.java:396)
	at org.apache.hadoop.security.UserGroupInformation.doAs(UserGroupInformation.java:1142)
	at org.apache.hadoop.mapreduce.Job.submit(Job.java:1034)
	at org.apache.hadoop.mapred.JobClient.submitJob(JobClient.java:536)
	at org.apache.hadoop.mapred.lib.TestKeyFieldBasedComparator.configure(TestKeyFieldBasedComparator.java:88)
	at org.apache.hadoop.mapred.lib.TestKeyFieldBasedComparator.__CLR3_0_2efq8inuxk(TestKeyFieldBasedComparator.java:122)
	at org.apache.hadoop.mapred.lib.TestKeyFieldBasedComparator.testBasicUnixComparator(TestKeyFieldBasedComparator.java:121)


REGRESSION:  org.apache.hadoop.mapred.lib.TestMultipleOutputs.testWithoutCounters

Error Message:
chmod: cannot access `/tmp/hadoop-hudson/mapred/staging/hudson1675085964/.staging/job_local_0001': No such file or directory 

Stack Trace:
org.apache.hadoop.util.Shell$ExitCodeException: chmod: cannot access `/tmp/hadoop-hudson/mapred/staging/hudson1675085964/.staging/job_local_0001': No such file or directory

	at org.apache.hadoop.util.Shell.runCommand(Shell.java:261)
	at org.apache.hadoop.util.Shell.run(Shell.java:188)
	at org.apache.hadoop.util.Shell$ShellCommandExecutor.execute(Shell.java:381)
	at org.apache.hadoop.util.Shell.execCommand(Shell.java:467)
	at org.apache.hadoop.util.Shell.execCommand(Shell.java:450)
	at org.apache.hadoop.fs.RawLocalFileSystem.execCommand(RawLocalFileSystem.java:549)
	at org.apache.hadoop.fs.RawLocalFileSystem.setPermission(RawLocalFileSystem.java:540)
	at org.apache.hadoop.fs.FilterFileSystem.setPermission(FilterFileSystem.java:353)
	at org.apache.hadoop.fs.FileSystem.mkdirs(FileSystem.java:428)
	at org.apache.hadoop.mapreduce.JobSubmitter.copyAndConfigureFiles(JobSubmitter.java:166)
	at org.apache.hadoop.mapreduce.JobSubmitter.copyAndConfigureFiles(JobSubmitter.java:283)
	at org.apache.hadoop.mapreduce.JobSubmitter.submitJobInternal(JobSubmitter.java:350)
	at org.apache.hadoop.mapreduce.Job$2.run(Job.java:1037)
	at org.apache.hadoop.mapreduce.Job$2.run(Job.java:1034)
	at java.security.AccessController.doPrivileged(Native Method)
	at javax.security.auth.Subject.doAs(Subject.java:396)
	at org.apache.hadoop.security.UserGroupInformation.doAs(UserGroupInformation.java:1142)
	at org.apache.hadoop.mapreduce.Job.submit(Job.java:1034)
	at org.apache.hadoop.mapred.JobClient.submitJob(JobClient.java:536)
	at org.apache.hadoop.mapred.lib.TestMultipleOutputs._testMultipleOutputs(TestMultipleOutputs.java:215)
	at org.apache.hadoop.mapred.lib.TestMultipleOutputs.__CLR3_0_27rxkdoh6e(TestMultipleOutputs.java:42)
	at org.apache.hadoop.mapred.lib.TestMultipleOutputs.testWithoutCounters(TestMultipleOutputs.java:41)


REGRESSION:  org.apache.hadoop.mapred.lib.TestMultipleOutputs.testWithCounters

Error Message:
chmod: cannot access `/tmp/hadoop-hudson/mapred/staging/hudson-795572766/.staging/job_local_0002': No such file or directory 

Stack Trace:
org.apache.hadoop.util.Shell$ExitCodeException: chmod: cannot access `/tmp/hadoop-hudson/mapred/staging/hudson-795572766/.staging/job_local_0002': No such file or directory

	at org.apache.hadoop.util.Shell.runCommand(Shell.java:261)
	at org.apache.hadoop.util.Shell.run(Shell.java:188)
	at org.apache.hadoop.util.Shell$ShellCommandExecutor.execute(Shell.java:381)
	at org.apache.hadoop.util.Shell.execCommand(Shell.java:467)
	at org.apache.hadoop.util.Shell.execCommand(Shell.java:450)
	at org.apache.hadoop.fs.RawLocalFileSystem.execCommand(RawLocalFileSystem.java:549)
	at org.apache.hadoop.fs.RawLocalFileSystem.setPermission(RawLocalFileSystem.java:540)
	at org.apache.hadoop.fs.FilterFileSystem.setPermission(FilterFileSystem.java:353)
	at org.apache.hadoop.fs.FileSystem.mkdirs(FileSystem.java:428)
	at org.apache.hadoop.mapreduce.JobSubmitter.copyAndConfigureFiles(JobSubmitter.java:166)
	at org.apache.hadoop.mapreduce.JobSubmitter.copyAndConfigureFiles(JobSubmitter.java:283)
	at org.apache.hadoop.mapreduce.JobSubmitter.submitJobInternal(JobSubmitter.java:350)
	at org.apache.hadoop.mapreduce.Job$2.run(Job.java:1037)
	at org.apache.hadoop.mapreduce.Job$2.run(Job.java:1034)
	at java.security.AccessController.doPrivileged(Native Method)
	at javax.security.auth.Subject.doAs(Subject.java:396)
	at org.apache.hadoop.security.UserGroupInformation.doAs(UserGroupInformation.java:1142)
	at org.apache.hadoop.mapreduce.Job.submit(Job.java:1034)
	at org.apache.hadoop.mapred.JobClient.submitJob(JobClient.java:536)
	at org.apache.hadoop.mapred.lib.TestMultipleOutputs._testMultipleOutputs(TestMultipleOutputs.java:215)
	at org.apache.hadoop.mapred.lib.TestMultipleOutputs.__CLR3_0_2435lo6h6h(TestMultipleOutputs.java:47)
	at org.apache.hadoop.mapred.lib.TestMultipleOutputs.testWithCounters(TestMultipleOutputs.java:46)


REGRESSION:  org.apache.hadoop.mapred.lib.TestMultithreadedMapRunner.testOKRun

Error Message:
chmod: cannot access `/tmp/hadoop-hudson/mapred/staging/hudson462777772/.staging/job_local_0001': No such file or directory 

Stack Trace:
org.apache.hadoop.util.Shell$ExitCodeException: chmod: cannot access `/tmp/hadoop-hudson/mapred/staging/hudson462777772/.staging/job_local_0001': No such file or directory

	at org.apache.hadoop.util.Shell.runCommand(Shell.java:261)
	at org.apache.hadoop.util.Shell.run(Shell.java:188)
	at org.apache.hadoop.util.Shell$ShellCommandExecutor.execute(Shell.java:381)
	at org.apache.hadoop.util.Shell.execCommand(Shell.java:467)
	at org.apache.hadoop.util.Shell.execCommand(Shell.java:450)
	at org.apache.hadoop.fs.RawLocalFileSystem.execCommand(RawLocalFileSystem.java:549)
	at org.apache.hadoop.fs.RawLocalFileSystem.setPermission(RawLocalFileSystem.java:540)
	at org.apache.hadoop.fs.FilterFileSystem.setPermission(FilterFileSystem.java:353)
	at org.apache.hadoop.fs.FileSystem.mkdirs(FileSystem.java:428)
	at org.apache.hadoop.mapreduce.JobSubmitter.copyAndConfigureFiles(JobSubmitter.java:166)
	at org.apache.hadoop.mapreduce.JobSubmitter.copyAndConfigureFiles(JobSubmitter.java:283)
	at org.apache.hadoop.mapreduce.JobSubmitter.submitJobInternal(JobSubmitter.java:350)
	at org.apache.hadoop.mapreduce.Job$2.run(Job.java:1037)
	at org.apache.hadoop.mapreduce.Job$2.run(Job.java:1034)
	at java.security.AccessController.doPrivileged(Native Method)
	at javax.security.auth.Subject.doAs(Subject.java:396)
	at org.apache.hadoop.security.UserGroupInformation.doAs(UserGroupInformation.java:1142)
	at org.apache.hadoop.mapreduce.Job.submit(Job.java:1034)
	at org.apache.hadoop.mapred.JobClient.submitJob(JobClient.java:536)
	at org.apache.hadoop.mapred.lib.TestMultithreadedMapRunner.run(TestMultithreadedMapRunner.java:105)
	at org.apache.hadoop.mapred.lib.TestMultithreadedMapRunner.__CLR3_0_2dhspyc98r(TestMultithreadedMapRunner.java:39)
	at org.apache.hadoop.mapred.lib.TestMultithreadedMapRunner.testOKRun(TestMultithreadedMapRunner.java:38)


REGRESSION:  org.apache.hadoop.mapred.lib.TestMultithreadedMapRunner.testIOExRun

Error Message:
chmod: cannot access `/tmp/hadoop-hudson/mapred/staging/hudson-808588887/.staging/job_local_0002': No such file or directory 

Stack Trace:
org.apache.hadoop.util.Shell$ExitCodeException: chmod: cannot access `/tmp/hadoop-hudson/mapred/staging/hudson-808588887/.staging/job_local_0002': No such file or directory

	at org.apache.hadoop.util.Shell.runCommand(Shell.java:261)
	at org.apache.hadoop.util.Shell.run(Shell.java:188)
	at org.apache.hadoop.util.Shell$ShellCommandExecutor.execute(Shell.java:381)
	at org.apache.hadoop.util.Shell.execCommand(Shell.java:467)
	at org.apache.hadoop.util.Shell.execCommand(Shell.java:450)
	at org.apache.hadoop.fs.RawLocalFileSystem.execCommand(RawLocalFileSystem.java:549)
	at org.apache.hadoop.fs.RawLocalFileSystem.setPermission(RawLocalFileSystem.java:540)
	at org.apache.hadoop.fs.FilterFileSystem.setPermission(FilterFileSystem.java:353)
	at org.apache.hadoop.fs.FileSystem.mkdirs(FileSystem.java:428)
	at org.apache.hadoop.mapreduce.JobSubmitter.copyAndConfigureFiles(JobSubmitter.java:166)
	at org.apache.hadoop.mapreduce.JobSubmitter.copyAndConfigureFiles(JobSubmitter.java:283)
	at org.apache.hadoop.mapreduce.JobSubmitter.submitJobInternal(JobSubmitter.java:350)
	at org.apache.hadoop.mapreduce.Job$2.run(Job.java:1037)
	at org.apache.hadoop.mapreduce.Job$2.run(Job.java:1034)
	at java.security.AccessController.doPrivileged(Native Method)
	at javax.security.auth.Subject.doAs(Subject.java:396)
	at org.apache.hadoop.security.UserGroupInformation.doAs(UserGroupInformation.java:1142)
	at org.apache.hadoop.mapreduce.Job.submit(Job.java:1034)
	at org.apache.hadoop.mapred.JobClient.submitJob(JobClient.java:536)
	at org.apache.hadoop.mapred.lib.TestMultithreadedMapRunner.run(TestMultithreadedMapRunner.java:105)
	at org.apache.hadoop.mapred.lib.TestMultithreadedMapRunner.__CLR3_0_21nnwsn98t(TestMultithreadedMapRunner.java:43)
	at org.apache.hadoop.mapred.lib.TestMultithreadedMapRunner.testIOExRun(TestMultithreadedMapRunner.java:42)


REGRESSION:  org.apache.hadoop.mapred.lib.TestMultithreadedMapRunner.testRuntimeExRun

Error Message:
chmod: cannot access `/tmp/hadoop-hudson/mapred/staging/hudson-813845063/.staging/job_local_0003': No such file or directory 

Stack Trace:
org.apache.hadoop.util.Shell$ExitCodeException: chmod: cannot access `/tmp/hadoop-hudson/mapred/staging/hudson-813845063/.staging/job_local_0003': No such file or directory

	at org.apache.hadoop.util.Shell.runCommand(Shell.java:261)
	at org.apache.hadoop.util.Shell.run(Shell.java:188)
	at org.apache.hadoop.util.Shell$ShellCommandExecutor.execute(Shell.java:381)
	at org.apache.hadoop.util.Shell.execCommand(Shell.java:467)
	at org.apache.hadoop.util.Shell.execCommand(Shell.java:450)
	at org.apache.hadoop.fs.RawLocalFileSystem.execCommand(RawLocalFileSystem.java:549)
	at org.apache.hadoop.fs.RawLocalFileSystem.setPermission(RawLocalFileSystem.java:540)
	at org.apache.hadoop.fs.FilterFileSystem.setPermission(FilterFileSystem.java:353)
	at org.apache.hadoop.fs.FileSystem.mkdirs(FileSystem.java:428)
	at org.apache.hadoop.mapreduce.JobSubmitter.copyAndConfigureFiles(JobSubmitter.java:166)
	at org.apache.hadoop.mapreduce.JobSubmitter.copyAndConfigureFiles(JobSubmitter.java:283)
	at org.apache.hadoop.mapreduce.JobSubmitter.submitJobInternal(JobSubmitter.java:350)
	at org.apache.hadoop.mapreduce.Job$2.run(Job.java:1037)
	at org.apache.hadoop.mapreduce.Job$2.run(Job.java:1034)
	at java.security.AccessController.doPrivileged(Native Method)
	at javax.security.auth.Subject.doAs(Subject.java:396)
	at org.apache.hadoop.security.UserGroupInformation.doAs(UserGroupInformation.java:1142)
	at org.apache.hadoop.mapreduce.Job.submit(Job.java:1034)
	at org.apache.hadoop.mapred.JobClient.submitJob(JobClient.java:536)
	at org.apache.hadoop.mapred.lib.TestMultithreadedMapRunner.run(TestMultithreadedMapRunner.java:105)
	at org.apache.hadoop.mapred.lib.TestMultithreadedMapRunner.__CLR3_0_2zf5zzb98v(TestMultithreadedMapRunner.java:46)
	at org.apache.hadoop.mapred.lib.TestMultithreadedMapRunner.testRuntimeExRun(TestMultithreadedMapRunner.java:45)


REGRESSION:  org.apache.hadoop.mapred.lib.aggregate.TestAggregates.testAggregates

Error Message:
chmod: cannot access `/tmp/hadoop-hudson/mapred/staging/hudson-1579674824/.staging/job_local_0001': No such file or directory 

Stack Trace:
org.apache.hadoop.util.Shell$ExitCodeException: chmod: cannot access `/tmp/hadoop-hudson/mapred/staging/hudson-1579674824/.staging/job_local_0001': No such file or directory

	at org.apache.hadoop.util.Shell.runCommand(Shell.java:261)
	at org.apache.hadoop.util.Shell.run(Shell.java:188)
	at org.apache.hadoop.util.Shell$ShellCommandExecutor.execute(Shell.java:381)
	at org.apache.hadoop.util.Shell.execCommand(Shell.java:467)
	at org.apache.hadoop.util.Shell.execCommand(Shell.java:450)
	at org.apache.hadoop.fs.RawLocalFileSystem.execCommand(RawLocalFileSystem.java:549)
	at org.apache.hadoop.fs.RawLocalFileSystem.setPermission(RawLocalFileSystem.java:540)
	at org.apache.hadoop.fs.FilterFileSystem.setPermission(FilterFileSystem.java:353)
	at org.apache.hadoop.fs.FileSystem.mkdirs(FileSystem.java:428)
	at org.apache.hadoop.mapreduce.JobSubmitter.copyAndConfigureFiles(JobSubmitter.java:166)
	at org.apache.hadoop.mapreduce.JobSubmitter.copyAndConfigureFiles(JobSubmitter.java:283)
	at org.apache.hadoop.mapreduce.JobSubmitter.submitJobInternal(JobSubmitter.java:350)
	at org.apache.hadoop.mapreduce.Job$2.run(Job.java:1037)
	at org.apache.hadoop.mapreduce.Job$2.run(Job.java:1034)
	at java.security.AccessController.doPrivileged(Native Method)
	at javax.security.auth.Subject.doAs(Subject.java:396)
	at org.apache.hadoop.security.UserGroupInformation.doAs(UserGroupInformation.java:1142)
	at org.apache.hadoop.mapreduce.Job.submit(Job.java:1034)
	at org.apache.hadoop.mapred.JobClient.submitJob(JobClient.java:536)
	at org.apache.hadoop.mapred.JobClient.runJob(JobClient.java:781)
	at org.apache.hadoop.mapred.lib.aggregate.TestAggregates.launch(TestAggregates.java:103)
	at org.apache.hadoop.mapred.lib.aggregate.TestAggregates.__CLR3_0_21uoc3jpb(TestAggregates.java:41)
	at org.apache.hadoop.mapred.lib.aggregate.TestAggregates.testAggregates(TestAggregates.java:40)


REGRESSION:  org.apache.hadoop.mapreduce.TestLocalRunner.testGcCounter

Error Message:
chmod: cannot access `/tmp/hadoop-hudson/mapred/staging/hudson-1417819397/.staging/job_local_0001': No such file or directory 

Stack Trace:
org.apache.hadoop.util.Shell$ExitCodeException: chmod: cannot access `/tmp/hadoop-hudson/mapred/staging/hudson-1417819397/.staging/job_local_0001': No such file or directory

	at org.apache.hadoop.util.Shell.runCommand(Shell.java:261)
	at org.apache.hadoop.util.Shell.run(Shell.java:188)
	at org.apache.hadoop.util.Shell$ShellCommandExecutor.execute(Shell.java:381)
	at org.apache.hadoop.util.Shell.execCommand(Shell.java:467)
	at org.apache.hadoop.util.Shell.execCommand(Shell.java:450)
	at org.apache.hadoop.fs.RawLocalFileSystem.execCommand(RawLocalFileSystem.java:549)
	at org.apache.hadoop.fs.RawLocalFileSystem.setPermission(RawLocalFileSystem.java:540)
	at org.apache.hadoop.fs.FilterFileSystem.setPermission(FilterFileSystem.java:353)
	at org.apache.hadoop.fs.FileSystem.mkdirs(FileSystem.java:428)
	at org.apache.hadoop.mapreduce.JobSubmitter.copyAndConfigureFiles(JobSubmitter.java:166)
	at org.apache.hadoop.mapreduce.JobSubmitter.copyAndConfigureFiles(JobSubmitter.java:283)
	at org.apache.hadoop.mapreduce.JobSubmitter.submitJobInternal(JobSubmitter.java:350)
	at org.apache.hadoop.mapreduce.Job$2.run(Job.java:1037)
	at org.apache.hadoop.mapreduce.Job$2.run(Job.java:1034)
	at java.security.AccessController.doPrivileged(Native Method)
	at javax.security.auth.Subject.doAs(Subject.java:396)
	at org.apache.hadoop.security.UserGroupInformation.doAs(UserGroupInformation.java:1142)
	at org.apache.hadoop.mapreduce.Job.submit(Job.java:1034)
	at org.apache.hadoop.mapreduce.Job.waitForCompletion(Job.java:1054)
	at org.apache.hadoop.mapreduce.TestLocalRunner.__CLR3_0_2tnowa3qa8(TestLocalRunner.java:271)
	at org.apache.hadoop.mapreduce.TestLocalRunner.testGcCounter(TestLocalRunner.java:244)


REGRESSION:  org.apache.hadoop.mapreduce.TestLocalRunner.testMultiMaps

Error Message:
chmod: cannot access `/tmp/hadoop-hudson/mapred/staging/hudson-442849936/.staging/job_local_0002': No such file or directory 

Stack Trace:
org.apache.hadoop.util.Shell$ExitCodeException: chmod: cannot access `/tmp/hadoop-hudson/mapred/staging/hudson-442849936/.staging/job_local_0002': No such file or directory

	at org.apache.hadoop.util.Shell.runCommand(Shell.java:261)
	at org.apache.hadoop.util.Shell.run(Shell.java:188)
	at org.apache.hadoop.util.Shell$ShellCommandExecutor.execute(Shell.java:381)
	at org.apache.hadoop.util.Shell.execCommand(Shell.java:467)
	at org.apache.hadoop.util.Shell.execCommand(Shell.java:450)
	at org.apache.hadoop.fs.RawLocalFileSystem.execCommand(RawLocalFileSystem.java:549)
	at org.apache.hadoop.fs.RawLocalFileSystem.setPermission(RawLocalFileSystem.java:540)
	at org.apache.hadoop.fs.FilterFileSystem.setPermission(FilterFileSystem.java:353)
	at org.apache.hadoop.fs.FileSystem.mkdirs(FileSystem.java:428)
	at org.apache.hadoop.mapreduce.JobSubmitter.copyAndConfigureFiles(JobSubmitter.java:166)
	at org.apache.hadoop.mapreduce.JobSubmitter.copyAndConfigureFiles(JobSubmitter.java:283)
	at org.apache.hadoop.mapreduce.JobSubmitter.submitJobInternal(JobSubmitter.java:350)
	at org.apache.hadoop.mapreduce.Job$2.run(Job.java:1037)
	at org.apache.hadoop.mapreduce.Job$2.run(Job.java:1034)
	at java.security.AccessController.doPrivileged(Native Method)
	at javax.security.auth.Subject.doAs(Subject.java:396)
	at org.apache.hadoop.security.UserGroupInformation.doAs(UserGroupInformation.java:1142)
	at org.apache.hadoop.mapreduce.Job.submit(Job.java:1034)
	at org.apache.hadoop.mapreduce.TestLocalRunner.__CLR3_0_21tclffqax(TestLocalRunner.java:321)
	at org.apache.hadoop.mapreduce.TestLocalRunner.testMultiMaps(TestLocalRunner.java:289)


REGRESSION:  org.apache.hadoop.mapreduce.TestLocalRunner.testInvalidMultiMapParallelism

Error Message:
chmod: cannot access `/tmp/hadoop-hudson/mapred/staging/hudson838930250/.staging/job_local_0003': No such file or directory 

Stack Trace:
org.apache.hadoop.util.Shell$ExitCodeException: chmod: cannot access `/tmp/hadoop-hudson/mapred/staging/hudson838930250/.staging/job_local_0003': No such file or directory

	at org.apache.hadoop.util.Shell.runCommand(Shell.java:261)
	at org.apache.hadoop.util.Shell.run(Shell.java:188)
	at org.apache.hadoop.util.Shell$ShellCommandExecutor.execute(Shell.java:381)
	at org.apache.hadoop.util.Shell.execCommand(Shell.java:467)
	at org.apache.hadoop.util.Shell.execCommand(Shell.java:450)
	at org.apache.hadoop.fs.RawLocalFileSystem.execCommand(RawLocalFileSystem.java:549)
	at org.apache.hadoop.fs.RawLocalFileSystem.setPermission(RawLocalFileSystem.java:540)
	at org.apache.hadoop.fs.FilterFileSystem.setPermission(FilterFileSystem.java:353)
	at org.apache.hadoop.fs.FileSystem.mkdirs(FileSystem.java:428)
	at org.apache.hadoop.mapreduce.JobSubmitter.copyAndConfigureFiles(JobSubmitter.java:166)
	at org.apache.hadoop.mapreduce.JobSubmitter.copyAndConfigureFiles(JobSubmitter.java:283)
	at org.apache.hadoop.mapreduce.JobSubmitter.submitJobInternal(JobSubmitter.java:350)
	at org.apache.hadoop.mapreduce.Job$2.run(Job.java:1037)
	at org.apache.hadoop.mapreduce.Job$2.run(Job.java:1034)
	at java.security.AccessController.doPrivileged(Native Method)
	at javax.security.auth.Subject.doAs(Subject.java:396)
	at org.apache.hadoop.security.UserGroupInformation.doAs(UserGroupInformation.java:1142)
	at org.apache.hadoop.mapreduce.Job.submit(Job.java:1034)
	at org.apache.hadoop.mapreduce.Job.waitForCompletion(Job.java:1054)
	at org.apache.hadoop.mapreduce.TestLocalRunner.__CLR3_0_22jq81nqc6(TestLocalRunner.java:373)
	at org.apache.hadoop.mapreduce.TestLocalRunner.testInvalidMultiMapParallelism(TestLocalRunner.java:353)


REGRESSION:  org.apache.hadoop.mapreduce.TestLocalRunner.testEmptyMaps

Error Message:
chmod: cannot access `/tmp/hadoop-hudson/mapred/staging/hudson697456731/.staging/job_local_0004': No such file or directory 

Stack Trace:
org.apache.hadoop.util.Shell$ExitCodeException: chmod: cannot access `/tmp/hadoop-hudson/mapred/staging/hudson697456731/.staging/job_local_0004': No such file or directory

	at org.apache.hadoop.util.Shell.runCommand(Shell.java:261)
	at org.apache.hadoop.util.Shell.run(Shell.java:188)
	at org.apache.hadoop.util.Shell$ShellCommandExecutor.execute(Shell.java:381)
	at org.apache.hadoop.util.Shell.execCommand(Shell.java:467)
	at org.apache.hadoop.util.Shell.execCommand(Shell.java:450)
	at org.apache.hadoop.fs.RawLocalFileSystem.execCommand(RawLocalFileSystem.java:549)
	at org.apache.hadoop.fs.RawLocalFileSystem.setPermission(RawLocalFileSystem.java:540)
	at org.apache.hadoop.fs.FilterFileSystem.setPermission(FilterFileSystem.java:353)
	at org.apache.hadoop.fs.FileSystem.mkdirs(FileSystem.java:428)
	at org.apache.hadoop.mapreduce.JobSubmitter.copyAndConfigureFiles(JobSubmitter.java:166)
	at org.apache.hadoop.mapreduce.JobSubmitter.copyAndConfigureFiles(JobSubmitter.java:283)
	at org.apache.hadoop.mapreduce.JobSubmitter.submitJobInternal(JobSubmitter.java:350)
	at org.apache.hadoop.mapreduce.Job$2.run(Job.java:1037)
	at org.apache.hadoop.mapreduce.Job$2.run(Job.java:1034)
	at java.security.AccessController.doPrivileged(Native Method)
	at javax.security.auth.Subject.doAs(Subject.java:396)
	at org.apache.hadoop.security.UserGroupInformation.doAs(UserGroupInformation.java:1142)
	at org.apache.hadoop.mapreduce.Job.submit(Job.java:1034)
	at org.apache.hadoop.mapreduce.Job.waitForCompletion(Job.java:1054)
	at org.apache.hadoop.mapreduce.TestLocalRunner.__CLR3_0_285g4nqd2(TestLocalRunner.java:429)
	at org.apache.hadoop.mapreduce.TestLocalRunner.testEmptyMaps(TestLocalRunner.java:414)


REGRESSION:  org.apache.hadoop.mapreduce.TestMapCollection.testValLastByte

Error Message:
chmod: cannot access `/tmp/hadoop-hudson/mapred/staging/hudson1767487502/.staging/job_local_0001': No such file or directory 

Stack Trace:
org.apache.hadoop.util.Shell$ExitCodeException: chmod: cannot access `/tmp/hadoop-hudson/mapred/staging/hudson1767487502/.staging/job_local_0001': No such file or directory

	at org.apache.hadoop.util.Shell.runCommand(Shell.java:261)
	at org.apache.hadoop.util.Shell.run(Shell.java:188)
	at org.apache.hadoop.util.Shell$ShellCommandExecutor.execute(Shell.java:381)
	at org.apache.hadoop.util.Shell.execCommand(Shell.java:467)
	at org.apache.hadoop.util.Shell.execCommand(Shell.java:450)
	at org.apache.hadoop.fs.RawLocalFileSystem.execCommand(RawLocalFileSystem.java:549)
	at org.apache.hadoop.fs.RawLocalFileSystem.setPermission(RawLocalFileSystem.java:540)
	at org.apache.hadoop.fs.FilterFileSystem.setPermission(FilterFileSystem.java:353)
	at org.apache.hadoop.fs.FileSystem.mkdirs(FileSystem.java:428)
	at org.apache.hadoop.mapreduce.JobSubmitter.copyAndConfigureFiles(JobSubmitter.java:166)
	at org.apache.hadoop.mapreduce.JobSubmitter.copyAndConfigureFiles(JobSubmitter.java:283)
	at org.apache.hadoop.mapreduce.JobSubmitter.submitJobInternal(JobSubmitter.java:350)
	at org.apache.hadoop.mapreduce.Job$2.run(Job.java:1037)
	at org.apache.hadoop.mapreduce.Job$2.run(Job.java:1034)
	at java.security.AccessController.doPrivileged(Native Method)
	at javax.security.auth.Subject.doAs(Subject.java:396)
	at org.apache.hadoop.security.UserGroupInformation.doAs(UserGroupInformation.java:1142)
	at org.apache.hadoop.mapreduce.Job.submit(Job.java:1034)
	at org.apache.hadoop.mapreduce.Job.waitForCompletion(Job.java:1054)
	at org.apache.hadoop.mapreduce.TestMapCollection.runTest(TestMapCollection.java:326)
	at org.apache.hadoop.mapreduce.TestMapCollection.runTest(TestMapCollection.java:309)
	at org.apache.hadoop.mapreduce.TestMapCollection.__CLR3_0_2cypxscnri(TestMapCollection.java:332)
	at org.apache.hadoop.mapreduce.TestMapCollection.testValLastByte(TestMapCollection.java:330)


REGRESSION:  org.apache.hadoop.mapreduce.TestMapCollection.testLargeRecords

Error Message:
chmod: cannot access `/tmp/hadoop-hudson/mapred/staging/hudson-1393196960/.staging/job_local_0002': No such file or directory 

Stack Trace:
org.apache.hadoop.util.Shell$ExitCodeException: chmod: cannot access `/tmp/hadoop-hudson/mapred/staging/hudson-1393196960/.staging/job_local_0002': No such file or directory

	at org.apache.hadoop.util.Shell.runCommand(Shell.java:261)
	at org.apache.hadoop.util.Shell.run(Shell.java:188)
	at org.apache.hadoop.util.Shell$ShellCommandExecutor.execute(Shell.java:381)
	at org.apache.hadoop.util.Shell.execCommand(Shell.java:467)
	at org.apache.hadoop.util.Shell.execCommand(Shell.java:450)
	at org.apache.hadoop.fs.RawLocalFileSystem.execCommand(RawLocalFileSystem.java:549)
	at org.apache.hadoop.fs.RawLocalFileSystem.setPermission(RawLocalFileSystem.java:540)
	at org.apache.hadoop.fs.FilterFileSystem.setPermission(FilterFileSystem.java:353)
	at org.apache.hadoop.fs.FileSystem.mkdirs(FileSystem.java:428)
	at org.apache.hadoop.mapreduce.JobSubmitter.copyAndConfigureFiles(JobSubmitter.java:166)
	at org.apache.hadoop.mapreduce.JobSubmitter.copyAndConfigureFiles(JobSubmitter.java:283)
	at org.apache.hadoop.mapreduce.JobSubmitter.submitJobInternal(JobSubmitter.java:350)
	at org.apache.hadoop.mapreduce.Job$2.run(Job.java:1037)
	at org.apache.hadoop.mapreduce.Job$2.run(Job.java:1034)
	at java.security.AccessController.doPrivileged(Native Method)
	at javax.security.auth.Subject.doAs(Subject.java:396)
	at org.apache.hadoop.security.UserGroupInformation.doAs(UserGroupInformation.java:1142)
	at org.apache.hadoop.mapreduce.Job.submit(Job.java:1034)
	at org.apache.hadoop.mapreduce.Job.waitForCompletion(Job.java:1054)
	at org.apache.hadoop.mapreduce.TestMapCollection.runTest(TestMapCollection.java:326)
	at org.apache.hadoop.mapreduce.TestMapCollection.runTest(TestMapCollection.java:309)
	at org.apache.hadoop.mapreduce.TestMapCollection.__CLR3_0_2fe8528nrl(TestMapCollection.java:339)
	at org.apache.hadoop.mapreduce.TestMapCollection.testLargeRecords(TestMapCollection.java:337)


REGRESSION:  org.apache.hadoop.mapreduce.TestMapCollection.testSpillPer2B

Error Message:
chmod: cannot access `/tmp/hadoop-hudson/mapred/staging/hudson-1744435921/.staging/job_local_0003': No such file or directory 

Stack Trace:
org.apache.hadoop.util.Shell$ExitCodeException: chmod: cannot access `/tmp/hadoop-hudson/mapred/staging/hudson-1744435921/.staging/job_local_0003': No such file or directory

	at org.apache.hadoop.util.Shell.runCommand(Shell.java:261)
	at org.apache.hadoop.util.Shell.run(Shell.java:188)
	at org.apache.hadoop.util.Shell$ShellCommandExecutor.execute(Shell.java:381)
	at org.apache.hadoop.util.Shell.execCommand(Shell.java:467)
	at org.apache.hadoop.util.Shell.execCommand(Shell.java:450)
	at org.apache.hadoop.fs.RawLocalFileSystem.execCommand(RawLocalFileSystem.java:549)
	at org.apache.hadoop.fs.RawLocalFileSystem.setPermission(RawLocalFileSystem.java:540)
	at org.apache.hadoop.fs.FilterFileSystem.setPermission(FilterFileSystem.java:353)
	at org.apache.hadoop.fs.FileSystem.mkdirs(FileSystem.java:428)
	at org.apache.hadoop.mapreduce.JobSubmitter.copyAndConfigureFiles(JobSubmitter.java:166)
	at org.apache.hadoop.mapreduce.JobSubmitter.copyAndConfigureFiles(JobSubmitter.java:283)
	at org.apache.hadoop.mapreduce.JobSubmitter.submitJobInternal(JobSubmitter.java:350)
	at org.apache.hadoop.mapreduce.Job$2.run(Job.java:1037)
	at org.apache.hadoop.mapreduce.Job$2.run(Job.java:1034)
	at java.security.AccessController.doPrivileged(Native Method)
	at javax.security.auth.Subject.doAs(Subject.java:396)
	at org.apache.hadoop.security.UserGroupInformation.doAs(UserGroupInformation.java:1142)
	at org.apache.hadoop.mapreduce.Job.submit(Job.java:1034)
	at org.apache.hadoop.mapreduce.Job.waitForCompletion(Job.java:1054)
	at org.apache.hadoop.mapreduce.TestMapCollection.runTest(TestMapCollection.java:326)
	at org.apache.hadoop.mapreduce.TestMapCollection.runTest(TestMapCollection.java:309)
	at org.apache.hadoop.mapreduce.TestMapCollection.__CLR3_0_28yt0g6nro(TestMapCollection.java:346)
	at org.apache.hadoop.mapreduce.TestMapCollection.testSpillPer2B(TestMapCollection.java:344)


REGRESSION:  org.apache.hadoop.mapreduce.TestMapCollection.testZeroVal

Error Message:
chmod: cannot access `/tmp/hadoop-hudson/mapred/staging/hudson-527816766/.staging/job_local_0004': No such file or directory 

Stack Trace:
org.apache.hadoop.util.Shell$ExitCodeException: chmod: cannot access `/tmp/hadoop-hudson/mapred/staging/hudson-527816766/.staging/job_local_0004': No such file or directory

	at org.apache.hadoop.util.Shell.runCommand(Shell.java:261)
	at org.apache.hadoop.util.Shell.run(Shell.java:188)
	at org.apache.hadoop.util.Shell$ShellCommandExecutor.execute(Shell.java:381)
	at org.apache.hadoop.util.Shell.execCommand(Shell.java:467)
	at org.apache.hadoop.util.Shell.execCommand(Shell.java:450)
	at org.apache.hadoop.fs.RawLocalFileSystem.execCommand(RawLocalFileSystem.java:549)
	at org.apache.hadoop.fs.RawLocalFileSystem.setPermission(RawLocalFileSystem.java:540)
	at org.apache.hadoop.fs.FilterFileSystem.setPermission(FilterFileSystem.java:353)
	at org.apache.hadoop.fs.FileSystem.mkdirs(FileSystem.java:428)
	at org.apache.hadoop.mapreduce.JobSubmitter.copyAndConfigureFiles(JobSubmitter.java:166)
	at org.apache.hadoop.mapreduce.JobSubmitter.copyAndConfigureFiles(JobSubmitter.java:283)
	at org.apache.hadoop.mapreduce.JobSubmitter.submitJobInternal(JobSubmitter.java:350)
	at org.apache.hadoop.mapreduce.Job$2.run(Job.java:1037)
	at org.apache.hadoop.mapreduce.Job$2.run(Job.java:1034)
	at java.security.AccessController.doPrivileged(Native Method)
	at javax.security.auth.Subject.doAs(Subject.java:396)
	at org.apache.hadoop.security.UserGroupInformation.doAs(UserGroupInformation.java:1142)
	at org.apache.hadoop.mapreduce.Job.submit(Job.java:1034)
	at org.apache.hadoop.mapreduce.Job.waitForCompletion(Job.java:1054)
	at org.apache.hadoop.mapreduce.TestMapCollection.runTest(TestMapCollection.java:326)
	at org.apache.hadoop.mapreduce.TestMapCollection.runTest(TestMapCollection.java:309)
	at org.apache.hadoop.mapreduce.TestMapCollection.__CLR3_0_2u5xn7ynrt(TestMapCollection.java:355)
	at org.apache.hadoop.mapreduce.TestMapCollection.testZeroVal(TestMapCollection.java:353)


REGRESSION:  org.apache.hadoop.mapreduce.TestMapCollection.testSingleRecord

Error Message:
chmod: cannot access `/tmp/hadoop-hudson/mapred/staging/hudson-896604518/.staging/job_local_0005': No such file or directory 

Stack Trace:
org.apache.hadoop.util.Shell$ExitCodeException: chmod: cannot access `/tmp/hadoop-hudson/mapred/staging/hudson-896604518/.staging/job_local_0005': No such file or directory

	at org.apache.hadoop.util.Shell.runCommand(Shell.java:261)
	at org.apache.hadoop.util.Shell.run(Shell.java:188)
	at org.apache.hadoop.util.Shell$ShellCommandExecutor.execute(Shell.java:381)
	at org.apache.hadoop.util.Shell.execCommand(Shell.java:467)
	at org.apache.hadoop.util.Shell.execCommand(Shell.java:450)
	at org.apache.hadoop.fs.RawLocalFileSystem.execCommand(RawLocalFileSystem.java:549)
	at org.apache.hadoop.fs.RawLocalFileSystem.setPermission(RawLocalFileSystem.java:540)
	at org.apache.hadoop.fs.FilterFileSystem.setPermission(FilterFileSystem.java:353)
	at org.apache.hadoop.fs.FileSystem.mkdirs(FileSystem.java:428)
	at org.apache.hadoop.mapreduce.JobSubmitter.copyAndConfigureFiles(JobSubmitter.java:166)
	at org.apache.hadoop.mapreduce.JobSubmitter.copyAndConfigureFiles(JobSubmitter.java:283)
	at org.apache.hadoop.mapreduce.JobSubmitter.submitJobInternal(JobSubmitter.java:350)
	at org.apache.hadoop.mapreduce.Job$2.run(Job.java:1037)
	at org.apache.hadoop.mapreduce.Job$2.run(Job.java:1034)
	at java.security.AccessController.doPrivileged(Native Method)
	at javax.security.auth.Subject.doAs(Subject.java:396)
	at org.apache.hadoop.security.UserGroupInformation.doAs(UserGroupInformation.java:1142)
	at org.apache.hadoop.mapreduce.Job.submit(Job.java:1034)
	at org.apache.hadoop.mapreduce.Job.waitForCompletion(Job.java:1054)
	at org.apache.hadoop.mapreduce.TestMapCollection.runTest(TestMapCollection.java:326)
	at org.apache.hadoop.mapreduce.TestMapCollection.runTest(TestMapCollection.java:309)
	at org.apache.hadoop.mapreduce.TestMapCollection.__CLR3_0_2db2s32nry(TestMapCollection.java:363)
	at org.apache.hadoop.mapreduce.TestMapCollection.testSingleRecord(TestMapCollection.java:362)


REGRESSION:  org.apache.hadoop.mapreduce.TestMapCollection.testLowSpill

Error Message:
chmod: cannot access `/tmp/hadoop-hudson/mapred/staging/hudson-656423194/.staging/job_local_0006': No such file or directory 

Stack Trace:
org.apache.hadoop.util.Shell$ExitCodeException: chmod: cannot access `/tmp/hadoop-hudson/mapred/staging/hudson-656423194/.staging/job_local_0006': No such file or directory

	at org.apache.hadoop.util.Shell.runCommand(Shell.java:261)
	at org.apache.hadoop.util.Shell.run(Shell.java:188)
	at org.apache.hadoop.util.Shell$ShellCommandExecutor.execute(Shell.java:381)
	at org.apache.hadoop.util.Shell.execCommand(Shell.java:467)
	at org.apache.hadoop.util.Shell.execCommand(Shell.java:450)
	at org.apache.hadoop.fs.RawLocalFileSystem.execCommand(RawLocalFileSystem.java:549)
	at org.apache.hadoop.fs.RawLocalFileSystem.setPermission(RawLocalFileSystem.java:540)
	at org.apache.hadoop.fs.FilterFileSystem.setPermission(FilterFileSystem.java:353)
	at org.apache.hadoop.fs.FileSystem.mkdirs(FileSystem.java:428)
	at org.apache.hadoop.mapreduce.JobSubmitter.copyAndConfigureFiles(JobSubmitter.java:166)
	at org.apache.hadoop.mapreduce.JobSubmitter.copyAndConfigureFiles(JobSubmitter.java:283)
	at org.apache.hadoop.mapreduce.JobSubmitter.submitJobInternal(JobSubmitter.java:350)
	at org.apache.hadoop.mapreduce.Job$2.run(Job.java:1037)
	at org.apache.hadoop.mapreduce.Job$2.run(Job.java:1034)
	at java.security.AccessController.doPrivileged(Native Method)
	at javax.security.auth.Subject.doAs(Subject.java:396)
	at org.apache.hadoop.security.UserGroupInformation.doAs(UserGroupInformation.java:1142)
	at org.apache.hadoop.mapreduce.Job.submit(Job.java:1034)
	at org.apache.hadoop.mapreduce.Job.waitForCompletion(Job.java:1054)
	at org.apache.hadoop.mapreduce.TestMapCollection.runTest(TestMapCollection.java:326)
	at org.apache.hadoop.mapreduce.TestMapCollection.runTest(TestMapCollection.java:309)
	at org.apache.hadoop.mapreduce.TestMapCollection.__CLR3_0_2z3qgi7ns1(TestMapCollection.java:369)
	at org.apache.hadoop.mapreduce.TestMapCollection.testLowSpill(TestMapCollection.java:368)


REGRESSION:  org.apache.hadoop.mapreduce.TestMapCollection.testSplitMetaSpill

Error Message:
chmod: cannot access `/tmp/hadoop-hudson/mapred/staging/hudson-276551792/.staging/job_local_0007': No such file or directory 

Stack Trace:
org.apache.hadoop.util.Shell$ExitCodeException: chmod: cannot access `/tmp/hadoop-hudson/mapred/staging/hudson-276551792/.staging/job_local_0007': No such file or directory

	at org.apache.hadoop.util.Shell.runCommand(Shell.java:261)
	at org.apache.hadoop.util.Shell.run(Shell.java:188)
	at org.apache.hadoop.util.Shell$ShellCommandExecutor.execute(Shell.java:381)
	at org.apache.hadoop.util.Shell.execCommand(Shell.java:467)
	at org.apache.hadoop.util.Shell.execCommand(Shell.java:450)
	at org.apache.hadoop.fs.RawLocalFileSystem.execCommand(RawLocalFileSystem.java:549)
	at org.apache.hadoop.fs.RawLocalFileSystem.setPermission(RawLocalFileSystem.java:540)
	at org.apache.hadoop.fs.FilterFileSystem.setPermission(FilterFileSystem.java:353)
	at org.apache.hadoop.fs.FileSystem.mkdirs(FileSystem.java:428)
	at org.apache.hadoop.mapreduce.JobSubmitter.copyAndConfigureFiles(JobSubmitter.java:166)
	at org.apache.hadoop.mapreduce.JobSubmitter.copyAndConfigureFiles(JobSubmitter.java:283)
	at org.apache.hadoop.mapreduce.JobSubmitter.submitJobInternal(JobSubmitter.java:350)
	at org.apache.hadoop.mapreduce.Job$2.run(Job.java:1037)
	at org.apache.hadoop.mapreduce.Job$2.run(Job.java:1034)
	at java.security.AccessController.doPrivileged(Native Method)
	at javax.security.auth.Subject.doAs(Subject.java:396)
	at org.apache.hadoop.security.UserGroupInformation.doAs(UserGroupInformation.java:1142)
	at org.apache.hadoop.mapreduce.Job.submit(Job.java:1034)
	at org.apache.hadoop.mapreduce.Job.waitForCompletion(Job.java:1054)
	at org.apache.hadoop.mapreduce.TestMapCollection.runTest(TestMapCollection.java:326)
	at org.apache.hadoop.mapreduce.TestMapCollection.runTest(TestMapCollection.java:309)
	at org.apache.hadoop.mapreduce.TestMapCollection.__CLR3_0_2molruins3(TestMapCollection.java:374)
	at org.apache.hadoop.mapreduce.TestMapCollection.testSplitMetaSpill(TestMapCollection.java:373)


REGRESSION:  org.apache.hadoop.mapreduce.TestMapCollection.testPostSpillMeta

Error Message:
chmod: cannot access `/tmp/hadoop-hudson/mapred/staging/hudson-686875015/.staging/job_local_0008': No such file or directory 

Stack Trace:
org.apache.hadoop.util.Shell$ExitCodeException: chmod: cannot access `/tmp/hadoop-hudson/mapred/staging/hudson-686875015/.staging/job_local_0008': No such file or directory

	at org.apache.hadoop.util.Shell.runCommand(Shell.java:261)
	at org.apache.hadoop.util.Shell.run(Shell.java:188)
	at org.apache.hadoop.util.Shell$ShellCommandExecutor.execute(Shell.java:381)
	at org.apache.hadoop.util.Shell.execCommand(Shell.java:467)
	at org.apache.hadoop.util.Shell.execCommand(Shell.java:450)
	at org.apache.hadoop.fs.RawLocalFileSystem.execCommand(RawLocalFileSystem.java:549)
	at org.apache.hadoop.fs.RawLocalFileSystem.setPermission(RawLocalFileSystem.java:540)
	at org.apache.hadoop.fs.FilterFileSystem.setPermission(FilterFileSystem.java:353)
	at org.apache.hadoop.fs.FileSystem.mkdirs(FileSystem.java:428)
	at org.apache.hadoop.mapreduce.JobSubmitter.copyAndConfigureFiles(JobSubmitter.java:166)
	at org.apache.hadoop.mapreduce.JobSubmitter.copyAndConfigureFiles(JobSubmitter.java:283)
	at org.apache.hadoop.mapreduce.JobSubmitter.submitJobInternal(JobSubmitter.java:350)
	at org.apache.hadoop.mapreduce.Job$2.run(Job.java:1037)
	at org.apache.hadoop.mapreduce.Job$2.run(Job.java:1034)
	at java.security.AccessController.doPrivileged(Native Method)
	at javax.security.auth.Subject.doAs(Subject.java:396)
	at org.apache.hadoop.security.UserGroupInformation.doAs(UserGroupInformation.java:1142)
	at org.apache.hadoop.mapreduce.Job.submit(Job.java:1034)
	at org.apache.hadoop.mapreduce.Job.waitForCompletion(Job.java:1054)
	at org.apache.hadoop.mapreduce.TestMapCollection.runTest(TestMapCollection.java:326)
	at org.apache.hadoop.mapreduce.TestMapCollection.__CLR3_0_266dm6ensp(TestMapCollection.java:423)
	at org.apache.hadoop.mapreduce.TestMapCollection.testPostSpillMeta(TestMapCollection.java:407)


REGRESSION:  org.apache.hadoop.mapreduce.TestMapCollection.testLargeRecConcurrent

Error Message:
chmod: cannot access `/tmp/hadoop-hudson/mapred/staging/hudson1350017137/.staging/job_local_0009': No such file or directory 

Stack Trace:
org.apache.hadoop.util.Shell$ExitCodeException: chmod: cannot access `/tmp/hadoop-hudson/mapred/staging/hudson1350017137/.staging/job_local_0009': No such file or directory

	at org.apache.hadoop.util.Shell.runCommand(Shell.java:261)
	at org.apache.hadoop.util.Shell.run(Shell.java:188)
	at org.apache.hadoop.util.Shell$ShellCommandExecutor.execute(Shell.java:381)
	at org.apache.hadoop.util.Shell.execCommand(Shell.java:467)
	at org.apache.hadoop.util.Shell.execCommand(Shell.java:450)
	at org.apache.hadoop.fs.RawLocalFileSystem.execCommand(RawLocalFileSystem.java:549)
	at org.apache.hadoop.fs.RawLocalFileSystem.setPermission(RawLocalFileSystem.java:540)
	at org.apache.hadoop.fs.FilterFileSystem.setPermission(FilterFileSystem.java:353)
	at org.apache.hadoop.fs.FileSystem.mkdirs(FileSystem.java:428)
	at org.apache.hadoop.mapreduce.JobSubmitter.copyAndConfigureFiles(JobSubmitter.java:166)
	at org.apache.hadoop.mapreduce.JobSubmitter.copyAndConfigureFiles(JobSubmitter.java:283)
	at org.apache.hadoop.mapreduce.JobSubmitter.submitJobInternal(JobSubmitter.java:350)
	at org.apache.hadoop.mapreduce.Job$2.run(Job.java:1037)
	at org.apache.hadoop.mapreduce.Job$2.run(Job.java:1034)
	at java.security.AccessController.doPrivileged(Native Method)
	at javax.security.auth.Subject.doAs(Subject.java:396)
	at org.apache.hadoop.security.UserGroupInformation.doAs(UserGroupInformation.java:1142)
	at org.apache.hadoop.mapreduce.Job.submit(Job.java:1034)
	at org.apache.hadoop.mapreduce.Job.waitForCompletion(Job.java:1054)
	at org.apache.hadoop.mapreduce.TestMapCollection.runTest(TestMapCollection.java:326)
	at org.apache.hadoop.mapreduce.TestMapCollection.__CLR3_0_2qefqudnt2(TestMapCollection.java:440)
	at org.apache.hadoop.mapreduce.TestMapCollection.testLargeRecConcurrent(TestMapCollection.java:427)


REGRESSION:  org.apache.hadoop.mapreduce.TestMapCollection.testRandom

Error Message:
chmod: cannot access `/tmp/hadoop-hudson/mapred/staging/hudson-2046580909/.staging/job_local_0010': No such file or directory 

Stack Trace:
org.apache.hadoop.util.Shell$ExitCodeException: chmod: cannot access `/tmp/hadoop-hudson/mapred/staging/hudson-2046580909/.staging/job_local_0010': No such file or directory

	at org.apache.hadoop.util.Shell.runCommand(Shell.java:261)
	at org.apache.hadoop.util.Shell.run(Shell.java:188)
	at org.apache.hadoop.util.Shell$ShellCommandExecutor.execute(Shell.java:381)
	at org.apache.hadoop.util.Shell.execCommand(Shell.java:467)
	at org.apache.hadoop.util.Shell.execCommand(Shell.java:450)
	at org.apache.hadoop.fs.RawLocalFileSystem.execCommand(RawLocalFileSystem.java:549)
	at org.apache.hadoop.fs.RawLocalFileSystem.setPermission(RawLocalFileSystem.java:540)
	at org.apache.hadoop.fs.FilterFileSystem.setPermission(FilterFileSystem.java:353)
	at org.apache.hadoop.fs.FileSystem.mkdirs(FileSystem.java:428)
	at org.apache.hadoop.mapreduce.JobSubmitter.copyAndConfigureFiles(JobSubmitter.java:166)
	at org.apache.hadoop.mapreduce.JobSubmitter.copyAndConfigureFiles(JobSubmitter.java:283)
	at org.apache.hadoop.mapreduce.JobSubmitter.submitJobInternal(JobSubmitter.java:350)
	at org.apache.hadoop.mapreduce.Job$2.run(Job.java:1037)
	at org.apache.hadoop.mapreduce.Job$2.run(Job.java:1034)
	at java.security.AccessController.doPrivileged(Native Method)
	at javax.security.auth.Subject.doAs(Subject.java:396)
	at org.apache.hadoop.security.UserGroupInformation.doAs(UserGroupInformation.java:1142)
	at org.apache.hadoop.mapreduce.Job.submit(Job.java:1034)
	at org.apache.hadoop.mapreduce.Job.waitForCompletion(Job.java:1054)
	at org.apache.hadoop.mapreduce.TestMapCollection.runTest(TestMapCollection.java:326)
	at org.apache.hadoop.mapreduce.TestMapCollection.__CLR3_0_2ujoeasnuk(TestMapCollection.java:513)
	at org.apache.hadoop.mapreduce.TestMapCollection.testRandom(TestMapCollection.java:496)


REGRESSION:  org.apache.hadoop.mapreduce.TestMapCollection.testRandomCompress

Error Message:
chmod: cannot access `/tmp/hadoop-hudson/mapred/staging/hudson1740264135/.staging/job_local_0011': No such file or directory 

Stack Trace:
org.apache.hadoop.util.Shell$ExitCodeException: chmod: cannot access `/tmp/hadoop-hudson/mapred/staging/hudson1740264135/.staging/job_local_0011': No such file or directory

	at org.apache.hadoop.util.Shell.runCommand(Shell.java:261)
	at org.apache.hadoop.util.Shell.run(Shell.java:188)
	at org.apache.hadoop.util.Shell$ShellCommandExecutor.execute(Shell.java:381)
	at org.apache.hadoop.util.Shell.execCommand(Shell.java:467)
	at org.apache.hadoop.util.Shell.execCommand(Shell.java:450)
	at org.apache.hadoop.fs.RawLocalFileSystem.execCommand(RawLocalFileSystem.java:549)
	at org.apache.hadoop.fs.RawLocalFileSystem.setPermission(RawLocalFileSystem.java:540)
	at org.apache.hadoop.fs.FilterFileSystem.setPermission(FilterFileSystem.java:353)
	at org.apache.hadoop.fs.FileSystem.mkdirs(FileSystem.java:428)
	at org.apache.hadoop.mapreduce.JobSubmitter.copyAndConfigureFiles(JobSubmitter.java:166)
	at org.apache.hadoop.mapreduce.JobSubmitter.copyAndConfigureFiles(JobSubmitter.java:283)
	at org.apache.hadoop.mapreduce.JobSubmitter.submitJobInternal(JobSubmitter.java:350)
	at org.apache.hadoop.mapreduce.Job$2.run(Job.java:1037)
	at org.apache.hadoop.mapreduce.Job$2.run(Job.java:1034)
	at java.security.AccessController.doPrivileged(Native Method)
	at javax.security.auth.Subject.doAs(Subject.java:396)
	at org.apache.hadoop.security.UserGroupInformation.doAs(UserGroupInformation.java:1142)
	at org.apache.hadoop.mapreduce.Job.submit(Job.java:1034)
	at org.apache.hadoop.mapreduce.Job.waitForCompletion(Job.java:1054)
	at org.apache.hadoop.mapreduce.TestMapCollection.runTest(TestMapCollection.java:326)
	at org.apache.hadoop.mapreduce.TestMapCollection.__CLR3_0_2vyg2zmnv0(TestMapCollection.java:535)
	at org.apache.hadoop.mapreduce.TestMapCollection.testRandomCompress(TestMapCollection.java:517)


REGRESSION:  org.apache.hadoop.mapreduce.TestMapReduce.testMapred

Error Message:
chmod: cannot access `/tmp/hadoop-hudson/mapred/staging/hudson-846462520/.staging/job_local_0001': No such file or directory 

Stack Trace:
org.apache.hadoop.util.Shell$ExitCodeException: chmod: cannot access `/tmp/hadoop-hudson/mapred/staging/hudson-846462520/.staging/job_local_0001': No such file or directory

	at org.apache.hadoop.util.Shell.runCommand(Shell.java:261)
	at org.apache.hadoop.util.Shell.run(Shell.java:188)
	at org.apache.hadoop.util.Shell$ShellCommandExecutor.execute(Shell.java:381)
	at org.apache.hadoop.util.Shell.execCommand(Shell.java:467)
	at org.apache.hadoop.util.Shell.execCommand(Shell.java:450)
	at org.apache.hadoop.fs.RawLocalFileSystem.execCommand(RawLocalFileSystem.java:549)
	at org.apache.hadoop.fs.RawLocalFileSystem.setPermission(RawLocalFileSystem.java:540)
	at org.apache.hadoop.fs.FilterFileSystem.setPermission(FilterFileSystem.java:353)
	at org.apache.hadoop.fs.FileSystem.mkdirs(FileSystem.java:428)
	at org.apache.hadoop.mapreduce.JobSubmitter.copyAndConfigureFiles(JobSubmitter.java:166)
	at org.apache.hadoop.mapreduce.JobSubmitter.copyAndConfigureFiles(JobSubmitter.java:283)
	at org.apache.hadoop.mapreduce.JobSubmitter.submitJobInternal(JobSubmitter.java:350)
	at org.apache.hadoop.mapreduce.Job$2.run(Job.java:1037)
	at org.apache.hadoop.mapreduce.Job$2.run(Job.java:1034)
	at java.security.AccessController.doPrivileged(Native Method)
	at javax.security.auth.Subject.doAs(Subject.java:396)
	at org.apache.hadoop.security.UserGroupInformation.doAs(UserGroupInformation.java:1142)
	at org.apache.hadoop.mapreduce.Job.submit(Job.java:1034)
	at org.apache.hadoop.mapreduce.Job.waitForCompletion(Job.java:1054)
	at org.apache.hadoop.mapreduce.TestMapReduce.launch(TestMapReduce.java:300)
	at org.apache.hadoop.mapreduce.TestMapReduce.__CLR3_0_2vmf1hqep9(TestMapReduce.java:219)
	at org.apache.hadoop.mapreduce.TestMapReduce.testMapred(TestMapReduce.java:218)


REGRESSION:  org.apache.hadoop.mapreduce.TestValueIterReset.testValueIterReset

Error Message:
null

Stack Trace:
junit.framework.AssertionFailedError: null
	at org.apache.hadoop.mapreduce.TestValueIterReset.__CLR3_0_2hu3rohsuv(TestValueIterReset.java:547)
	at org.apache.hadoop.mapreduce.TestValueIterReset.testValueIterReset(TestValueIterReset.java:521)


REGRESSION:  org.apache.hadoop.mapreduce.lib.aggregate.TestMapReduceAggregates.testAggregates

Error Message:
chmod: cannot access `/tmp/hadoop-hudson/mapred/staging/hudson1383640971/.staging/job_local_0001': No such file or directory 

Stack Trace:
org.apache.hadoop.util.Shell$ExitCodeException: chmod: cannot access `/tmp/hadoop-hudson/mapred/staging/hudson1383640971/.staging/job_local_0001': No such file or directory

	at org.apache.hadoop.util.Shell.runCommand(Shell.java:261)
	at org.apache.hadoop.util.Shell.run(Shell.java:188)
	at org.apache.hadoop.util.Shell$ShellCommandExecutor.execute(Shell.java:381)
	at org.apache.hadoop.util.Shell.execCommand(Shell.java:467)
	at org.apache.hadoop.util.Shell.execCommand(Shell.java:450)
	at org.apache.hadoop.fs.RawLocalFileSystem.execCommand(RawLocalFileSystem.java:549)
	at org.apache.hadoop.fs.RawLocalFileSystem.setPermission(RawLocalFileSystem.java:540)
	at org.apache.hadoop.fs.FilterFileSystem.setPermission(FilterFileSystem.java:353)
	at org.apache.hadoop.fs.FileSystem.mkdirs(FileSystem.java:428)
	at org.apache.hadoop.mapreduce.JobSubmitter.copyAndConfigureFiles(JobSubmitter.java:166)
	at org.apache.hadoop.mapreduce.JobSubmitter.copyAndConfigureFiles(JobSubmitter.java:283)
	at org.apache.hadoop.mapreduce.JobSubmitter.submitJobInternal(JobSubmitter.java:350)
	at org.apache.hadoop.mapreduce.Job$2.run(Job.java:1037)
	at org.apache.hadoop.mapreduce.Job$2.run(Job.java:1034)
	at java.security.AccessController.doPrivileged(Native Method)
	at javax.security.auth.Subject.doAs(Subject.java:396)
	at org.apache.hadoop.security.UserGroupInformation.doAs(UserGroupInformation.java:1142)
	at org.apache.hadoop.mapreduce.Job.submit(Job.java:1034)
	at org.apache.hadoop.mapreduce.Job.waitForCompletion(Job.java:1054)
	at org.apache.hadoop.mapreduce.lib.aggregate.TestMapReduceAggregates.launch(TestMapReduceAggregates.java:108)
	at org.apache.hadoop.mapreduce.lib.aggregate.TestMapReduceAggregates.__CLR3_0_21uoc3b7k(TestMapReduceAggregates.java:46)
	at org.apache.hadoop.mapreduce.lib.aggregate.TestMapReduceAggregates.testAggregates(TestMapReduceAggregates.java:45)


REGRESSION:  org.apache.hadoop.mapreduce.lib.chain.TestChainErrors.testChainFail

Error Message:
chmod: cannot access `/tmp/hadoop-hudson/mapred/staging/hudson174157453/.staging/job_local_0001': No such file or directory 

Stack Trace:
org.apache.hadoop.util.Shell$ExitCodeException: chmod: cannot access `/tmp/hadoop-hudson/mapred/staging/hudson174157453/.staging/job_local_0001': No such file or directory

	at org.apache.hadoop.util.Shell.runCommand(Shell.java:261)
	at org.apache.hadoop.util.Shell.run(Shell.java:188)
	at org.apache.hadoop.util.Shell$ShellCommandExecutor.execute(Shell.java:381)
	at org.apache.hadoop.util.Shell.execCommand(Shell.java:467)
	at org.apache.hadoop.util.Shell.execCommand(Shell.java:450)
	at org.apache.hadoop.fs.RawLocalFileSystem.execCommand(RawLocalFileSystem.java:549)
	at org.apache.hadoop.fs.RawLocalFileSystem.setPermission(RawLocalFileSystem.java:540)
	at org.apache.hadoop.fs.FilterFileSystem.setPermission(FilterFileSystem.java:353)
	at org.apache.hadoop.fs.FileSystem.mkdirs(FileSystem.java:428)
	at org.apache.hadoop.mapreduce.JobSubmitter.copyAndConfigureFiles(JobSubmitter.java:166)
	at org.apache.hadoop.mapreduce.JobSubmitter.copyAndConfigureFiles(JobSubmitter.java:283)
	at org.apache.hadoop.mapreduce.JobSubmitter.submitJobInternal(JobSubmitter.java:350)
	at org.apache.hadoop.mapreduce.Job$2.run(Job.java:1037)
	at org.apache.hadoop.mapreduce.Job$2.run(Job.java:1034)
	at java.security.AccessController.doPrivileged(Native Method)
	at javax.security.auth.Subject.doAs(Subject.java:396)
	at org.apache.hadoop.security.UserGroupInformation.doAs(UserGroupInformation.java:1142)
	at org.apache.hadoop.mapreduce.Job.submit(Job.java:1034)
	at org.apache.hadoop.mapreduce.Job.waitForCompletion(Job.java:1054)
	at org.apache.hadoop.mapreduce.lib.chain.TestChainErrors.__CLR3_0_2bnfjqsh1h(TestChainErrors.java:108)
	at org.apache.hadoop.mapreduce.lib.chain.TestChainErrors.testChainFail(TestChainErrors.java:92)


REGRESSION:  org.apache.hadoop.mapreduce.lib.chain.TestChainErrors.testReducerFail

Error Message:
chmod: cannot access `/tmp/hadoop-hudson/mapred/staging/hudson-1704827281/.staging/job_local_0002': No such file or directory 

Stack Trace:
org.apache.hadoop.util.Shell$ExitCodeException: chmod: cannot access `/tmp/hadoop-hudson/mapred/staging/hudson-1704827281/.staging/job_local_0002': No such file or directory

	at org.apache.hadoop.util.Shell.runCommand(Shell.java:261)
	at org.apache.hadoop.util.Shell.run(Shell.java:188)
	at org.apache.hadoop.util.Shell$ShellCommandExecutor.execute(Shell.java:381)
	at org.apache.hadoop.util.Shell.execCommand(Shell.java:467)
	at org.apache.hadoop.util.Shell.execCommand(Shell.java:450)
	at org.apache.hadoop.fs.RawLocalFileSystem.execCommand(RawLocalFileSystem.java:549)
	at org.apache.hadoop.fs.RawLocalFileSystem.setPermission(RawLocalFileSystem.java:540)
	at org.apache.hadoop.fs.FilterFileSystem.setPermission(FilterFileSystem.java:353)
	at org.apache.hadoop.fs.FileSystem.mkdirs(FileSystem.java:428)
	at org.apache.hadoop.mapreduce.JobSubmitter.copyAndConfigureFiles(JobSubmitter.java:166)
	at org.apache.hadoop.mapreduce.JobSubmitter.copyAndConfigureFiles(JobSubmitter.java:283)
	at org.apache.hadoop.mapreduce.JobSubmitter.submitJobInternal(JobSubmitter.java:350)
	at org.apache.hadoop.mapreduce.Job$2.run(Job.java:1037)
	at org.apache.hadoop.mapreduce.Job$2.run(Job.java:1034)
	at java.security.AccessController.doPrivileged(Native Method)
	at javax.security.auth.Subject.doAs(Subject.java:396)
	at org.apache.hadoop.security.UserGroupInformation.doAs(UserGroupInformation.java:1142)
	at org.apache.hadoop.mapreduce.Job.submit(Job.java:1034)
	at org.apache.hadoop.mapreduce.Job.waitForCompletion(Job.java:1054)
	at org.apache.hadoop.mapreduce.lib.chain.TestChainErrors.__CLR3_0_25ewwv3h1q(TestChainErrors.java:133)
	at org.apache.hadoop.mapreduce.lib.chain.TestChainErrors.testReducerFail(TestChainErrors.java:117)


REGRESSION:  org.apache.hadoop.mapreduce.lib.chain.TestChainErrors.testChainMapNoOuptut

Error Message:
chmod: cannot access `/tmp/hadoop-hudson/mapred/staging/hudson-558334606/.staging/job_local_0003': No such file or directory 

Stack Trace:
org.apache.hadoop.util.Shell$ExitCodeException: chmod: cannot access `/tmp/hadoop-hudson/mapred/staging/hudson-558334606/.staging/job_local_0003': No such file or directory

	at org.apache.hadoop.util.Shell.runCommand(Shell.java:261)
	at org.apache.hadoop.util.Shell.run(Shell.java:188)
	at org.apache.hadoop.util.Shell$ShellCommandExecutor.execute(Shell.java:381)
	at org.apache.hadoop.util.Shell.execCommand(Shell.java:467)
	at org.apache.hadoop.util.Shell.execCommand(Shell.java:450)
	at org.apache.hadoop.fs.RawLocalFileSystem.execCommand(RawLocalFileSystem.java:549)
	at org.apache.hadoop.fs.RawLocalFileSystem.setPermission(RawLocalFileSystem.java:540)
	at org.apache.hadoop.fs.FilterFileSystem.setPermission(FilterFileSystem.java:353)
	at org.apache.hadoop.fs.FileSystem.mkdirs(FileSystem.java:428)
	at org.apache.hadoop.mapreduce.JobSubmitter.copyAndConfigureFiles(JobSubmitter.java:166)
	at org.apache.hadoop.mapreduce.JobSubmitter.copyAndConfigureFiles(JobSubmitter.java:283)
	at org.apache.hadoop.mapreduce.JobSubmitter.submitJobInternal(JobSubmitter.java:350)
	at org.apache.hadoop.mapreduce.Job$2.run(Job.java:1037)
	at org.apache.hadoop.mapreduce.Job$2.run(Job.java:1034)
	at java.security.AccessController.doPrivileged(Native Method)
	at javax.security.auth.Subject.doAs(Subject.java:396)
	at org.apache.hadoop.security.UserGroupInformation.doAs(UserGroupInformation.java:1142)
	at org.apache.hadoop.mapreduce.Job.submit(Job.java:1034)
	at org.apache.hadoop.mapreduce.Job.waitForCompletion(Job.java:1054)
	at org.apache.hadoop.mapreduce.lib.chain.TestChainErrors.__CLR3_0_2mbjvwih1z(TestChainErrors.java:155)
	at org.apache.hadoop.mapreduce.lib.chain.TestChainErrors.testChainMapNoOuptut(TestChainErrors.java:142)


REGRESSION:  org.apache.hadoop.mapreduce.lib.chain.TestChainErrors.testChainReduceNoOuptut

Error Message:
chmod: cannot access `/tmp/hadoop-hudson/mapred/staging/hudson926822845/.staging/job_local_0004': No such file or directory 

Stack Trace:
org.apache.hadoop.util.Shell$ExitCodeException: chmod: cannot access `/tmp/hadoop-hudson/mapred/staging/hudson926822845/.staging/job_local_0004': No such file or directory

	at org.apache.hadoop.util.Shell.runCommand(Shell.java:261)
	at org.apache.hadoop.util.Shell.run(Shell.java:188)
	at org.apache.hadoop.util.Shell$ShellCommandExecutor.execute(Shell.java:381)
	at org.apache.hadoop.util.Shell.execCommand(Shell.java:467)
	at org.apache.hadoop.util.Shell.execCommand(Shell.java:450)
	at org.apache.hadoop.fs.RawLocalFileSystem.execCommand(RawLocalFileSystem.java:549)
	at org.apache.hadoop.fs.RawLocalFileSystem.setPermission(RawLocalFileSystem.java:540)
	at org.apache.hadoop.fs.FilterFileSystem.setPermission(FilterFileSystem.java:353)
	at org.apache.hadoop.fs.FileSystem.mkdirs(FileSystem.java:428)
	at org.apache.hadoop.mapreduce.JobSubmitter.copyAndConfigureFiles(JobSubmitter.java:166)
	at org.apache.hadoop.mapreduce.JobSubmitter.copyAndConfigureFiles(JobSubmitter.java:283)
	at org.apache.hadoop.mapreduce.JobSubmitter.submitJobInternal(JobSubmitter.java:350)
	at org.apache.hadoop.mapreduce.Job$2.run(Job.java:1037)
	at org.apache.hadoop.mapreduce.Job$2.run(Job.java:1034)
	at java.security.AccessController.doPrivileged(Native Method)
	at javax.security.auth.Subject.doAs(Subject.java:396)
	at org.apache.hadoop.security.UserGroupInformation.doAs(UserGroupInformation.java:1142)
	at org.apache.hadoop.mapreduce.Job.submit(Job.java:1034)
	at org.apache.hadoop.mapreduce.Job.waitForCompletion(Job.java:1054)
	at org.apache.hadoop.mapreduce.lib.chain.TestChainErrors.__CLR3_0_24qjj5yh29(TestChainErrors.java:182)
	at org.apache.hadoop.mapreduce.lib.chain.TestChainErrors.testChainReduceNoOuptut(TestChainErrors.java:166)


REGRESSION:  org.apache.hadoop.mapreduce.lib.chain.TestMapReduceChain.testChain

Error Message:
chmod: cannot access `/tmp/hadoop-hudson/mapred/staging/hudson-552663712/.staging/job_local_0001': No such file or directory 

Stack Trace:
org.apache.hadoop.util.Shell$ExitCodeException: chmod: cannot access `/tmp/hadoop-hudson/mapred/staging/hudson-552663712/.staging/job_local_0001': No such file or directory

	at org.apache.hadoop.util.Shell.runCommand(Shell.java:261)
	at org.apache.hadoop.util.Shell.run(Shell.java:188)
	at org.apache.hadoop.util.Shell$ShellCommandExecutor.execute(Shell.java:381)
	at org.apache.hadoop.util.Shell.execCommand(Shell.java:467)
	at org.apache.hadoop.util.Shell.execCommand(Shell.java:450)
	at org.apache.hadoop.fs.RawLocalFileSystem.execCommand(RawLocalFileSystem.java:549)
	at org.apache.hadoop.fs.RawLocalFileSystem.setPermission(RawLocalFileSystem.java:540)
	at org.apache.hadoop.fs.FilterFileSystem.setPermission(FilterFileSystem.java:353)
	at org.apache.hadoop.fs.FileSystem.mkdirs(FileSystem.java:428)
	at org.apache.hadoop.mapreduce.JobSubmitter.copyAndConfigureFiles(JobSubmitter.java:166)
	at org.apache.hadoop.mapreduce.JobSubmitter.copyAndConfigureFiles(JobSubmitter.java:283)
	at org.apache.hadoop.mapreduce.JobSubmitter.submitJobInternal(JobSubmitter.java:350)
	at org.apache.hadoop.mapreduce.Job$2.run(Job.java:1037)
	at org.apache.hadoop.mapreduce.Job$2.run(Job.java:1034)
	at java.security.AccessController.doPrivileged(Native Method)
	at javax.security.auth.Subject.doAs(Subject.java:396)
	at org.apache.hadoop.security.UserGroupInformation.doAs(UserGroupInformation.java:1142)
	at org.apache.hadoop.mapreduce.Job.submit(Job.java:1034)
	at org.apache.hadoop.mapreduce.Job.waitForCompletion(Job.java:1054)
	at org.apache.hadoop.mapreduce.lib.chain.TestMapReduceChain.__CLR3_0_2ke5z1ypkc(TestMapReduceChain.java:106)
	at org.apache.hadoop.mapreduce.lib.chain.TestMapReduceChain.testChain(TestMapReduceChain.java:66)


REGRESSION:  org.apache.hadoop.mapreduce.lib.chain.TestSingleElementChain.testNoChain

Error Message:
chmod: cannot access `/tmp/hadoop-hudson/mapred/staging/hudson-246900235/.staging/job_local_0001': No such file or directory 

Stack Trace:
org.apache.hadoop.util.Shell$ExitCodeException: chmod: cannot access `/tmp/hadoop-hudson/mapred/staging/hudson-246900235/.staging/job_local_0001': No such file or directory

	at org.apache.hadoop.util.Shell.runCommand(Shell.java:261)
	at org.apache.hadoop.util.Shell.run(Shell.java:188)
	at org.apache.hadoop.util.Shell$ShellCommandExecutor.execute(Shell.java:381)
	at org.apache.hadoop.util.Shell.execCommand(Shell.java:467)
	at org.apache.hadoop.util.Shell.execCommand(Shell.java:450)
	at org.apache.hadoop.fs.RawLocalFileSystem.execCommand(RawLocalFileSystem.java:549)
	at org.apache.hadoop.fs.RawLocalFileSystem.setPermission(RawLocalFileSystem.java:540)
	at org.apache.hadoop.fs.FilterFileSystem.setPermission(FilterFileSystem.java:353)
	at org.apache.hadoop.fs.FileSystem.mkdirs(FileSystem.java:428)
	at org.apache.hadoop.mapreduce.JobSubmitter.copyAndConfigureFiles(JobSubmitter.java:166)
	at org.apache.hadoop.mapreduce.JobSubmitter.copyAndConfigureFiles(JobSubmitter.java:283)
	at org.apache.hadoop.mapreduce.JobSubmitter.submitJobInternal(JobSubmitter.java:350)
	at org.apache.hadoop.mapreduce.Job$2.run(Job.java:1037)
	at org.apache.hadoop.mapreduce.Job$2.run(Job.java:1034)
	at java.security.AccessController.doPrivileged(Native Method)
	at javax.security.auth.Subject.doAs(Subject.java:396)
	at org.apache.hadoop.security.UserGroupInformation.doAs(UserGroupInformation.java:1142)
	at org.apache.hadoop.mapreduce.Job.submit(Job.java:1034)
	at org.apache.hadoop.mapreduce.Job.waitForCompletion(Job.java:1054)
	at org.apache.hadoop.mapreduce.lib.chain.TestSingleElementChain.__CLR3_0_2tfhzhngfx(TestSingleElementChain.java:62)
	at org.apache.hadoop.mapreduce.lib.chain.TestSingleElementChain.testNoChain(TestSingleElementChain.java:45)


REGRESSION:  org.apache.hadoop.mapreduce.lib.db.TestDBJob.testRun

Error Message:
chmod: cannot access `/tmp/hadoop-hudson/mapred/staging/hudson-1751223343/.staging/job_local_0001': No such file or directory 

Stack Trace:
org.apache.hadoop.util.Shell$ExitCodeException: chmod: cannot access `/tmp/hadoop-hudson/mapred/staging/hudson-1751223343/.staging/job_local_0001': No such file or directory

	at org.apache.hadoop.util.Shell.runCommand(Shell.java:261)
	at org.apache.hadoop.util.Shell.run(Shell.java:188)
	at org.apache.hadoop.util.Shell$ShellCommandExecutor.execute(Shell.java:381)
	at org.apache.hadoop.util.Shell.execCommand(Shell.java:467)
	at org.apache.hadoop.util.Shell.execCommand(Shell.java:450)
	at org.apache.hadoop.fs.RawLocalFileSystem.execCommand(RawLocalFileSystem.java:549)
	at org.apache.hadoop.fs.RawLocalFileSystem.setPermission(RawLocalFileSystem.java:540)
	at org.apache.hadoop.fs.FilterFileSystem.setPermission(FilterFileSystem.java:353)
	at org.apache.hadoop.fs.FileSystem.mkdirs(FileSystem.java:428)
	at org.apache.hadoop.mapreduce.JobSubmitter.copyAndConfigureFiles(JobSubmitter.java:166)
	at org.apache.hadoop.mapreduce.JobSubmitter.copyAndConfigureFiles(JobSubmitter.java:283)
	at org.apache.hadoop.mapreduce.JobSubmitter.submitJobInternal(JobSubmitter.java:350)
	at org.apache.hadoop.mapreduce.Job$2.run(Job.java:1037)
	at org.apache.hadoop.mapreduce.Job$2.run(Job.java:1034)
	at java.security.AccessController.doPrivileged(Native Method)
	at javax.security.auth.Subject.doAs(Subject.java:396)
	at org.apache.hadoop.security.UserGroupInformation.doAs(UserGroupInformation.java:1142)
	at org.apache.hadoop.mapreduce.Job.submit(Job.java:1034)
	at org.apache.hadoop.mapreduce.Job.waitForCompletion(Job.java:1054)
	at org.apache.hadoop.examples.DBCountPageView.run(DBCountPageView.java:409)
	at org.apache.hadoop.util.ToolRunner.run(ToolRunner.java:69)
	at org.apache.hadoop.mapreduce.lib.db.TestDBJob.__CLR3_0_2yzvxa8lsk(TestDBJob.java:36)
	at org.apache.hadoop.mapreduce.lib.db.TestDBJob.testRun(TestDBJob.java:34)


REGRESSION:  org.apache.hadoop.mapreduce.lib.db.TestDataDrivenDBInputFormat.testDateSplits

Error Message:
chmod: cannot access `/tmp/hadoop-hudson/mapred/staging/hudson1101671200/.staging/job_local_0001': No such file or directory 

Stack Trace:
org.apache.hadoop.util.Shell$ExitCodeException: chmod: cannot access `/tmp/hadoop-hudson/mapred/staging/hudson1101671200/.staging/job_local_0001': No such file or directory

	at org.apache.hadoop.util.Shell.runCommand(Shell.java:261)
	at org.apache.hadoop.util.Shell.run(Shell.java:188)
	at org.apache.hadoop.util.Shell$ShellCommandExecutor.execute(Shell.java:381)
	at org.apache.hadoop.util.Shell.execCommand(Shell.java:467)
	at org.apache.hadoop.util.Shell.execCommand(Shell.java:450)
	at org.apache.hadoop.fs.RawLocalFileSystem.execCommand(RawLocalFileSystem.java:549)
	at org.apache.hadoop.fs.RawLocalFileSystem.setPermission(RawLocalFileSystem.java:540)
	at org.apache.hadoop.fs.FilterFileSystem.setPermission(FilterFileSystem.java:353)
	at org.apache.hadoop.fs.FileSystem.mkdirs(FileSystem.java:428)
	at org.apache.hadoop.mapreduce.JobSubmitter.copyAndConfigureFiles(JobSubmitter.java:166)
	at org.apache.hadoop.mapreduce.JobSubmitter.copyAndConfigureFiles(JobSubmitter.java:283)
	at org.apache.hadoop.mapreduce.JobSubmitter.submitJobInternal(JobSubmitter.java:350)
	at org.apache.hadoop.mapreduce.Job$2.run(Job.java:1037)
	at org.apache.hadoop.mapreduce.Job$2.run(Job.java:1034)
	at java.security.AccessController.doPrivileged(Native Method)
	at javax.security.auth.Subject.doAs(Subject.java:396)
	at org.apache.hadoop.security.UserGroupInformation.doAs(UserGroupInformation.java:1142)
	at org.apache.hadoop.mapreduce.Job.submit(Job.java:1034)
	at org.apache.hadoop.mapreduce.Job.waitForCompletion(Job.java:1054)
	at org.apache.hadoop.mapreduce.lib.db.TestDataDrivenDBInputFormat.__CLR3_0_2klofnkshw(TestDataDrivenDBInputFormat.java:214)
	at org.apache.hadoop.mapreduce.lib.db.TestDataDrivenDBInputFormat.testDateSplits(TestDataDrivenDBInputFormat.java:173)


REGRESSION:  org.apache.hadoop.mapreduce.lib.fieldsel.TestMRFieldSelection.testFieldSelection

Error Message:
chmod: cannot access `/tmp/hadoop-hudson/mapred/staging/hudson1855438399/.staging/job_local_0001': No such file or directory 

Stack Trace:
org.apache.hadoop.util.Shell$ExitCodeException: chmod: cannot access `/tmp/hadoop-hudson/mapred/staging/hudson1855438399/.staging/job_local_0001': No such file or directory

	at org.apache.hadoop.util.Shell.runCommand(Shell.java:261)
	at org.apache.hadoop.util.Shell.run(Shell.java:188)
	at org.apache.hadoop.util.Shell$ShellCommandExecutor.execute(Shell.java:381)
	at org.apache.hadoop.util.Shell.execCommand(Shell.java:467)
	at org.apache.hadoop.util.Shell.execCommand(Shell.java:450)
	at org.apache.hadoop.fs.RawLocalFileSystem.execCommand(RawLocalFileSystem.java:549)
	at org.apache.hadoop.fs.RawLocalFileSystem.setPermission(RawLocalFileSystem.java:540)
	at org.apache.hadoop.fs.FilterFileSystem.setPermission(FilterFileSystem.java:353)
	at org.apache.hadoop.fs.FileSystem.mkdirs(FileSystem.java:428)
	at org.apache.hadoop.mapreduce.JobSubmitter.copyAndConfigureFiles(JobSubmitter.java:166)
	at org.apache.hadoop.mapreduce.JobSubmitter.copyAndConfigureFiles(JobSubmitter.java:283)
	at org.apache.hadoop.mapreduce.JobSubmitter.submitJobInternal(JobSubmitter.java:350)
	at org.apache.hadoop.mapreduce.Job$2.run(Job.java:1037)
	at org.apache.hadoop.mapreduce.Job$2.run(Job.java:1034)
	at java.security.AccessController.doPrivileged(Native Method)
	at javax.security.auth.Subject.doAs(Subject.java:396)
	at org.apache.hadoop.security.UserGroupInformation.doAs(UserGroupInformation.java:1142)
	at org.apache.hadoop.mapreduce.Job.submit(Job.java:1034)
	at org.apache.hadoop.mapreduce.Job.waitForCompletion(Job.java:1054)
	at org.apache.hadoop.mapreduce.lib.fieldsel.TestMRFieldSelection.launch(TestMRFieldSelection.java:67)
	at org.apache.hadoop.mapreduce.lib.fieldsel.TestMRFieldSelection.__CLR3_0_2asm65nlmf(TestMRFieldSelection.java:38)
	at org.apache.hadoop.mapreduce.lib.fieldsel.TestMRFieldSelection.testFieldSelection(TestMRFieldSelection.java:37)


REGRESSION:  org.apache.hadoop.mapreduce.lib.input.TestLineRecordReader.testCustomRecordDelimiters

Error Message:
chmod: cannot access `/tmp/hadoop-hudson/mapred/staging/hudson-506883652/.staging/job_local_0001': No such file or directory 

Stack Trace:
org.apache.hadoop.util.Shell$ExitCodeException: chmod: cannot access `/tmp/hadoop-hudson/mapred/staging/hudson-506883652/.staging/job_local_0001': No such file or directory

	at org.apache.hadoop.util.Shell.runCommand(Shell.java:261)
	at org.apache.hadoop.util.Shell.run(Shell.java:188)
	at org.apache.hadoop.util.Shell$ShellCommandExecutor.execute(Shell.java:381)
	at org.apache.hadoop.util.Shell.execCommand(Shell.java:467)
	at org.apache.hadoop.util.Shell.execCommand(Shell.java:450)
	at org.apache.hadoop.fs.RawLocalFileSystem.execCommand(RawLocalFileSystem.java:549)
	at org.apache.hadoop.fs.RawLocalFileSystem.setPermission(RawLocalFileSystem.java:540)
	at org.apache.hadoop.fs.FilterFileSystem.setPermission(FilterFileSystem.java:353)
	at org.apache.hadoop.fs.FileSystem.mkdirs(FileSystem.java:428)
	at org.apache.hadoop.mapreduce.JobSubmitter.copyAndConfigureFiles(JobSubmitter.java:166)
	at org.apache.hadoop.mapreduce.JobSubmitter.copyAndConfigureFiles(JobSubmitter.java:283)
	at org.apache.hadoop.mapreduce.JobSubmitter.submitJobInternal(JobSubmitter.java:350)
	at org.apache.hadoop.mapreduce.Job$2.run(Job.java:1037)
	at org.apache.hadoop.mapreduce.Job$2.run(Job.java:1034)
	at java.security.AccessController.doPrivileged(Native Method)
	at javax.security.auth.Subject.doAs(Subject.java:396)
	at org.apache.hadoop.security.UserGroupInformation.doAs(UserGroupInformation.java:1142)
	at org.apache.hadoop.mapreduce.Job.submit(Job.java:1034)
	at org.apache.hadoop.mapreduce.Job.waitForCompletion(Job.java:1054)
	at org.apache.hadoop.mapreduce.lib.input.TestLineRecordReader.createAndRunJob(TestLineRecordReader.java:92)
	at org.apache.hadoop.mapreduce.lib.input.TestLineRecordReader.__CLR3_0_2xdlwnbtoi(TestLineRecordReader.java:113)
	at org.apache.hadoop.mapreduce.lib.input.TestLineRecordReader.testCustomRecordDelimiters(TestLineRecordReader.java:105)


REGRESSION:  org.apache.hadoop.mapreduce.lib.input.TestLineRecordReader.testDefaultRecordDelimiters

Error Message:
chmod: cannot access `/tmp/hadoop-hudson/mapred/staging/hudson-1301474892/.staging/job_local_0002': No such file or directory 

Stack Trace:
org.apache.hadoop.util.Shell$ExitCodeException: chmod: cannot access `/tmp/hadoop-hudson/mapred/staging/hudson-1301474892/.staging/job_local_0002': No such file or directory

	at org.apache.hadoop.util.Shell.runCommand(Shell.java:261)
	at org.apache.hadoop.util.Shell.run(Shell.java:188)
	at org.apache.hadoop.util.Shell$ShellCommandExecutor.execute(Shell.java:381)
	at org.apache.hadoop.util.Shell.execCommand(Shell.java:467)
	at org.apache.hadoop.util.Shell.execCommand(Shell.java:450)
	at org.apache.hadoop.fs.RawLocalFileSystem.execCommand(RawLocalFileSystem.java:549)
	at org.apache.hadoop.fs.RawLocalFileSystem.setPermission(RawLocalFileSystem.java:540)
	at org.apache.hadoop.fs.FilterFileSystem.setPermission(FilterFileSystem.java:353)
	at org.apache.hadoop.fs.FileSystem.mkdirs(FileSystem.java:428)
	at org.apache.hadoop.mapreduce.JobSubmitter.copyAndConfigureFiles(JobSubmitter.java:166)
	at org.apache.hadoop.mapreduce.JobSubmitter.copyAndConfigureFiles(JobSubmitter.java:283)
	at org.apache.hadoop.mapreduce.JobSubmitter.submitJobInternal(JobSubmitter.java:350)
	at org.apache.hadoop.mapreduce.Job$2.run(Job.java:1037)
	at org.apache.hadoop.mapreduce.Job$2.run(Job.java:1034)
	at java.security.AccessController.doPrivileged(Native Method)
	at javax.security.auth.Subject.doAs(Subject.java:396)
	at org.apache.hadoop.security.UserGroupInformation.doAs(UserGroupInformation.java:1142)
	at org.apache.hadoop.mapreduce.Job.submit(Job.java:1034)
	at org.apache.hadoop.mapreduce.Job.waitForCompletion(Job.java:1054)
	at org.apache.hadoop.mapreduce.lib.input.TestLineRecordReader.createAndRunJob(TestLineRecordReader.java:92)
	at org.apache.hadoop.mapreduce.lib.input.TestLineRecordReader.__CLR3_0_2qb6z77tor(TestLineRecordReader.java:135)
	at org.apache.hadoop.mapreduce.lib.input.TestLineRecordReader.testDefaultRecordDelimiters(TestLineRecordReader.java:128)


REGRESSION:  org.apache.hadoop.mapreduce.lib.input.TestMultipleInputs.testDoMultipleInputs

Error Message:
chmod: cannot access `/tmp/hadoop-hudson/mapred/staging/hudson-136987387/.staging/job_local_0001': No such file or directory 

Stack Trace:
org.apache.hadoop.util.Shell$ExitCodeException: chmod: cannot access `/tmp/hadoop-hudson/mapred/staging/hudson-136987387/.staging/job_local_0001': No such file or directory

	at org.apache.hadoop.util.Shell.runCommand(Shell.java:261)
	at org.apache.hadoop.util.Shell.run(Shell.java:188)
	at org.apache.hadoop.util.Shell$ShellCommandExecutor.execute(Shell.java:381)
	at org.apache.hadoop.util.Shell.execCommand(Shell.java:467)
	at org.apache.hadoop.util.Shell.execCommand(Shell.java:450)
	at org.apache.hadoop.fs.RawLocalFileSystem.execCommand(RawLocalFileSystem.java:549)
	at org.apache.hadoop.fs.RawLocalFileSystem.setPermission(RawLocalFileSystem.java:540)
	at org.apache.hadoop.fs.FilterFileSystem.setPermission(FilterFileSystem.java:353)
	at org.apache.hadoop.fs.FileSystem.mkdirs(FileSystem.java:428)
	at org.apache.hadoop.mapreduce.JobSubmitter.copyAndConfigureFiles(JobSubmitter.java:166)
	at org.apache.hadoop.mapreduce.JobSubmitter.copyAndConfigureFiles(JobSubmitter.java:283)
	at org.apache.hadoop.mapreduce.JobSubmitter.submitJobInternal(JobSubmitter.java:350)
	at org.apache.hadoop.mapreduce.Job$2.run(Job.java:1037)
	at org.apache.hadoop.mapreduce.Job$2.run(Job.java:1034)
	at java.security.AccessController.doPrivileged(Native Method)
	at javax.security.auth.Subject.doAs(Subject.java:396)
	at org.apache.hadoop.security.UserGroupInformation.doAs(UserGroupInformation.java:1142)
	at org.apache.hadoop.mapreduce.Job.submit(Job.java:1034)
	at org.apache.hadoop.mapreduce.Job.waitForCompletion(Job.java:1054)
	at org.apache.hadoop.mapreduce.lib.input.TestMultipleInputs.__CLR3_0_2l9fkqlcrk(TestMultipleInputs.java:122)
	at org.apache.hadoop.mapreduce.lib.input.TestMultipleInputs.testDoMultipleInputs(TestMultipleInputs.java:85)


REGRESSION:  org.apache.hadoop.mapreduce.lib.jobcontrol.TestMapReduceJobControl.testJobControlWithKillJob

Error Message:
Timeout occurred. Please note the time in the report does not reflect the time until the timeout.

Stack Trace:
junit.framework.AssertionFailedError: Timeout occurred. Please note the time in the report does not reflect the time until the timeout.


REGRESSION:  org.apache.hadoop.mapreduce.lib.join.TestJoinDatamerge.testSimpleInnerJoin

Error Message:
chmod: cannot access `/tmp/hadoop-hudson/mapred/staging/hudson-946385016/.staging/job_local_0001': No such file or directory 

Stack Trace:
org.apache.hadoop.util.Shell$ExitCodeException: chmod: cannot access `/tmp/hadoop-hudson/mapred/staging/hudson-946385016/.staging/job_local_0001': No such file or directory

	at org.apache.hadoop.util.Shell.runCommand(Shell.java:261)
	at org.apache.hadoop.util.Shell.run(Shell.java:188)
	at org.apache.hadoop.util.Shell$ShellCommandExecutor.execute(Shell.java:381)
	at org.apache.hadoop.util.Shell.execCommand(Shell.java:467)
	at org.apache.hadoop.util.Shell.execCommand(Shell.java:450)
	at org.apache.hadoop.fs.RawLocalFileSystem.execCommand(RawLocalFileSystem.java:549)
	at org.apache.hadoop.fs.RawLocalFileSystem.setPermission(RawLocalFileSystem.java:540)
	at org.apache.hadoop.fs.FilterFileSystem.setPermission(FilterFileSystem.java:353)
	at org.apache.hadoop.fs.FileSystem.mkdirs(FileSystem.java:428)
	at org.apache.hadoop.mapreduce.JobSubmitter.copyAndConfigureFiles(JobSubmitter.java:166)
	at org.apache.hadoop.mapreduce.JobSubmitter.copyAndConfigureFiles(JobSubmitter.java:283)
	at org.apache.hadoop.mapreduce.JobSubmitter.submitJobInternal(JobSubmitter.java:350)
	at org.apache.hadoop.mapreduce.Job$2.run(Job.java:1037)
	at org.apache.hadoop.mapreduce.Job$2.run(Job.java:1034)
	at java.security.AccessController.doPrivileged(Native Method)
	at javax.security.auth.Subject.doAs(Subject.java:396)
	at org.apache.hadoop.security.UserGroupInformation.doAs(UserGroupInformation.java:1142)
	at org.apache.hadoop.mapreduce.Job.submit(Job.java:1034)
	at org.apache.hadoop.mapreduce.Job.waitForCompletion(Job.java:1054)
	at org.apache.hadoop.mapreduce.lib.join.TestJoinDatamerge.joinAs(TestJoinDatamerge.java:267)
	at org.apache.hadoop.mapreduce.lib.join.TestJoinDatamerge.__CLR3_0_239fxnhf4e(TestJoinDatamerge.java:276)
	at org.apache.hadoop.mapreduce.lib.join.TestJoinDatamerge.testSimpleInnerJoin(TestJoinDatamerge.java:275)
	at junit.extensions.TestDecorator.basicRun(TestDecorator.java:24)
	at junit.extensions.TestSetup$1.protect(TestSetup.java:23)
	at junit.extensions.TestSetup.run(TestSetup.java:27)


REGRESSION:  org.apache.hadoop.mapreduce.lib.join.TestJoinDatamerge.testSimpleOuterJoin

Error Message:
chmod: cannot access `/tmp/hadoop-hudson/mapred/staging/hudson480129891/.staging/job_local_0002': No such file or directory 

Stack Trace:
org.apache.hadoop.util.Shell$ExitCodeException: chmod: cannot access `/tmp/hadoop-hudson/mapred/staging/hudson480129891/.staging/job_local_0002': No such file or directory

	at org.apache.hadoop.util.Shell.runCommand(Shell.java:261)
	at org.apache.hadoop.util.Shell.run(Shell.java:188)
	at org.apache.hadoop.util.Shell$ShellCommandExecutor.execute(Shell.java:381)
	at org.apache.hadoop.util.Shell.execCommand(Shell.java:467)
	at org.apache.hadoop.util.Shell.execCommand(Shell.java:450)
	at org.apache.hadoop.fs.RawLocalFileSystem.execCommand(RawLocalFileSystem.java:549)
	at org.apache.hadoop.fs.RawLocalFileSystem.setPermission(RawLocalFileSystem.java:540)
	at org.apache.hadoop.fs.FilterFileSystem.setPermission(FilterFileSystem.java:353)
	at org.apache.hadoop.fs.FileSystem.mkdirs(FileSystem.java:428)
	at org.apache.hadoop.mapreduce.JobSubmitter.copyAndConfigureFiles(JobSubmitter.java:166)
	at org.apache.hadoop.mapreduce.JobSubmitter.copyAndConfigureFiles(JobSubmitter.java:283)
	at org.apache.hadoop.mapreduce.JobSubmitter.submitJobInternal(JobSubmitter.java:350)
	at org.apache.hadoop.mapreduce.Job$2.run(Job.java:1037)
	at org.apache.hadoop.mapreduce.Job$2.run(Job.java:1034)
	at java.security.AccessController.doPrivileged(Native Method)
	at javax.security.auth.Subject.doAs(Subject.java:396)
	at org.apache.hadoop.security.UserGroupInformation.doAs(UserGroupInformation.java:1142)
	at org.apache.hadoop.mapreduce.Job.submit(Job.java:1034)
	at org.apache.hadoop.mapreduce.Job.waitForCompletion(Job.java:1054)
	at org.apache.hadoop.mapreduce.lib.join.TestJoinDatamerge.joinAs(TestJoinDatamerge.java:267)
	at org.apache.hadoop.mapreduce.lib.join.TestJoinDatamerge.__CLR3_0_2abzcwof4g(TestJoinDatamerge.java:280)
	at org.apache.hadoop.mapreduce.lib.join.TestJoinDatamerge.testSimpleOuterJoin(TestJoinDatamerge.java:279)
	at junit.extensions.TestDecorator.basicRun(TestDecorator.java:24)
	at junit.extensions.TestSetup$1.protect(TestSetup.java:23)
	at junit.extensions.TestSetup.run(TestSetup.java:27)


REGRESSION:  org.apache.hadoop.mapreduce.lib.join.TestJoinDatamerge.testSimpleOverride

Error Message:
chmod: cannot access `/tmp/hadoop-hudson/mapred/staging/hudson-2021793446/.staging/job_local_0003': No such file or directory 

Stack Trace:
org.apache.hadoop.util.Shell$ExitCodeException: chmod: cannot access `/tmp/hadoop-hudson/mapred/staging/hudson-2021793446/.staging/job_local_0003': No such file or directory

	at org.apache.hadoop.util.Shell.runCommand(Shell.java:261)
	at org.apache.hadoop.util.Shell.run(Shell.java:188)
	at org.apache.hadoop.util.Shell$ShellCommandExecutor.execute(Shell.java:381)
	at org.apache.hadoop.util.Shell.execCommand(Shell.java:467)
	at org.apache.hadoop.util.Shell.execCommand(Shell.java:450)
	at org.apache.hadoop.fs.RawLocalFileSystem.execCommand(RawLocalFileSystem.java:549)
	at org.apache.hadoop.fs.RawLocalFileSystem.setPermission(RawLocalFileSystem.java:540)
	at org.apache.hadoop.fs.FilterFileSystem.setPermission(FilterFileSystem.java:353)
	at org.apache.hadoop.fs.FileSystem.mkdirs(FileSystem.java:428)
	at org.apache.hadoop.mapreduce.JobSubmitter.copyAndConfigureFiles(JobSubmitter.java:166)
	at org.apache.hadoop.mapreduce.JobSubmitter.copyAndConfigureFiles(JobSubmitter.java:283)
	at org.apache.hadoop.mapreduce.JobSubmitter.submitJobInternal(JobSubmitter.java:350)
	at org.apache.hadoop.mapreduce.Job$2.run(Job.java:1037)
	at org.apache.hadoop.mapreduce.Job$2.run(Job.java:1034)
	at java.security.AccessController.doPrivileged(Native Method)
	at javax.security.auth.Subject.doAs(Subject.java:396)
	at org.apache.hadoop.security.UserGroupInformation.doAs(UserGroupInformation.java:1142)
	at org.apache.hadoop.mapreduce.Job.submit(Job.java:1034)
	at org.apache.hadoop.mapreduce.Job.waitForCompletion(Job.java:1054)
	at org.apache.hadoop.mapreduce.lib.join.TestJoinDatamerge.joinAs(TestJoinDatamerge.java:267)
	at org.apache.hadoop.mapreduce.lib.join.TestJoinDatamerge.__CLR3_0_2a19allf5f(TestJoinDatamerge.java:327)
	at org.apache.hadoop.mapreduce.lib.join.TestJoinDatamerge.testSimpleOverride(TestJoinDatamerge.java:326)
	at junit.extensions.TestDecorator.basicRun(TestDecorator.java:24)
	at junit.extensions.TestSetup$1.protect(TestSetup.java:23)
	at junit.extensions.TestSetup.run(TestSetup.java:27)


REGRESSION:  org.apache.hadoop.mapreduce.lib.join.TestJoinDatamerge.testNestedJoin

Error Message:
chmod: cannot access `/tmp/hadoop-hudson/mapred/staging/hudson1560182809/.staging/job_local_0004': No such file or directory 

Stack Trace:
org.apache.hadoop.util.Shell$ExitCodeException: chmod: cannot access `/tmp/hadoop-hudson/mapred/staging/hudson1560182809/.staging/job_local_0004': No such file or directory

	at org.apache.hadoop.util.Shell.runCommand(Shell.java:261)
	at org.apache.hadoop.util.Shell.run(Shell.java:188)
	at org.apache.hadoop.util.Shell$ShellCommandExecutor.execute(Shell.java:381)
	at org.apache.hadoop.util.Shell.execCommand(Shell.java:467)
	at org.apache.hadoop.util.Shell.execCommand(Shell.java:450)
	at org.apache.hadoop.fs.RawLocalFileSystem.execCommand(RawLocalFileSystem.java:549)
	at org.apache.hadoop.fs.RawLocalFileSystem.setPermission(RawLocalFileSystem.java:540)
	at org.apache.hadoop.fs.FilterFileSystem.setPermission(FilterFileSystem.java:353)
	at org.apache.hadoop.fs.FileSystem.mkdirs(FileSystem.java:428)
	at org.apache.hadoop.mapreduce.JobSubmitter.copyAndConfigureFiles(JobSubmitter.java:166)
	at org.apache.hadoop.mapreduce.JobSubmitter.copyAndConfigureFiles(JobSubmitter.java:283)
	at org.apache.hadoop.mapreduce.JobSubmitter.submitJobInternal(JobSubmitter.java:350)
	at org.apache.hadoop.mapreduce.Job$2.run(Job.java:1037)
	at org.apache.hadoop.mapreduce.Job$2.run(Job.java:1034)
	at java.security.AccessController.doPrivileged(Native Method)
	at javax.security.auth.Subject.doAs(Subject.java:396)
	at org.apache.hadoop.security.UserGroupInformation.doAs(UserGroupInformation.java:1142)
	at org.apache.hadoop.mapreduce.Job.submit(Job.java:1034)
	at org.apache.hadoop.mapreduce.Job.waitForCompletion(Job.java:1054)
	at org.apache.hadoop.mapreduce.lib.join.TestJoinDatamerge.__CLR3_0_2fidujef5h(TestJoinDatamerge.java:390)
	at org.apache.hadoop.mapreduce.lib.join.TestJoinDatamerge.testNestedJoin(TestJoinDatamerge.java:330)
	at junit.extensions.TestDecorator.basicRun(TestDecorator.java:24)
	at junit.extensions.TestSetup$1.protect(TestSetup.java:23)
	at junit.extensions.TestSetup.run(TestSetup.java:27)


REGRESSION:  org.apache.hadoop.mapreduce.lib.join.TestJoinDatamerge.testEmptyJoin

Error Message:
chmod: cannot access `/tmp/hadoop-hudson/mapred/staging/hudson2067620865/.staging/job_local_0005': No such file or directory 

Stack Trace:
org.apache.hadoop.util.Shell$ExitCodeException: chmod: cannot access `/tmp/hadoop-hudson/mapred/staging/hudson2067620865/.staging/job_local_0005': No such file or directory

	at org.apache.hadoop.util.Shell.runCommand(Shell.java:261)
	at org.apache.hadoop.util.Shell.run(Shell.java:188)
	at org.apache.hadoop.util.Shell$ShellCommandExecutor.execute(Shell.java:381)
	at org.apache.hadoop.util.Shell.execCommand(Shell.java:467)
	at org.apache.hadoop.util.Shell.execCommand(Shell.java:450)
	at org.apache.hadoop.fs.RawLocalFileSystem.execCommand(RawLocalFileSystem.java:549)
	at org.apache.hadoop.fs.RawLocalFileSystem.setPermission(RawLocalFileSystem.java:540)
	at org.apache.hadoop.fs.FilterFileSystem.setPermission(FilterFileSystem.java:353)
	at org.apache.hadoop.fs.FileSystem.mkdirs(FileSystem.java:428)
	at org.apache.hadoop.mapreduce.JobSubmitter.copyAndConfigureFiles(JobSubmitter.java:166)
	at org.apache.hadoop.mapreduce.JobSubmitter.copyAndConfigureFiles(JobSubmitter.java:283)
	at org.apache.hadoop.mapreduce.JobSubmitter.submitJobInternal(JobSubmitter.java:350)
	at org.apache.hadoop.mapreduce.Job$2.run(Job.java:1037)
	at org.apache.hadoop.mapreduce.Job$2.run(Job.java:1034)
	at java.security.AccessController.doPrivileged(Native Method)
	at javax.security.auth.Subject.doAs(Subject.java:396)
	at org.apache.hadoop.security.UserGroupInformation.doAs(UserGroupInformation.java:1142)
	at org.apache.hadoop.mapreduce.Job.submit(Job.java:1034)
	at org.apache.hadoop.mapreduce.Job.waitForCompletion(Job.java:1054)
	at org.apache.hadoop.mapreduce.lib.join.TestJoinDatamerge.__CLR3_0_2f6b0b0f83(TestJoinDatamerge.java:442)
	at org.apache.hadoop.mapreduce.lib.join.TestJoinDatamerge.testEmptyJoin(TestJoinDatamerge.java:425)
	at junit.extensions.TestDecorator.basicRun(TestDecorator.java:24)
	at junit.extensions.TestSetup$1.protect(TestSetup.java:23)
	at junit.extensions.TestSetup.run(TestSetup.java:27)


REGRESSION:  org.apache.hadoop.mapreduce.lib.map.TestMultithreadedMapper.testOKRun

Error Message:
chmod: cannot access `/tmp/hadoop-hudson/mapred/staging/hudson1225521560/.staging/job_local_0001': No such file or directory 

Stack Trace:
org.apache.hadoop.util.Shell$ExitCodeException: chmod: cannot access `/tmp/hadoop-hudson/mapred/staging/hudson1225521560/.staging/job_local_0001': No such file or directory

	at org.apache.hadoop.util.Shell.runCommand(Shell.java:261)
	at org.apache.hadoop.util.Shell.run(Shell.java:188)
	at org.apache.hadoop.util.Shell$ShellCommandExecutor.execute(Shell.java:381)
	at org.apache.hadoop.util.Shell.execCommand(Shell.java:467)
	at org.apache.hadoop.util.Shell.execCommand(Shell.java:450)
	at org.apache.hadoop.fs.RawLocalFileSystem.execCommand(RawLocalFileSystem.java:549)
	at org.apache.hadoop.fs.RawLocalFileSystem.setPermission(RawLocalFileSystem.java:540)
	at org.apache.hadoop.fs.FilterFileSystem.setPermission(FilterFileSystem.java:353)
	at org.apache.hadoop.fs.FileSystem.mkdirs(FileSystem.java:428)
	at org.apache.hadoop.mapreduce.JobSubmitter.copyAndConfigureFiles(JobSubmitter.java:166)
	at org.apache.hadoop.mapreduce.JobSubmitter.copyAndConfigureFiles(JobSubmitter.java:283)
	at org.apache.hadoop.mapreduce.JobSubmitter.submitJobInternal(JobSubmitter.java:350)
	at org.apache.hadoop.mapreduce.Job$2.run(Job.java:1037)
	at org.apache.hadoop.mapreduce.Job$2.run(Job.java:1034)
	at java.security.AccessController.doPrivileged(Native Method)
	at javax.security.auth.Subject.doAs(Subject.java:396)
	at org.apache.hadoop.security.UserGroupInformation.doAs(UserGroupInformation.java:1142)
	at org.apache.hadoop.mapreduce.Job.submit(Job.java:1034)
	at org.apache.hadoop.mapreduce.Job.waitForCompletion(Job.java:1054)
	at org.apache.hadoop.mapreduce.lib.map.TestMultithreadedMapper.run(TestMultithreadedMapper.java:69)
	at org.apache.hadoop.mapreduce.lib.map.TestMultithreadedMapper.__CLR3_0_2dhspycp6e(TestMultithreadedMapper.java:37)
	at org.apache.hadoop.mapreduce.lib.map.TestMultithreadedMapper.testOKRun(TestMultithreadedMapper.java:36)


REGRESSION:  org.apache.hadoop.mapreduce.lib.map.TestMultithreadedMapper.testIOExRun

Error Message:
chmod: cannot access `/tmp/hadoop-hudson/mapred/staging/hudson580615887/.staging/job_local_0002': No such file or directory 

Stack Trace:
org.apache.hadoop.util.Shell$ExitCodeException: chmod: cannot access `/tmp/hadoop-hudson/mapred/staging/hudson580615887/.staging/job_local_0002': No such file or directory

	at org.apache.hadoop.util.Shell.runCommand(Shell.java:261)
	at org.apache.hadoop.util.Shell.run(Shell.java:188)
	at org.apache.hadoop.util.Shell$ShellCommandExecutor.execute(Shell.java:381)
	at org.apache.hadoop.util.Shell.execCommand(Shell.java:467)
	at org.apache.hadoop.util.Shell.execCommand(Shell.java:450)
	at org.apache.hadoop.fs.RawLocalFileSystem.execCommand(RawLocalFileSystem.java:549)
	at org.apache.hadoop.fs.RawLocalFileSystem.setPermission(RawLocalFileSystem.java:540)
	at org.apache.hadoop.fs.FilterFileSystem.setPermission(FilterFileSystem.java:353)
	at org.apache.hadoop.fs.FileSystem.mkdirs(FileSystem.java:428)
	at org.apache.hadoop.mapreduce.JobSubmitter.copyAndConfigureFiles(JobSubmitter.java:166)
	at org.apache.hadoop.mapreduce.JobSubmitter.copyAndConfigureFiles(JobSubmitter.java:283)
	at org.apache.hadoop.mapreduce.JobSubmitter.submitJobInternal(JobSubmitter.java:350)
	at org.apache.hadoop.mapreduce.Job$2.run(Job.java:1037)
	at org.apache.hadoop.mapreduce.Job$2.run(Job.java:1034)
	at java.security.AccessController.doPrivileged(Native Method)
	at javax.security.auth.Subject.doAs(Subject.java:396)
	at org.apache.hadoop.security.UserGroupInformation.doAs(UserGroupInformation.java:1142)
	at org.apache.hadoop.mapreduce.Job.submit(Job.java:1034)
	at org.apache.hadoop.mapreduce.Job.waitForCompletion(Job.java:1054)
	at org.apache.hadoop.mapreduce.lib.map.TestMultithreadedMapper.run(TestMultithreadedMapper.java:69)
	at org.apache.hadoop.mapreduce.lib.map.TestMultithreadedMapper.__CLR3_0_21nnwsnp6g(TestMultithreadedMapper.java:41)
	at org.apache.hadoop.mapreduce.lib.map.TestMultithreadedMapper.testIOExRun(TestMultithreadedMapper.java:40)


REGRESSION:  org.apache.hadoop.mapreduce.lib.map.TestMultithreadedMapper.testRuntimeExRun

Error Message:
chmod: cannot access `/tmp/hadoop-hudson/mapred/staging/hudson254538781/.staging/job_local_0003': No such file or directory 

Stack Trace:
org.apache.hadoop.util.Shell$ExitCodeException: chmod: cannot access `/tmp/hadoop-hudson/mapred/staging/hudson254538781/.staging/job_local_0003': No such file or directory

	at org.apache.hadoop.util.Shell.runCommand(Shell.java:261)
	at org.apache.hadoop.util.Shell.run(Shell.java:188)
	at org.apache.hadoop.util.Shell$ShellCommandExecutor.execute(Shell.java:381)
	at org.apache.hadoop.util.Shell.execCommand(Shell.java:467)
	at org.apache.hadoop.util.Shell.execCommand(Shell.java:450)
	at org.apache.hadoop.fs.RawLocalFileSystem.execCommand(RawLocalFileSystem.java:549)
	at org.apache.hadoop.fs.RawLocalFileSystem.setPermission(RawLocalFileSystem.java:540)
	at org.apache.hadoop.fs.FilterFileSystem.setPermission(FilterFileSystem.java:353)
	at org.apache.hadoop.fs.FileSystem.mkdirs(FileSystem.java:428)
	at org.apache.hadoop.mapreduce.JobSubmitter.copyAndConfigureFiles(JobSubmitter.java:166)
	at org.apache.hadoop.mapreduce.JobSubmitter.copyAndConfigureFiles(JobSubmitter.java:283)
	at org.apache.hadoop.mapreduce.JobSubmitter.submitJobInternal(JobSubmitter.java:350)
	at org.apache.hadoop.mapreduce.Job$2.run(Job.java:1037)
	at org.apache.hadoop.mapreduce.Job$2.run(Job.java:1034)
	at java.security.AccessController.doPrivileged(Native Method)
	at javax.security.auth.Subject.doAs(Subject.java:396)
	at org.apache.hadoop.security.UserGroupInformation.doAs(UserGroupInformation.java:1142)
	at org.apache.hadoop.mapreduce.Job.submit(Job.java:1034)
	at org.apache.hadoop.mapreduce.Job.waitForCompletion(Job.java:1054)
	at org.apache.hadoop.mapreduce.lib.map.TestMultithreadedMapper.run(TestMultithreadedMapper.java:69)
	at org.apache.hadoop.mapreduce.lib.map.TestMultithreadedMapper.__CLR3_0_2zf5zzbp6i(TestMultithreadedMapper.java:44)
	at org.apache.hadoop.mapreduce.lib.map.TestMultithreadedMapper.testRuntimeExRun(TestMultithreadedMapper.java:43)


REGRESSION:  org.apache.hadoop.mapreduce.lib.output.TestMRMultipleOutputs.testWithoutCounters

Error Message:
chmod: cannot access `/tmp/hadoop-hudson/mapred/staging/hudson799102578/.staging/job_local_0001': No such file or directory 

Stack Trace:
org.apache.hadoop.util.Shell$ExitCodeException: chmod: cannot access `/tmp/hadoop-hudson/mapred/staging/hudson799102578/.staging/job_local_0001': No such file or directory

	at org.apache.hadoop.util.Shell.runCommand(Shell.java:261)
	at org.apache.hadoop.util.Shell.run(Shell.java:188)
	at org.apache.hadoop.util.Shell$ShellCommandExecutor.execute(Shell.java:381)
	at org.apache.hadoop.util.Shell.execCommand(Shell.java:467)
	at org.apache.hadoop.util.Shell.execCommand(Shell.java:450)
	at org.apache.hadoop.fs.RawLocalFileSystem.execCommand(RawLocalFileSystem.java:549)
	at org.apache.hadoop.fs.RawLocalFileSystem.setPermission(RawLocalFileSystem.java:540)
	at org.apache.hadoop.fs.FilterFileSystem.setPermission(FilterFileSystem.java:353)
	at org.apache.hadoop.fs.FileSystem.mkdirs(FileSystem.java:428)
	at org.apache.hadoop.mapreduce.JobSubmitter.copyAndConfigureFiles(JobSubmitter.java:166)
	at org.apache.hadoop.mapreduce.JobSubmitter.copyAndConfigureFiles(JobSubmitter.java:283)
	at org.apache.hadoop.mapreduce.JobSubmitter.submitJobInternal(JobSubmitter.java:350)
	at org.apache.hadoop.mapreduce.Job$2.run(Job.java:1037)
	at org.apache.hadoop.mapreduce.Job$2.run(Job.java:1034)
	at java.security.AccessController.doPrivileged(Native Method)
	at javax.security.auth.Subject.doAs(Subject.java:396)
	at org.apache.hadoop.security.UserGroupInformation.doAs(UserGroupInformation.java:1142)
	at org.apache.hadoop.mapreduce.Job.submit(Job.java:1034)
	at org.apache.hadoop.mapreduce.Job.waitForCompletion(Job.java:1054)
	at org.apache.hadoop.mapreduce.lib.output.TestMRMultipleOutputs._testMultipleOutputs(TestMRMultipleOutputs.java:169)
	at org.apache.hadoop.mapreduce.lib.output.TestMRMultipleOutputs.__CLR3_0_27rxkdondp(TestMRMultipleOutputs.java:43)
	at org.apache.hadoop.mapreduce.lib.output.TestMRMultipleOutputs.testWithoutCounters(TestMRMultipleOutputs.java:42)


REGRESSION:  org.apache.hadoop.mapreduce.lib.output.TestMRMultipleOutputs.testWithCounters

Error Message:
chmod: cannot access `/tmp/hadoop-hudson/mapred/staging/hudson-244951026/.staging/job_local_0002': No such file or directory 

Stack Trace:
org.apache.hadoop.util.Shell$ExitCodeException: chmod: cannot access `/tmp/hadoop-hudson/mapred/staging/hudson-244951026/.staging/job_local_0002': No such file or directory

	at org.apache.hadoop.util.Shell.runCommand(Shell.java:261)
	at org.apache.hadoop.util.Shell.run(Shell.java:188)
	at org.apache.hadoop.util.Shell$ShellCommandExecutor.execute(Shell.java:381)
	at org.apache.hadoop.util.Shell.execCommand(Shell.java:467)
	at org.apache.hadoop.util.Shell.execCommand(Shell.java:450)
	at org.apache.hadoop.fs.RawLocalFileSystem.execCommand(RawLocalFileSystem.java:549)
	at org.apache.hadoop.fs.RawLocalFileSystem.setPermission(RawLocalFileSystem.java:540)
	at org.apache.hadoop.fs.FilterFileSystem.setPermission(FilterFileSystem.java:353)
	at org.apache.hadoop.fs.FileSystem.mkdirs(FileSystem.java:428)
	at org.apache.hadoop.mapreduce.JobSubmitter.copyAndConfigureFiles(JobSubmitter.java:166)
	at org.apache.hadoop.mapreduce.JobSubmitter.copyAndConfigureFiles(JobSubmitter.java:283)
	at org.apache.hadoop.mapreduce.JobSubmitter.submitJobInternal(JobSubmitter.java:350)
	at org.apache.hadoop.mapreduce.Job$2.run(Job.java:1037)
	at org.apache.hadoop.mapreduce.Job$2.run(Job.java:1034)
	at java.security.AccessController.doPrivileged(Native Method)
	at javax.security.auth.Subject.doAs(Subject.java:396)
	at org.apache.hadoop.security.UserGroupInformation.doAs(UserGroupInformation.java:1142)
	at org.apache.hadoop.mapreduce.Job.submit(Job.java:1034)
	at org.apache.hadoop.mapreduce.Job.waitForCompletion(Job.java:1054)
	at org.apache.hadoop.mapreduce.lib.output.TestMRMultipleOutputs._testMultipleOutputs(TestMRMultipleOutputs.java:169)
	at org.apache.hadoop.mapreduce.lib.output.TestMRMultipleOutputs.__CLR3_0_2435lo6nds(TestMRMultipleOutputs.java:48)
	at org.apache.hadoop.mapreduce.lib.output.TestMRMultipleOutputs.testWithCounters(TestMRMultipleOutputs.java:47)


REGRESSION:  org.apache.hadoop.mapreduce.lib.partition.TestMRKeyFieldBasedComparator.testBasicUnixComparator

Error Message:
chmod: cannot access `/tmp/hadoop-hudson/mapred/staging/hudson-536408127/.staging/job_local_0001': No such file or directory 

Stack Trace:
org.apache.hadoop.util.Shell$ExitCodeException: chmod: cannot access `/tmp/hadoop-hudson/mapred/staging/hudson-536408127/.staging/job_local_0001': No such file or directory

	at org.apache.hadoop.util.Shell.runCommand(Shell.java:261)
	at org.apache.hadoop.util.Shell.run(Shell.java:188)
	at org.apache.hadoop.util.Shell$ShellCommandExecutor.execute(Shell.java:381)
	at org.apache.hadoop.util.Shell.execCommand(Shell.java:467)
	at org.apache.hadoop.util.Shell.execCommand(Shell.java:450)
	at org.apache.hadoop.fs.RawLocalFileSystem.execCommand(RawLocalFileSystem.java:549)
	at org.apache.hadoop.fs.RawLocalFileSystem.setPermission(RawLocalFileSystem.java:540)
	at org.apache.hadoop.fs.FilterFileSystem.setPermission(FilterFileSystem.java:353)
	at org.apache.hadoop.fs.FileSystem.mkdirs(FileSystem.java:428)
	at org.apache.hadoop.mapreduce.JobSubmitter.copyAndConfigureFiles(JobSubmitter.java:166)
	at org.apache.hadoop.mapreduce.JobSubmitter.copyAndConfigureFiles(JobSubmitter.java:283)
	at org.apache.hadoop.mapreduce.JobSubmitter.submitJobInternal(JobSubmitter.java:350)
	at org.apache.hadoop.mapreduce.Job$2.run(Job.java:1037)
	at org.apache.hadoop.mapreduce.Job$2.run(Job.java:1034)
	at java.security.AccessController.doPrivileged(Native Method)
	at javax.security.auth.Subject.doAs(Subject.java:396)
	at org.apache.hadoop.security.UserGroupInformation.doAs(UserGroupInformation.java:1142)
	at org.apache.hadoop.mapreduce.Job.submit(Job.java:1034)
	at org.apache.hadoop.mapreduce.Job.waitForCompletion(Job.java:1054)
	at org.apache.hadoop.mapreduce.lib.partition.TestMRKeyFieldBasedComparator.testComparator(TestMRKeyFieldBasedComparator.java:68)
	at org.apache.hadoop.mapreduce.lib.partition.TestMRKeyFieldBasedComparator.__CLR3_0_2efq8inc0g(TestMRKeyFieldBasedComparator.java:98)
	at org.apache.hadoop.mapreduce.lib.partition.TestMRKeyFieldBasedComparator.testBasicUnixComparator(TestMRKeyFieldBasedComparator.java:97)


REGRESSION:  org.apache.hadoop.record.TestRecordMR.testMapred

Error Message:
chmod: cannot access `/tmp/hadoop-hudson/mapred/staging/hudson871311123/.staging/job_local_0001': No such file or directory 

Stack Trace:
org.apache.hadoop.util.Shell$ExitCodeException: chmod: cannot access `/tmp/hadoop-hudson/mapred/staging/hudson871311123/.staging/job_local_0001': No such file or directory

	at org.apache.hadoop.util.Shell.runCommand(Shell.java:261)
	at org.apache.hadoop.util.Shell.run(Shell.java:188)
	at org.apache.hadoop.util.Shell$ShellCommandExecutor.execute(Shell.java:381)
	at org.apache.hadoop.util.Shell.execCommand(Shell.java:467)
	at org.apache.hadoop.util.Shell.execCommand(Shell.java:450)
	at org.apache.hadoop.fs.RawLocalFileSystem.execCommand(RawLocalFileSystem.java:549)
	at org.apache.hadoop.fs.RawLocalFileSystem.setPermission(RawLocalFileSystem.java:540)
	at org.apache.hadoop.fs.FilterFileSystem.setPermission(FilterFileSystem.java:353)
	at org.apache.hadoop.fs.FileSystem.mkdirs(FileSystem.java:428)
	at org.apache.hadoop.mapreduce.JobSubmitter.copyAndConfigureFiles(JobSubmitter.java:166)
	at org.apache.hadoop.mapreduce.JobSubmitter.copyAndConfigureFiles(JobSubmitter.java:283)
	at org.apache.hadoop.mapreduce.JobSubmitter.submitJobInternal(JobSubmitter.java:350)
	at org.apache.hadoop.mapreduce.Job$2.run(Job.java:1037)
	at org.apache.hadoop.mapreduce.Job$2.run(Job.java:1034)
	at java.security.AccessController.doPrivileged(Native Method)
	at javax.security.auth.Subject.doAs(Subject.java:396)
	at org.apache.hadoop.security.UserGroupInformation.doAs(UserGroupInformation.java:1142)
	at org.apache.hadoop.mapreduce.Job.submit(Job.java:1034)
	at org.apache.hadoop.mapred.JobClient.submitJob(JobClient.java:536)
	at org.apache.hadoop.mapred.JobClient.runJob(JobClient.java:781)
	at org.apache.hadoop.record.TestRecordMR.launch(TestRecordMR.java:322)
	at org.apache.hadoop.record.TestRecordMR.__CLR3_0_2vmf1hqbvc(TestRecordMR.java:237)
	at org.apache.hadoop.record.TestRecordMR.testMapred(TestRecordMR.java:236)


REGRESSION:  org.apache.hadoop.tools.TestCopyFiles.testCopyFromLocalToLocal

Error Message:
File /grid/0/hudson/hudson-slave/workspace/Hadoop-Mapreduce-trunk/trunk/build/test/data/destdat/zero/six/5969253631021317866 does not exist.

Stack Trace:
java.io.FileNotFoundException: File /grid/0/hudson/hudson-slave/workspace/Hadoop-Mapreduce-trunk/trunk/build/test/data/destdat/zero/six/5969253631021317866 does not exist.
	at org.apache.hadoop.fs.RawLocalFileSystem.getFileStatus(RawLocalFileSystem.java:424)
	at org.apache.hadoop.fs.FilterFileSystem.getFileStatus(FilterFileSystem.java:311)
	at org.apache.hadoop.tools.TestCopyFiles.checkFiles(TestCopyFiles.java:169)
	at org.apache.hadoop.tools.TestCopyFiles.checkFiles(TestCopyFiles.java:159)
	at org.apache.hadoop.tools.TestCopyFiles.__CLR3_0_2qikfc3w5p(TestCopyFiles.java:271)
	at org.apache.hadoop.tools.TestCopyFiles.testCopyFromLocalToLocal(TestCopyFiles.java:264)


REGRESSION:  org.apache.hadoop.tools.TestCopyFiles.testCopyFromDfsToDfs

Error Message:
File does not exist: /destdat/954677186533183944

Stack Trace:
java.io.FileNotFoundException: File does not exist: /destdat/954677186533183944
	at org.apache.hadoop.hdfs.DistributedFileSystem.getFileStatus(DistributedFileSystem.java:745)
	at org.apache.hadoop.tools.TestCopyFiles.checkFiles(TestCopyFiles.java:169)
	at org.apache.hadoop.tools.TestCopyFiles.checkFiles(TestCopyFiles.java:159)
	at org.apache.hadoop.tools.TestCopyFiles.__CLR3_0_2e6yof1w5x(TestCopyFiles.java:293)
	at org.apache.hadoop.tools.TestCopyFiles.testCopyFromDfsToDfs(TestCopyFiles.java:278)


REGRESSION:  org.apache.hadoop.tools.TestCopyFiles.testEmptyDir

Error Message:
Destination directory does not exist.

Stack Trace:
junit.framework.AssertionFailedError: Destination directory does not exist.
	at org.apache.hadoop.tools.TestCopyFiles.__CLR3_0_2v5ob47w6k(TestCopyFiles.java:327)
	at org.apache.hadoop.tools.TestCopyFiles.testEmptyDir(TestCopyFiles.java:308)


REGRESSION:  org.apache.hadoop.tools.TestCopyFiles.testCopyFromLocalToDfs

Error Message:
File does not exist: /destdat/641697868574111264

Stack Trace:
java.io.FileNotFoundException: File does not exist: /destdat/641697868574111264
	at org.apache.hadoop.hdfs.DistributedFileSystem.getFileStatus(DistributedFileSystem.java:745)
	at org.apache.hadoop.tools.TestCopyFiles.checkFiles(TestCopyFiles.java:169)
	at org.apache.hadoop.tools.TestCopyFiles.checkFiles(TestCopyFiles.java:159)
	at org.apache.hadoop.tools.TestCopyFiles.__CLR3_0_2hl9wyrw77(TestCopyFiles.java:353)
	at org.apache.hadoop.tools.TestCopyFiles.testCopyFromLocalToDfs(TestCopyFiles.java:339)


REGRESSION:  org.apache.hadoop.tools.TestCopyFiles.testCopyFromDfsToLocal

Error Message:
File /grid/0/hudson/hudson-slave/workspace/Hadoop-Mapreduce-trunk/trunk/build/test/data/destdat/three/six/2043510989848256677 does not exist.

Stack Trace:
java.io.FileNotFoundException: File /grid/0/hudson/hudson-slave/workspace/Hadoop-Mapreduce-trunk/trunk/build/test/data/destdat/three/six/2043510989848256677 does not exist.
	at org.apache.hadoop.fs.RawLocalFileSystem.getFileStatus(RawLocalFileSystem.java:424)
	at org.apache.hadoop.fs.FilterFileSystem.getFileStatus(FilterFileSystem.java:311)
	at org.apache.hadoop.tools.TestCopyFiles.checkFiles(TestCopyFiles.java:169)
	at org.apache.hadoop.tools.TestCopyFiles.checkFiles(TestCopyFiles.java:159)
	at org.apache.hadoop.tools.TestCopyFiles.__CLR3_0_2o5d2y1w7s(TestCopyFiles.java:382)
	at org.apache.hadoop.tools.TestCopyFiles.testCopyFromDfsToLocal(TestCopyFiles.java:367)


REGRESSION:  org.apache.hadoop.tools.TestCopyFiles.testCopyDfsToDfsUpdateOverwrite

Error Message:
File does not exist: /destdat/nine/6028378138713951224

Stack Trace:
java.io.FileNotFoundException: File does not exist: /destdat/nine/6028378138713951224
	at org.apache.hadoop.hdfs.DistributedFileSystem.getFileStatus(DistributedFileSystem.java:745)
	at org.apache.hadoop.tools.TestCopyFiles.checkFiles(TestCopyFiles.java:169)
	at org.apache.hadoop.tools.TestCopyFiles.checkFiles(TestCopyFiles.java:159)
	at org.apache.hadoop.tools.TestCopyFiles.__CLR3_0_2ddsv4zw8e(TestCopyFiles.java:410)
	at org.apache.hadoop.tools.TestCopyFiles.testCopyDfsToDfsUpdateOverwrite(TestCopyFiles.java:395)


REGRESSION:  org.apache.hadoop.tools.TestCopyFiles.testCopyDfsToDfsUpdateWithSkipCRC

Error Message:
Dest did not get overwritten without skip crc

Stack Trace:
junit.framework.AssertionFailedError: Dest did not get overwritten without skip crc
	at org.apache.hadoop.tools.TestCopyFiles.__CLR3_0_29z237lw9b(TestCopyFiles.java:517)
	at org.apache.hadoop.tools.TestCopyFiles.testCopyDfsToDfsUpdateWithSkipCRC(TestCopyFiles.java:455)


REGRESSION:  org.apache.hadoop.tools.TestCopyFiles.testCopyDuplication

Error Message:
File /grid/0/hudson/hudson-slave/workspace/Hadoop-Mapreduce-trunk/trunk/build/test/data/src2/srcdat/nine/zero/7686672531686761131 does not exist.

Stack Trace:
java.io.FileNotFoundException: File /grid/0/hudson/hudson-slave/workspace/Hadoop-Mapreduce-trunk/trunk/build/test/data/src2/srcdat/nine/zero/7686672531686761131 does not exist.
	at org.apache.hadoop.fs.RawLocalFileSystem.getFileStatus(RawLocalFileSystem.java:424)
	at org.apache.hadoop.fs.FilterFileSystem.getFileStatus(FilterFileSystem.java:311)
	at org.apache.hadoop.tools.TestCopyFiles.checkFiles(TestCopyFiles.java:169)
	at org.apache.hadoop.tools.TestCopyFiles.checkFiles(TestCopyFiles.java:159)
	at org.apache.hadoop.tools.TestCopyFiles.__CLR3_0_2px84yawai(TestCopyFiles.java:537)
	at org.apache.hadoop.tools.TestCopyFiles.testCopyDuplication(TestCopyFiles.java:530)


REGRESSION:  org.apache.hadoop.tools.TestCopyFiles.testCopySingleFile

Error Message:
File /grid/0/hudson/hudson-slave/workspace/Hadoop-Mapreduce-trunk/trunk/build/test/data/destdat/3702287833205879822 does not exist.

Stack Trace:
java.io.FileNotFoundException: File /grid/0/hudson/hudson-slave/workspace/Hadoop-Mapreduce-trunk/trunk/build/test/data/destdat/3702287833205879822 does not exist.
	at org.apache.hadoop.fs.RawLocalFileSystem.getFileStatus(RawLocalFileSystem.java:424)
	at org.apache.hadoop.fs.FilterFileSystem.getFileStatus(FilterFileSystem.java:311)
	at org.apache.hadoop.tools.TestCopyFiles.checkFiles(TestCopyFiles.java:169)
	at org.apache.hadoop.tools.TestCopyFiles.checkFiles(TestCopyFiles.java:159)
	at org.apache.hadoop.tools.TestCopyFiles.__CLR3_0_29cq27iwas(TestCopyFiles.java:562)
	at org.apache.hadoop.tools.TestCopyFiles.testCopySingleFile(TestCopyFiles.java:553)


REGRESSION:  org.apache.hadoop.tools.TestCopyFiles.testBasedir

Error Message:
File does not exist: /destdat/middle/srcdat/one/zero/4041958891398783501

Stack Trace:
java.io.FileNotFoundException: File does not exist: /destdat/middle/srcdat/one/zero/4041958891398783501
	at org.apache.hadoop.hdfs.DistributedFileSystem.getFileStatus(DistributedFileSystem.java:745)
	at org.apache.hadoop.tools.TestCopyFiles.checkFiles(TestCopyFiles.java:169)
	at org.apache.hadoop.tools.TestCopyFiles.checkFiles(TestCopyFiles.java:159)
	at org.apache.hadoop.tools.TestCopyFiles.__CLR3_0_2rlzv7zwbl(TestCopyFiles.java:627)
	at org.apache.hadoop.tools.TestCopyFiles.testBasedir(TestCopyFiles.java:612)


REGRESSION:  org.apache.hadoop.tools.TestCopyFiles.testPreserveOption

Error Message:
File does not exist: /destdat/5406648178389900344

Stack Trace:
java.io.FileNotFoundException: File does not exist: /destdat/5406648178389900344
	at org.apache.hadoop.hdfs.DistributedFileSystem.getFileStatus(DistributedFileSystem.java:745)
	at org.apache.hadoop.tools.TestCopyFiles.checkFiles(TestCopyFiles.java:169)
	at org.apache.hadoop.tools.TestCopyFiles.checkFiles(TestCopyFiles.java:159)
	at org.apache.hadoop.tools.TestCopyFiles.__CLR3_0_2p0v3lywc6(TestCopyFiles.java:654)
	at org.apache.hadoop.tools.TestCopyFiles.testPreserveOption(TestCopyFiles.java:638)


REGRESSION:  org.apache.hadoop.tools.TestCopyFiles.testLimits

Error Message:
expected:<10> but was:<0>

Stack Trace:
junit.framework.AssertionFailedError: expected:<10> but was:<0>
	at org.apache.hadoop.tools.TestCopyFiles.__CLR3_0_2gnl1gvwfc(TestCopyFiles.java:816)
	at org.apache.hadoop.tools.TestCopyFiles.testLimits(TestCopyFiles.java:789)


REGRESSION:  org.apache.hadoop.tools.TestCopyFiles.testDelete

Error Message:
null expected:</1[181024552085467054 /3052682078165367535 /3094319212940684051 /4686771229145089323 /6369992035089713523 /6959129110694916112 /7176699407428249621 /eight /eight/7863322406212753035 /four /four/8064530830275647040 /nine /nine/five /nine/five/8641543607575464044 /one /one/nine /one/nine/1559303668753015801 /one/two /one/two/7662480047023901276 /seven /seven/1967913823765653057 /seven/3801853110374722574 /six /six/4571045391535748605 /six/4675066497113934872 /two /two/8688868944110730824 /two/8745143421030834037 /zero /zero/8424644736125313086 /zero/three /zero/three/3487346236882445725] > but was:</1[359250734332780126 /3478163639983782811 /4056664275960740654 /4698956464536378622 /4873654684971929660 /eight /eight/3316893075322057780 /eight/7865901967185400123 /eight/one /eight/one/5801009646262362054 /eight/two /eight/two/755319137045089175 /five /five/4543409753440267681 /five/three /five/three/1708974166809612300 /nine /nine/4409022772645726736 /nine/seven /nine/seven/3490682915522527073 /one /one/2676812153153357884 /one/7275750099024829371 /six /six/8921417606840833335 /three /three/one /three/one/360280492549787684 /three/seven /three/seven/6896331806227750693 /two /two/three /two/three/657863402888120239 /zero /zero/eight /zero/eight/316971328295189312] >

Stack Trace:
junit.framework.ComparisonFailure: null expected:</1[181024552085467054
/3052682078165367535
/3094319212940684051
/4686771229145089323
/6369992035089713523
/6959129110694916112
/7176699407428249621
/eight
/eight/7863322406212753035
/four
/four/8064530830275647040
/nine
/nine/five
/nine/five/8641543607575464044
/one
/one/nine
/one/nine/1559303668753015801
/one/two
/one/two/7662480047023901276
/seven
/seven/1967913823765653057
/seven/3801853110374722574
/six
/six/4571045391535748605
/six/4675066497113934872
/two
/two/8688868944110730824
/two/8745143421030834037
/zero
/zero/8424644736125313086
/zero/three
/zero/three/3487346236882445725]
> but was:</1[359250734332780126
/3478163639983782811
/4056664275960740654
/4698956464536378622
/4873654684971929660
/eight
/eight/3316893075322057780
/eight/7865901967185400123
/eight/one
/eight/one/5801009646262362054
/eight/two
/eight/two/755319137045089175
/five
/five/4543409753440267681
/five/three
/five/three/1708974166809612300
/nine
/nine/4409022772645726736
/nine/seven
/nine/seven/3490682915522527073
/one
/one/2676812153153357884
/one/7275750099024829371
/six
/six/8921417606840833335
/three
/three/one
/three/one/360280492549787684
/three/seven
/three/seven/6896331806227750693
/two
/two/three
/two/three/657863402888120239
/zero
/zero/eight
/zero/eight/316971328295189312]
>
	at org.apache.hadoop.tools.TestCopyFiles.__CLR3_0_2yilj0cwij(TestCopyFiles.java:989)
	at org.apache.hadoop.tools.TestCopyFiles.testDelete(TestCopyFiles.java:952)


REGRESSION:  org.apache.hadoop.tools.TestCopyFiles.testDeleteLocal

Error Message:
File /grid/0/hudson/hudson-slave/workspace/Hadoop-Mapreduce-trunk/trunk/build/test/data/destdat/three/four/2653919654677877736 does not exist.

Stack Trace:
java.io.FileNotFoundException: File /grid/0/hudson/hudson-slave/workspace/Hadoop-Mapreduce-trunk/trunk/build/test/data/destdat/three/four/2653919654677877736 does not exist.
	at org.apache.hadoop.fs.RawLocalFileSystem.getFileStatus(RawLocalFileSystem.java:424)
	at org.apache.hadoop.fs.FilterFileSystem.getFileStatus(FilterFileSystem.java:311)
	at org.apache.hadoop.tools.TestCopyFiles.checkFiles(TestCopyFiles.java:169)
	at org.apache.hadoop.tools.TestCopyFiles.checkFiles(TestCopyFiles.java:159)
	at org.apache.hadoop.tools.TestCopyFiles.__CLR3_0_2tkhgbvwjn(TestCopyFiles.java:1043)
	at org.apache.hadoop.tools.TestCopyFiles.testDeleteLocal(TestCopyFiles.java:1024)


REGRESSION:  org.apache.hadoop.tools.TestCopyFiles.testGlobbing

Error Message:
File does not exist: /destdat/six/4141541531658888787

Stack Trace:
java.io.FileNotFoundException: File does not exist: /destdat/six/4141541531658888787
	at org.apache.hadoop.hdfs.DistributedFileSystem.getFileStatus(DistributedFileSystem.java:745)
	at org.apache.hadoop.tools.TestCopyFiles.checkFiles(TestCopyFiles.java:169)
	at org.apache.hadoop.tools.TestCopyFiles.checkFiles(TestCopyFiles.java:159)
	at org.apache.hadoop.tools.TestCopyFiles.__CLR3_0_23k01ovwkb(TestCopyFiles.java:1072)
	at org.apache.hadoop.tools.TestCopyFiles.testGlobbing(TestCopyFiles.java:1057)




Mime
View raw message