hadoop-mapreduce-dev mailing list archives

Site index · List index
Message view « Date » · « Thread »
Top « Date » · « Thread »
From Apache Hudson Server <hud...@hudson.apache.org>
Subject Hadoop-Mapreduce-trunk - Build # 654 - Failure
Date Mon, 18 Apr 2011 14:47:11 GMT
See https://hudson.apache.org/hudson/job/Hadoop-Mapreduce-trunk/654/

###################################################################################
########################## LAST 60 LINES OF THE CONSOLE ###########################
[...truncated 193519 lines...]
    [junit]    0.8:96530
    [junit]    0.85:96549
    [junit]    0.9:96658
    [junit]    0.95:96670
    [junit] Failed Reduce CDF --------
    [junit] 0: -9223372036854775808--9223372036854775807
    [junit] map attempts to success -- 0.6567164179104478, 0.3283582089552239, 0.014925373134328358, 
    [junit] ===============
    [junit] 2011-04-18 14:43:38,931 WARN  rumen.ZombieJob (ZombieJob.java:sanitizeLoggedTask(318)) - Task task_200904211745_0004_r_000025 has nulll TaskStatus
    [junit] 2011-04-18 14:43:38,932 WARN  rumen.ZombieJob (ZombieJob.java:sanitizeLoggedTask(318)) - Task task_200904211745_0004_r_000028 has nulll TaskStatus
    [junit] 2011-04-18 14:43:38,932 WARN  rumen.ZombieJob (ZombieJob.java:sanitizeLoggedTask(318)) - Task task_200904211745_0004_r_000029 has nulll TaskStatus
    [junit] 2011-04-18 14:43:38,932 WARN  rumen.ZombieJob (ZombieJob.java:sanitizeLoggedTask(318)) - Task task_200904211745_0004_r_000030 has nulll TaskStatus
    [junit] 2011-04-18 14:43:38,933 WARN  rumen.ZombieJob (ZombieJob.java:sanitizeLoggedTask(318)) - Task task_200904211745_0004_r_000031 has nulll TaskStatus
    [junit] 2011-04-18 14:43:38,933 WARN  rumen.ZombieJob (ZombieJob.java:sanitizeLoggedTask(318)) - Task task_200904211745_0004_r_000032 has nulll TaskStatus
    [junit] 2011-04-18 14:43:38,933 WARN  rumen.ZombieJob (ZombieJob.java:sanitizeLoggedTask(318)) - Task task_200904211745_0004_r_000033 has nulll TaskStatus
    [junit] 2011-04-18 14:43:38,934 WARN  rumen.ZombieJob (ZombieJob.java:sanitizeLoggedTask(318)) - Task task_200904211745_0004_r_000034 has nulll TaskStatus
    [junit] 2011-04-18 14:43:38,934 WARN  rumen.ZombieJob (ZombieJob.java:sanitizeLoggedTask(318)) - Task task_200904211745_0004_r_000035 has nulll TaskStatus
    [junit] 2011-04-18 14:43:38,934 WARN  rumen.ZombieJob (ZombieJob.java:sanitizeLoggedTask(318)) - Task task_200904211745_0004_r_000036 has nulll TaskStatus
    [junit] 2011-04-18 14:43:38,934 WARN  rumen.ZombieJob (ZombieJob.java:sanitizeLoggedTask(318)) - Task task_200904211745_0004_r_000037 has nulll TaskStatus
    [junit] 2011-04-18 14:43:38,935 WARN  rumen.ZombieJob (ZombieJob.java:sanitizeLoggedTask(318)) - Task task_200904211745_0004_r_000038 has nulll TaskStatus
    [junit] 2011-04-18 14:43:38,935 WARN  rumen.ZombieJob (ZombieJob.java:sanitizeLoggedTask(318)) - Task task_200904211745_0004_r_000039 has nulll TaskStatus
    [junit] 2011-04-18 14:43:38,935 WARN  rumen.ZombieJob (ZombieJob.java:sanitizeLoggedTask(318)) - Task task_200904211745_0004_r_000040 has nulll TaskStatus
    [junit] 2011-04-18 14:43:38,936 WARN  rumen.ZombieJob (ZombieJob.java:sanitizeLoggedTask(318)) - Task task_200904211745_0004_r_000041 has nulll TaskStatus
    [junit] 2011-04-18 14:43:38,936 WARN  rumen.ZombieJob (ZombieJob.java:sanitizeLoggedTask(318)) - Task task_200904211745_0004_r_000042 has nulll TaskStatus
    [junit] 2011-04-18 14:43:38,936 WARN  rumen.ZombieJob (ZombieJob.java:sanitizeLoggedTask(318)) - Task task_200904211745_0004_r_000043 has nulll TaskStatus
    [junit] 2011-04-18 14:43:38,937 WARN  rumen.ZombieJob (ZombieJob.java:sanitizeLoggedTask(318)) - Task task_200904211745_0004_r_000044 has nulll TaskStatus
    [junit] 2011-04-18 14:43:38,937 WARN  rumen.ZombieJob (ZombieJob.java:sanitizeLoggedTask(318)) - Task task_200904211745_0004_r_000045 has nulll TaskStatus
    [junit] 2011-04-18 14:43:38,937 WARN  rumen.ZombieJob (ZombieJob.java:sanitizeLoggedTask(318)) - Task task_200904211745_0004_r_000046 has nulll TaskStatus
    [junit] generated failed map runtime distribution
    [junit] 100000: 18592--18592
    [junit]    0.1:18592
    [junit]    0.5:18592
    [junit]    0.9:18592
    [junit] Tests run: 5, Failures: 0, Errors: 0, Time elapsed: 3.022 sec
    [junit] Running org.apache.hadoop.util.TestReflectionUtils
    [junit] Tests run: 1, Failures: 0, Errors: 0, Time elapsed: 0.348 sec
    [junit] Running org.apache.hadoop.util.TestRunJar
    [junit] Creating file/grid/0/hudson/hudson-slave/workspace/Hadoop-Mapreduce-trunk/trunk/build/test/data/out
    [junit] Tests run: 1, Failures: 0, Errors: 0, Time elapsed: 0.321 sec

checkfailure:

run-test-mapred-all-withtestcaseonly:

run-test-mapred:

BUILD FAILED
/grid/0/hudson/hudson-slave/workspace/Hadoop-Mapreduce-trunk/trunk/build.xml:830: Tests failed!

Total time: 99 minutes 6 seconds
[FINDBUGS] Skipping publisher since build result is FAILURE
Recording fingerprints
Archiving artifacts
Recording test results
Publishing Javadoc
Publishing Clover coverage report...
No Clover report will be published due to a Build Failure
Email was triggered for: Failure
Sending email for trigger: Failure



###################################################################################
############################## FAILED TESTS (if any) ##############################
91 tests failed.
REGRESSION:  org.apache.hadoop.cli.TestMRCLI.testAll

Error Message:
One of the tests failed. See the Detailed results to identify the command that failed

Stack Trace:
junit.framework.AssertionFailedError: One of the tests failed. See the Detailed results to identify the command that failed
	at org.apache.hadoop.cli.CLITestHelper.displayResults(CLITestHelper.java:264)
	at org.apache.hadoop.cli.CLITestHelper.tearDown(CLITestHelper.java:126)
	at org.apache.hadoop.cli.TestHDFSCLI.tearDown(TestHDFSCLI.java:81)
	at org.apache.hadoop.cli.TestMRCLI.tearDown(TestMRCLI.java:56)


REGRESSION:  org.apache.hadoop.fs.TestDFSIO.testIOs

Error Message:
chmod: cannot access `/tmp/hadoop-hudson/mapred/staging/hudson1267651923/.staging/job_local_0001': No such file or directory 

Stack Trace:
org.apache.hadoop.util.Shell$ExitCodeException: chmod: cannot access `/tmp/hadoop-hudson/mapred/staging/hudson1267651923/.staging/job_local_0001': No such file or directory

	at org.apache.hadoop.util.Shell.runCommand(Shell.java:261)
	at org.apache.hadoop.util.Shell.run(Shell.java:188)
	at org.apache.hadoop.util.Shell$ShellCommandExecutor.execute(Shell.java:381)
	at org.apache.hadoop.util.Shell.execCommand(Shell.java:467)
	at org.apache.hadoop.util.Shell.execCommand(Shell.java:450)
	at org.apache.hadoop.fs.RawLocalFileSystem.execCommand(RawLocalFileSystem.java:549)
	at org.apache.hadoop.fs.RawLocalFileSystem.setPermission(RawLocalFileSystem.java:540)
	at org.apache.hadoop.fs.FilterFileSystem.setPermission(FilterFileSystem.java:353)
	at org.apache.hadoop.fs.FileSystem.mkdirs(FileSystem.java:428)
	at org.apache.hadoop.mapreduce.JobSubmitter.copyAndConfigureFiles(JobSubmitter.java:166)
	at org.apache.hadoop.mapreduce.JobSubmitter.copyAndConfigureFiles(JobSubmitter.java:283)
	at org.apache.hadoop.mapreduce.JobSubmitter.submitJobInternal(JobSubmitter.java:350)
	at org.apache.hadoop.mapreduce.Job$2.run(Job.java:1037)
	at org.apache.hadoop.mapreduce.Job$2.run(Job.java:1034)
	at java.security.AccessController.doPrivileged(Native Method)
	at javax.security.auth.Subject.doAs(Subject.java:396)
	at org.apache.hadoop.security.UserGroupInformation.doAs(UserGroupInformation.java:1142)
	at org.apache.hadoop.mapreduce.Job.submit(Job.java:1034)
	at org.apache.hadoop.mapred.JobClient.submitJob(JobClient.java:536)
	at org.apache.hadoop.mapred.JobClient.runJob(JobClient.java:781)
	at org.apache.hadoop.fs.TestDFSIO.runIOTest(TestDFSIO.java:340)
	at org.apache.hadoop.fs.TestDFSIO.writeTest(TestDFSIO.java:321)
	at org.apache.hadoop.fs.TestDFSIO.testIOs(TestDFSIO.java:188)
	at org.apache.hadoop.fs.TestDFSIO.__CLR3_0_27nynfmgho(TestDFSIO.java:168)
	at org.apache.hadoop.fs.TestDFSIO.testIOs(TestDFSIO.java:166)


REGRESSION:  org.apache.hadoop.fs.TestFileSystem.testFs

Error Message:
chmod: cannot access `/tmp/hadoop-hudson/mapred/staging/hudson2076937297/.staging/job_local_0001': No such file or directory 

Stack Trace:
org.apache.hadoop.util.Shell$ExitCodeException: chmod: cannot access `/tmp/hadoop-hudson/mapred/staging/hudson2076937297/.staging/job_local_0001': No such file or directory

	at org.apache.hadoop.util.Shell.runCommand(Shell.java:261)
	at org.apache.hadoop.util.Shell.run(Shell.java:188)
	at org.apache.hadoop.util.Shell$ShellCommandExecutor.execute(Shell.java:381)
	at org.apache.hadoop.util.Shell.execCommand(Shell.java:467)
	at org.apache.hadoop.util.Shell.execCommand(Shell.java:450)
	at org.apache.hadoop.fs.RawLocalFileSystem.execCommand(RawLocalFileSystem.java:549)
	at org.apache.hadoop.fs.RawLocalFileSystem.setPermission(RawLocalFileSystem.java:540)
	at org.apache.hadoop.fs.FilterFileSystem.setPermission(FilterFileSystem.java:353)
	at org.apache.hadoop.fs.FileSystem.mkdirs(FileSystem.java:428)
	at org.apache.hadoop.mapreduce.JobSubmitter.copyAndConfigureFiles(JobSubmitter.java:166)
	at org.apache.hadoop.mapreduce.JobSubmitter.copyAndConfigureFiles(JobSubmitter.java:283)
	at org.apache.hadoop.mapreduce.JobSubmitter.submitJobInternal(JobSubmitter.java:350)
	at org.apache.hadoop.mapreduce.Job$2.run(Job.java:1037)
	at org.apache.hadoop.mapreduce.Job$2.run(Job.java:1034)
	at java.security.AccessController.doPrivileged(Native Method)
	at javax.security.auth.Subject.doAs(Subject.java:396)
	at org.apache.hadoop.security.UserGroupInformation.doAs(UserGroupInformation.java:1142)
	at org.apache.hadoop.mapreduce.Job.submit(Job.java:1034)
	at org.apache.hadoop.mapred.JobClient.submitJob(JobClient.java:536)
	at org.apache.hadoop.mapred.JobClient.runJob(JobClient.java:781)
	at org.apache.hadoop.fs.TestFileSystem.writeTest(TestFileSystem.java:237)
	at org.apache.hadoop.fs.TestFileSystem.testFs(TestFileSystem.java:83)
	at org.apache.hadoop.fs.TestFileSystem.__CLR3_0_2jwa3javh3(TestFileSystem.java:69)
	at org.apache.hadoop.fs.TestFileSystem.testFs(TestFileSystem.java:68)


REGRESSION:  org.apache.hadoop.fs.slive.TestSlive.testMRFlow

Error Message:
null

Stack Trace:
junit.framework.AssertionFailedError: 
	at org.apache.hadoop.fs.slive.TestSlive.__CLR3_0_234abe46no(TestSlive.java:409)
	at org.apache.hadoop.fs.slive.TestSlive.testMRFlow(TestSlive.java:405)


REGRESSION:  org.apache.hadoop.mapred.TestFieldSelection.testFieldSelection

Error Message:
chmod: cannot access `/tmp/hadoop-hudson/mapred/staging/hudson-592768648/.staging/job_local_0001': No such file or directory 

Stack Trace:
org.apache.hadoop.util.Shell$ExitCodeException: chmod: cannot access `/tmp/hadoop-hudson/mapred/staging/hudson-592768648/.staging/job_local_0001': No such file or directory

	at org.apache.hadoop.util.Shell.runCommand(Shell.java:261)
	at org.apache.hadoop.util.Shell.run(Shell.java:188)
	at org.apache.hadoop.util.Shell$ShellCommandExecutor.execute(Shell.java:381)
	at org.apache.hadoop.util.Shell.execCommand(Shell.java:467)
	at org.apache.hadoop.util.Shell.execCommand(Shell.java:450)
	at org.apache.hadoop.fs.RawLocalFileSystem.execCommand(RawLocalFileSystem.java:549)
	at org.apache.hadoop.fs.RawLocalFileSystem.setPermission(RawLocalFileSystem.java:540)
	at org.apache.hadoop.fs.FilterFileSystem.setPermission(FilterFileSystem.java:353)
	at org.apache.hadoop.fs.FileSystem.mkdirs(FileSystem.java:428)
	at org.apache.hadoop.mapreduce.JobSubmitter.copyAndConfigureFiles(JobSubmitter.java:166)
	at org.apache.hadoop.mapreduce.JobSubmitter.copyAndConfigureFiles(JobSubmitter.java:283)
	at org.apache.hadoop.mapreduce.JobSubmitter.submitJobInternal(JobSubmitter.java:350)
	at org.apache.hadoop.mapreduce.Job$2.run(Job.java:1037)
	at org.apache.hadoop.mapreduce.Job$2.run(Job.java:1034)
	at java.security.AccessController.doPrivileged(Native Method)
	at javax.security.auth.Subject.doAs(Subject.java:396)
	at org.apache.hadoop.security.UserGroupInformation.doAs(UserGroupInformation.java:1142)
	at org.apache.hadoop.mapreduce.Job.submit(Job.java:1034)
	at org.apache.hadoop.mapred.JobClient.submitJob(JobClient.java:536)
	at org.apache.hadoop.mapred.JobClient.runJob(JobClient.java:781)
	at org.apache.hadoop.mapred.TestFieldSelection.launch(TestFieldSelection.java:81)
	at org.apache.hadoop.mapred.TestFieldSelection.__CLR3_0_2asm65nkpn(TestFieldSelection.java:39)
	at org.apache.hadoop.mapred.TestFieldSelection.testFieldSelection(TestFieldSelection.java:38)


REGRESSION:  org.apache.hadoop.mapred.TestJobCounters.testOldCounterA

Error Message:
chmod: cannot access `/tmp/hadoop-hudson/mapred/staging/hudson-710390132/.staging/job_local_0001': No such file or directory 

Stack Trace:
org.apache.hadoop.util.Shell$ExitCodeException: chmod: cannot access `/tmp/hadoop-hudson/mapred/staging/hudson-710390132/.staging/job_local_0001': No such file or directory

	at org.apache.hadoop.util.Shell.runCommand(Shell.java:261)
	at org.apache.hadoop.util.Shell.run(Shell.java:188)
	at org.apache.hadoop.util.Shell$ShellCommandExecutor.execute(Shell.java:381)
	at org.apache.hadoop.util.Shell.execCommand(Shell.java:467)
	at org.apache.hadoop.util.Shell.execCommand(Shell.java:450)
	at org.apache.hadoop.fs.RawLocalFileSystem.execCommand(RawLocalFileSystem.java:549)
	at org.apache.hadoop.fs.RawLocalFileSystem.setPermission(RawLocalFileSystem.java:540)
	at org.apache.hadoop.fs.FilterFileSystem.setPermission(FilterFileSystem.java:353)
	at org.apache.hadoop.fs.FileSystem.mkdirs(FileSystem.java:428)
	at org.apache.hadoop.mapreduce.JobSubmitter.copyAndConfigureFiles(JobSubmitter.java:166)
	at org.apache.hadoop.mapreduce.JobSubmitter.copyAndConfigureFiles(JobSubmitter.java:283)
	at org.apache.hadoop.mapreduce.JobSubmitter.submitJobInternal(JobSubmitter.java:350)
	at org.apache.hadoop.mapreduce.Job$2.run(Job.java:1037)
	at org.apache.hadoop.mapreduce.Job$2.run(Job.java:1034)
	at java.security.AccessController.doPrivileged(Native Method)
	at javax.security.auth.Subject.doAs(Subject.java:396)
	at org.apache.hadoop.security.UserGroupInformation.doAs(UserGroupInformation.java:1142)
	at org.apache.hadoop.mapreduce.Job.submit(Job.java:1034)
	at org.apache.hadoop.mapred.JobClient.submitJob(JobClient.java:536)
	at org.apache.hadoop.mapred.JobClient.runJob(JobClient.java:781)
	at org.apache.hadoop.mapred.TestJobCounters.__CLR3_0_25rygblfjq(TestJobCounters.java:180)
	at org.apache.hadoop.mapred.TestJobCounters.testOldCounterA(TestJobCounters.java:171)


REGRESSION:  org.apache.hadoop.mapred.TestJobCounters.testOldCounterB

Error Message:
chmod: cannot access `/tmp/hadoop-hudson/mapred/staging/hudson140469935/.staging/job_local_0002': No such file or directory 

Stack Trace:
org.apache.hadoop.util.Shell$ExitCodeException: chmod: cannot access `/tmp/hadoop-hudson/mapred/staging/hudson140469935/.staging/job_local_0002': No such file or directory

	at org.apache.hadoop.util.Shell.runCommand(Shell.java:261)
	at org.apache.hadoop.util.Shell.run(Shell.java:188)
	at org.apache.hadoop.util.Shell$ShellCommandExecutor.execute(Shell.java:381)
	at org.apache.hadoop.util.Shell.execCommand(Shell.java:467)
	at org.apache.hadoop.util.Shell.execCommand(Shell.java:450)
	at org.apache.hadoop.fs.RawLocalFileSystem.execCommand(RawLocalFileSystem.java:549)
	at org.apache.hadoop.fs.RawLocalFileSystem.setPermission(RawLocalFileSystem.java:540)
	at org.apache.hadoop.fs.FilterFileSystem.setPermission(FilterFileSystem.java:353)
	at org.apache.hadoop.fs.FileSystem.mkdirs(FileSystem.java:428)
	at org.apache.hadoop.mapreduce.JobSubmitter.copyAndConfigureFiles(JobSubmitter.java:166)
	at org.apache.hadoop.mapreduce.JobSubmitter.copyAndConfigureFiles(JobSubmitter.java:283)
	at org.apache.hadoop.mapreduce.JobSubmitter.submitJobInternal(JobSubmitter.java:350)
	at org.apache.hadoop.mapreduce.Job$2.run(Job.java:1037)
	at org.apache.hadoop.mapreduce.Job$2.run(Job.java:1034)
	at java.security.AccessController.doPrivileged(Native Method)
	at javax.security.auth.Subject.doAs(Subject.java:396)
	at org.apache.hadoop.security.UserGroupInformation.doAs(UserGroupInformation.java:1142)
	at org.apache.hadoop.mapreduce.Job.submit(Job.java:1034)
	at org.apache.hadoop.mapred.JobClient.submitJob(JobClient.java:536)
	at org.apache.hadoop.mapred.JobClient.runJob(JobClient.java:781)
	at org.apache.hadoop.mapred.TestJobCounters.__CLR3_0_290yf42fk1(TestJobCounters.java:219)
	at org.apache.hadoop.mapred.TestJobCounters.testOldCounterB(TestJobCounters.java:209)


REGRESSION:  org.apache.hadoop.mapred.TestJobCounters.testOldCounterC

Error Message:
chmod: cannot access `/tmp/hadoop-hudson/mapred/staging/hudson-1745790201/.staging/job_local_0003': No such file or directory 

Stack Trace:
org.apache.hadoop.util.Shell$ExitCodeException: chmod: cannot access `/tmp/hadoop-hudson/mapred/staging/hudson-1745790201/.staging/job_local_0003': No such file or directory

	at org.apache.hadoop.util.Shell.runCommand(Shell.java:261)
	at org.apache.hadoop.util.Shell.run(Shell.java:188)
	at org.apache.hadoop.util.Shell$ShellCommandExecutor.execute(Shell.java:381)
	at org.apache.hadoop.util.Shell.execCommand(Shell.java:467)
	at org.apache.hadoop.util.Shell.execCommand(Shell.java:450)
	at org.apache.hadoop.fs.RawLocalFileSystem.execCommand(RawLocalFileSystem.java:549)
	at org.apache.hadoop.fs.RawLocalFileSystem.setPermission(RawLocalFileSystem.java:540)
	at org.apache.hadoop.fs.FilterFileSystem.setPermission(FilterFileSystem.java:353)
	at org.apache.hadoop.fs.FileSystem.mkdirs(FileSystem.java:428)
	at org.apache.hadoop.mapreduce.JobSubmitter.copyAndConfigureFiles(JobSubmitter.java:166)
	at org.apache.hadoop.mapreduce.JobSubmitter.copyAndConfigureFiles(JobSubmitter.java:283)
	at org.apache.hadoop.mapreduce.JobSubmitter.submitJobInternal(JobSubmitter.java:350)
	at org.apache.hadoop.mapreduce.Job$2.run(Job.java:1037)
	at org.apache.hadoop.mapreduce.Job$2.run(Job.java:1034)
	at java.security.AccessController.doPrivileged(Native Method)
	at javax.security.auth.Subject.doAs(Subject.java:396)
	at org.apache.hadoop.security.UserGroupInformation.doAs(UserGroupInformation.java:1142)
	at org.apache.hadoop.mapreduce.Job.submit(Job.java:1034)
	at org.apache.hadoop.mapred.JobClient.submitJob(JobClient.java:536)
	at org.apache.hadoop.mapred.JobClient.runJob(JobClient.java:781)
	at org.apache.hadoop.mapred.TestJobCounters.__CLR3_0_2c9ydwjfkc(TestJobCounters.java:244)
	at org.apache.hadoop.mapred.TestJobCounters.testOldCounterC(TestJobCounters.java:236)


REGRESSION:  org.apache.hadoop.mapred.TestJobCounters.testNewCounterA

Error Message:
chmod: cannot access `/tmp/hadoop-hudson/mapred/staging/hudson-22062873/.staging/job_local_0004': No such file or directory 

Stack Trace:
org.apache.hadoop.util.Shell$ExitCodeException: chmod: cannot access `/tmp/hadoop-hudson/mapred/staging/hudson-22062873/.staging/job_local_0004': No such file or directory

	at org.apache.hadoop.util.Shell.runCommand(Shell.java:261)
	at org.apache.hadoop.util.Shell.run(Shell.java:188)
	at org.apache.hadoop.util.Shell$ShellCommandExecutor.execute(Shell.java:381)
	at org.apache.hadoop.util.Shell.execCommand(Shell.java:467)
	at org.apache.hadoop.util.Shell.execCommand(Shell.java:450)
	at org.apache.hadoop.fs.RawLocalFileSystem.execCommand(RawLocalFileSystem.java:549)
	at org.apache.hadoop.fs.RawLocalFileSystem.setPermission(RawLocalFileSystem.java:540)
	at org.apache.hadoop.fs.FilterFileSystem.setPermission(FilterFileSystem.java:353)
	at org.apache.hadoop.fs.FileSystem.mkdirs(FileSystem.java:428)
	at org.apache.hadoop.mapreduce.JobSubmitter.copyAndConfigureFiles(JobSubmitter.java:166)
	at org.apache.hadoop.mapreduce.JobSubmitter.copyAndConfigureFiles(JobSubmitter.java:283)
	at org.apache.hadoop.mapreduce.JobSubmitter.submitJobInternal(JobSubmitter.java:350)
	at org.apache.hadoop.mapreduce.Job$2.run(Job.java:1037)
	at org.apache.hadoop.mapreduce.Job$2.run(Job.java:1034)
	at java.security.AccessController.doPrivileged(Native Method)
	at javax.security.auth.Subject.doAs(Subject.java:396)
	at org.apache.hadoop.security.UserGroupInformation.doAs(UserGroupInformation.java:1142)
	at org.apache.hadoop.mapreduce.Job.submit(Job.java:1034)
	at org.apache.hadoop.mapreduce.Job.waitForCompletion(Job.java:1054)
	at org.apache.hadoop.mapred.TestJobCounters.__CLR3_0_21grq0qfkn(TestJobCounters.java:267)
	at org.apache.hadoop.mapred.TestJobCounters.testNewCounterA(TestJobCounters.java:257)


REGRESSION:  org.apache.hadoop.mapred.TestJobCounters.testNewCounterB

Error Message:
chmod: cannot access `/tmp/hadoop-hudson/mapred/staging/hudson-892699096/.staging/job_local_0005': No such file or directory 

Stack Trace:
org.apache.hadoop.util.Shell$ExitCodeException: chmod: cannot access `/tmp/hadoop-hudson/mapred/staging/hudson-892699096/.staging/job_local_0005': No such file or directory

	at org.apache.hadoop.util.Shell.runCommand(Shell.java:261)
	at org.apache.hadoop.util.Shell.run(Shell.java:188)
	at org.apache.hadoop.util.Shell$ShellCommandExecutor.execute(Shell.java:381)
	at org.apache.hadoop.util.Shell.execCommand(Shell.java:467)
	at org.apache.hadoop.util.Shell.execCommand(Shell.java:450)
	at org.apache.hadoop.fs.RawLocalFileSystem.execCommand(RawLocalFileSystem.java:549)
	at org.apache.hadoop.fs.RawLocalFileSystem.setPermission(RawLocalFileSystem.java:540)
	at org.apache.hadoop.fs.FilterFileSystem.setPermission(FilterFileSystem.java:353)
	at org.apache.hadoop.fs.FileSystem.mkdirs(FileSystem.java:428)
	at org.apache.hadoop.mapreduce.JobSubmitter.copyAndConfigureFiles(JobSubmitter.java:166)
	at org.apache.hadoop.mapreduce.JobSubmitter.copyAndConfigureFiles(JobSubmitter.java:283)
	at org.apache.hadoop.mapreduce.JobSubmitter.submitJobInternal(JobSubmitter.java:350)
	at org.apache.hadoop.mapreduce.Job$2.run(Job.java:1037)
	at org.apache.hadoop.mapreduce.Job$2.run(Job.java:1034)
	at java.security.AccessController.doPrivileged(Native Method)
	at javax.security.auth.Subject.doAs(Subject.java:396)
	at org.apache.hadoop.security.UserGroupInformation.doAs(UserGroupInformation.java:1142)
	at org.apache.hadoop.mapreduce.Job.submit(Job.java:1034)
	at org.apache.hadoop.mapreduce.Job.waitForCompletion(Job.java:1054)
	at org.apache.hadoop.mapred.TestJobCounters.__CLR3_0_24prot7fky(TestJobCounters.java:283)
	at org.apache.hadoop.mapred.TestJobCounters.testNewCounterB(TestJobCounters.java:273)


REGRESSION:  org.apache.hadoop.mapred.TestJobCounters.testNewCounterC

Error Message:
chmod: cannot access `/tmp/hadoop-hudson/mapred/staging/hudson-802297741/.staging/job_local_0006': No such file or directory 

Stack Trace:
org.apache.hadoop.util.Shell$ExitCodeException: chmod: cannot access `/tmp/hadoop-hudson/mapred/staging/hudson-802297741/.staging/job_local_0006': No such file or directory

	at org.apache.hadoop.util.Shell.runCommand(Shell.java:261)
	at org.apache.hadoop.util.Shell.run(Shell.java:188)
	at org.apache.hadoop.util.Shell$ShellCommandExecutor.execute(Shell.java:381)
	at org.apache.hadoop.util.Shell.execCommand(Shell.java:467)
	at org.apache.hadoop.util.Shell.execCommand(Shell.java:450)
	at org.apache.hadoop.fs.RawLocalFileSystem.execCommand(RawLocalFileSystem.java:549)
	at org.apache.hadoop.fs.RawLocalFileSystem.setPermission(RawLocalFileSystem.java:540)
	at org.apache.hadoop.fs.FilterFileSystem.setPermission(FilterFileSystem.java:353)
	at org.apache.hadoop.fs.FileSystem.mkdirs(FileSystem.java:428)
	at org.apache.hadoop.mapreduce.JobSubmitter.copyAndConfigureFiles(JobSubmitter.java:166)
	at org.apache.hadoop.mapreduce.JobSubmitter.copyAndConfigureFiles(JobSubmitter.java:283)
	at org.apache.hadoop.mapreduce.JobSubmitter.submitJobInternal(JobSubmitter.java:350)
	at org.apache.hadoop.mapreduce.Job$2.run(Job.java:1037)
	at org.apache.hadoop.mapreduce.Job$2.run(Job.java:1034)
	at java.security.AccessController.doPrivileged(Native Method)
	at javax.security.auth.Subject.doAs(Subject.java:396)
	at org.apache.hadoop.security.UserGroupInformation.doAs(UserGroupInformation.java:1142)
	at org.apache.hadoop.mapreduce.Job.submit(Job.java:1034)
	at org.apache.hadoop.mapreduce.Job.waitForCompletion(Job.java:1054)
	at org.apache.hadoop.mapred.TestJobCounters.__CLR3_0_27yrnlofl9(TestJobCounters.java:299)
	at org.apache.hadoop.mapred.TestJobCounters.testNewCounterC(TestJobCounters.java:289)


REGRESSION:  org.apache.hadoop.mapred.TestLocalMRNotification.testMR

Error Message:
chmod: cannot access `/tmp/hadoop-hudson/mapred/staging/hudson379779631/.staging/job_local_0001': No such file or directory 

Stack Trace:
org.apache.hadoop.util.Shell$ExitCodeException: chmod: cannot access `/tmp/hadoop-hudson/mapred/staging/hudson379779631/.staging/job_local_0001': No such file or directory

	at org.apache.hadoop.util.Shell.runCommand(Shell.java:261)
	at org.apache.hadoop.util.Shell.run(Shell.java:188)
	at org.apache.hadoop.util.Shell$ShellCommandExecutor.execute(Shell.java:381)
	at org.apache.hadoop.util.Shell.execCommand(Shell.java:467)
	at org.apache.hadoop.util.Shell.execCommand(Shell.java:450)
	at org.apache.hadoop.fs.RawLocalFileSystem.execCommand(RawLocalFileSystem.java:549)
	at org.apache.hadoop.fs.RawLocalFileSystem.setPermission(RawLocalFileSystem.java:540)
	at org.apache.hadoop.fs.FilterFileSystem.setPermission(FilterFileSystem.java:353)
	at org.apache.hadoop.fs.FileSystem.mkdirs(FileSystem.java:428)
	at org.apache.hadoop.mapreduce.JobSubmitter.copyAndConfigureFiles(JobSubmitter.java:166)
	at org.apache.hadoop.mapreduce.JobSubmitter.copyAndConfigureFiles(JobSubmitter.java:283)
	at org.apache.hadoop.mapreduce.JobSubmitter.submitJobInternal(JobSubmitter.java:350)
	at org.apache.hadoop.mapreduce.Job$2.run(Job.java:1037)
	at org.apache.hadoop.mapreduce.Job$2.run(Job.java:1034)
	at java.security.AccessController.doPrivileged(Native Method)
	at javax.security.auth.Subject.doAs(Subject.java:396)
	at org.apache.hadoop.security.UserGroupInformation.doAs(UserGroupInformation.java:1142)
	at org.apache.hadoop.mapreduce.Job.submit(Job.java:1034)
	at org.apache.hadoop.mapred.JobClient.submitJob(JobClient.java:536)
	at org.apache.hadoop.mapred.JobClient.runJob(JobClient.java:781)
	at org.apache.hadoop.mapred.NotificationTestCase.launchWordCount(NotificationTestCase.java:220)
	at org.apache.hadoop.mapred.NotificationTestCase.__CLR3_0_2ldwkpup4x(NotificationTestCase.java:150)
	at org.apache.hadoop.mapred.NotificationTestCase.testMR(NotificationTestCase.java:149)


REGRESSION:  org.apache.hadoop.mapred.TestMRWithDistributedCache.testLocalJobRunner

Error Message:
chmod: cannot access `/tmp/hadoop-hudson/mapred/staging/hudson-1782297307/.staging/job_local_0001': No such file or directory 

Stack Trace:
org.apache.hadoop.util.Shell$ExitCodeException: chmod: cannot access `/tmp/hadoop-hudson/mapred/staging/hudson-1782297307/.staging/job_local_0001': No such file or directory

	at org.apache.hadoop.util.Shell.runCommand(Shell.java:261)
	at org.apache.hadoop.util.Shell.run(Shell.java:188)
	at org.apache.hadoop.util.Shell$ShellCommandExecutor.execute(Shell.java:381)
	at org.apache.hadoop.util.Shell.execCommand(Shell.java:467)
	at org.apache.hadoop.util.Shell.execCommand(Shell.java:450)
	at org.apache.hadoop.fs.RawLocalFileSystem.execCommand(RawLocalFileSystem.java:549)
	at org.apache.hadoop.fs.RawLocalFileSystem.setPermission(RawLocalFileSystem.java:540)
	at org.apache.hadoop.fs.FilterFileSystem.setPermission(FilterFileSystem.java:353)
	at org.apache.hadoop.fs.FileSystem.mkdirs(FileSystem.java:428)
	at org.apache.hadoop.mapreduce.JobSubmitter.copyAndConfigureFiles(JobSubmitter.java:166)
	at org.apache.hadoop.mapreduce.JobSubmitter.copyAndConfigureFiles(JobSubmitter.java:283)
	at org.apache.hadoop.mapreduce.JobSubmitter.submitJobInternal(JobSubmitter.java:350)
	at org.apache.hadoop.mapreduce.Job$2.run(Job.java:1037)
	at org.apache.hadoop.mapreduce.Job$2.run(Job.java:1034)
	at java.security.AccessController.doPrivileged(Native Method)
	at javax.security.auth.Subject.doAs(Subject.java:396)
	at org.apache.hadoop.security.UserGroupInformation.doAs(UserGroupInformation.java:1142)
	at org.apache.hadoop.mapreduce.Job.submit(Job.java:1034)
	at org.apache.hadoop.mapred.TestMRWithDistributedCache.testWithConf(TestMRWithDistributedCache.java:154)
	at org.apache.hadoop.mapred.TestMRWithDistributedCache.__CLR3_0_2mk2aclukq(TestMRWithDistributedCache.java:163)
	at org.apache.hadoop.mapred.TestMRWithDistributedCache.testLocalJobRunner(TestMRWithDistributedCache.java:159)


REGRESSION:  org.apache.hadoop.mapred.TestMapRed.testNullKeys

Error Message:
chmod: cannot access `/tmp/hadoop-hudson/mapred/staging/hudson-704066139/.staging/job_local_0004': No such file or directory 

Stack Trace:
org.apache.hadoop.util.Shell$ExitCodeException: chmod: cannot access `/tmp/hadoop-hudson/mapred/staging/hudson-704066139/.staging/job_local_0004': No such file or directory

	at org.apache.hadoop.util.Shell.runCommand(Shell.java:261)
	at org.apache.hadoop.util.Shell.run(Shell.java:188)
	at org.apache.hadoop.util.Shell$ShellCommandExecutor.execute(Shell.java:381)
	at org.apache.hadoop.util.Shell.execCommand(Shell.java:467)
	at org.apache.hadoop.util.Shell.execCommand(Shell.java:450)
	at org.apache.hadoop.fs.RawLocalFileSystem.execCommand(RawLocalFileSystem.java:549)
	at org.apache.hadoop.fs.RawLocalFileSystem.setPermission(RawLocalFileSystem.java:540)
	at org.apache.hadoop.fs.FilterFileSystem.setPermission(FilterFileSystem.java:353)
	at org.apache.hadoop.fs.FileSystem.mkdirs(FileSystem.java:428)
	at org.apache.hadoop.mapreduce.JobSubmitter.copyAndConfigureFiles(JobSubmitter.java:166)
	at org.apache.hadoop.mapreduce.JobSubmitter.copyAndConfigureFiles(JobSubmitter.java:283)
	at org.apache.hadoop.mapreduce.JobSubmitter.submitJobInternal(JobSubmitter.java:350)
	at org.apache.hadoop.mapreduce.Job$2.run(Job.java:1037)
	at org.apache.hadoop.mapreduce.Job$2.run(Job.java:1034)
	at java.security.AccessController.doPrivileged(Native Method)
	at javax.security.auth.Subject.doAs(Subject.java:396)
	at org.apache.hadoop.security.UserGroupInformation.doAs(UserGroupInformation.java:1142)
	at org.apache.hadoop.mapreduce.Job.submit(Job.java:1034)
	at org.apache.hadoop.mapred.JobClient.submitJob(JobClient.java:536)
	at org.apache.hadoop.mapred.JobClient.runJob(JobClient.java:781)
	at org.apache.hadoop.mapred.TestMapRed.__CLR3_0_2i5a2rwxhn(TestMapRed.java:355)
	at org.apache.hadoop.mapred.TestMapRed.testNullKeys(TestMapRed.java:324)


REGRESSION:  org.apache.hadoop.mapred.TestMapRed.testCompression

Error Message:
chmod: cannot access `/tmp/hadoop-hudson/mapred/staging/hudson521928197/.staging/job_local_0005': No such file or directory 

Stack Trace:
org.apache.hadoop.util.Shell$ExitCodeException: chmod: cannot access `/tmp/hadoop-hudson/mapred/staging/hudson521928197/.staging/job_local_0005': No such file or directory

	at org.apache.hadoop.util.Shell.runCommand(Shell.java:261)
	at org.apache.hadoop.util.Shell.run(Shell.java:188)
	at org.apache.hadoop.util.Shell$ShellCommandExecutor.execute(Shell.java:381)
	at org.apache.hadoop.util.Shell.execCommand(Shell.java:467)
	at org.apache.hadoop.util.Shell.execCommand(Shell.java:450)
	at org.apache.hadoop.fs.RawLocalFileSystem.execCommand(RawLocalFileSystem.java:549)
	at org.apache.hadoop.fs.RawLocalFileSystem.setPermission(RawLocalFileSystem.java:540)
	at org.apache.hadoop.fs.FilterFileSystem.setPermission(FilterFileSystem.java:353)
	at org.apache.hadoop.fs.FileSystem.mkdirs(FileSystem.java:428)
	at org.apache.hadoop.mapreduce.JobSubmitter.copyAndConfigureFiles(JobSubmitter.java:166)
	at org.apache.hadoop.mapreduce.JobSubmitter.copyAndConfigureFiles(JobSubmitter.java:283)
	at org.apache.hadoop.mapreduce.JobSubmitter.submitJobInternal(JobSubmitter.java:350)
	at org.apache.hadoop.mapreduce.Job$2.run(Job.java:1037)
	at org.apache.hadoop.mapreduce.Job$2.run(Job.java:1034)
	at java.security.AccessController.doPrivileged(Native Method)
	at javax.security.auth.Subject.doAs(Subject.java:396)
	at org.apache.hadoop.security.UserGroupInformation.doAs(UserGroupInformation.java:1142)
	at org.apache.hadoop.mapreduce.Job.submit(Job.java:1034)
	at org.apache.hadoop.mapred.JobClient.submitJob(JobClient.java:536)
	at org.apache.hadoop.mapred.JobClient.runJob(JobClient.java:781)
	at org.apache.hadoop.mapred.TestMapRed.checkCompression(TestMapRed.java:403)
	at org.apache.hadoop.mapred.TestMapRed.__CLR3_0_2rawc05xjw(TestMapRed.java:426)
	at org.apache.hadoop.mapred.TestMapRed.testCompression(TestMapRed.java:421)


REGRESSION:  org.apache.hadoop.mapred.TestMapRed.testSmallInput

Error Message:
Threw exception:org.apache.hadoop.util.Shell$ExitCodeException: chmod: cannot access `/tmp/hadoop-hudson/mapred/staging/hudson-813928558/.staging/job_local_0006': No such file or directory 

Stack Trace:
junit.framework.AssertionFailedError: Threw exception:org.apache.hadoop.util.Shell$ExitCodeException: chmod: cannot access `/tmp/hadoop-hudson/mapred/staging/hudson-813928558/.staging/job_local_0006': No such file or directory


	at org.apache.hadoop.mapred.TestMapRed.runJob(TestMapRed.java:765)
	at org.apache.hadoop.mapred.TestMapRed.__CLR3_0_29c506cxp1(TestMapRed.java:715)
	at org.apache.hadoop.mapred.TestMapRed.testSmallInput(TestMapRed.java:714)


REGRESSION:  org.apache.hadoop.mapred.TestMapRed.testBiggerInput

Error Message:
Threw exception:org.apache.hadoop.util.Shell$ExitCodeException: chmod: cannot access `/tmp/hadoop-hudson/mapred/staging/hudson1260115973/.staging/job_local_0007': No such file or directory 

Stack Trace:
junit.framework.AssertionFailedError: Threw exception:org.apache.hadoop.util.Shell$ExitCodeException: chmod: cannot access `/tmp/hadoop-hudson/mapred/staging/hudson1260115973/.staging/job_local_0007': No such file or directory


	at org.apache.hadoop.mapred.TestMapRed.runJob(TestMapRed.java:765)
	at org.apache.hadoop.mapred.TestMapRed.__CLR3_0_22j0llhxp3(TestMapRed.java:720)
	at org.apache.hadoop.mapred.TestMapRed.testBiggerInput(TestMapRed.java:719)


REGRESSION:  org.apache.hadoop.mapred.TestTaskCommit.testCommitFail

Error Message:
chmod: cannot access `/tmp/hadoop-hudson/mapred/staging/hudson-429142114/.staging/job_local_0001': No such file or directory 

Stack Trace:
org.apache.hadoop.util.Shell$ExitCodeException: chmod: cannot access `/tmp/hadoop-hudson/mapred/staging/hudson-429142114/.staging/job_local_0001': No such file or directory

	at org.apache.hadoop.util.Shell.runCommand(Shell.java:261)
	at org.apache.hadoop.util.Shell.run(Shell.java:188)
	at org.apache.hadoop.util.Shell$ShellCommandExecutor.execute(Shell.java:381)
	at org.apache.hadoop.util.Shell.execCommand(Shell.java:467)
	at org.apache.hadoop.util.Shell.execCommand(Shell.java:450)
	at org.apache.hadoop.fs.RawLocalFileSystem.execCommand(RawLocalFileSystem.java:549)
	at org.apache.hadoop.fs.RawLocalFileSystem.setPermission(RawLocalFileSystem.java:540)
	at org.apache.hadoop.fs.FilterFileSystem.setPermission(FilterFileSystem.java:353)
	at org.apache.hadoop.fs.FileSystem.mkdirs(FileSystem.java:428)
	at org.apache.hadoop.mapreduce.JobSubmitter.copyAndConfigureFiles(JobSubmitter.java:166)
	at org.apache.hadoop.mapreduce.JobSubmitter.copyAndConfigureFiles(JobSubmitter.java:283)
	at org.apache.hadoop.mapreduce.JobSubmitter.submitJobInternal(JobSubmitter.java:350)
	at org.apache.hadoop.mapreduce.Job$2.run(Job.java:1037)
	at org.apache.hadoop.mapreduce.Job$2.run(Job.java:1034)
	at java.security.AccessController.doPrivileged(Native Method)
	at javax.security.auth.Subject.doAs(Subject.java:396)
	at org.apache.hadoop.security.UserGroupInformation.doAs(UserGroupInformation.java:1142)
	at org.apache.hadoop.mapreduce.Job.submit(Job.java:1034)
	at org.apache.hadoop.mapred.JobClient.submitJob(JobClient.java:536)
	at org.apache.hadoop.mapred.UtilsForTests.runJob(UtilsForTests.java:587)
	at org.apache.hadoop.mapred.TestTaskCommit.__CLR3_0_222imwihkm(TestTaskCommit.java:91)
	at org.apache.hadoop.mapred.TestTaskCommit.testCommitFail(TestTaskCommit.java:85)


REGRESSION:  org.apache.hadoop.mapred.TestUserDefinedCounters.testMapReduceJob

Error Message:
chmod: cannot access `/tmp/hadoop-hudson/mapred/staging/hudson-695078858/.staging/job_local_0001': No such file or directory 

Stack Trace:
org.apache.hadoop.util.Shell$ExitCodeException: chmod: cannot access `/tmp/hadoop-hudson/mapred/staging/hudson-695078858/.staging/job_local_0001': No such file or directory

	at org.apache.hadoop.util.Shell.runCommand(Shell.java:261)
	at org.apache.hadoop.util.Shell.run(Shell.java:188)
	at org.apache.hadoop.util.Shell$ShellCommandExecutor.execute(Shell.java:381)
	at org.apache.hadoop.util.Shell.execCommand(Shell.java:467)
	at org.apache.hadoop.util.Shell.execCommand(Shell.java:450)
	at org.apache.hadoop.fs.RawLocalFileSystem.execCommand(RawLocalFileSystem.java:549)
	at org.apache.hadoop.fs.RawLocalFileSystem.setPermission(RawLocalFileSystem.java:540)
	at org.apache.hadoop.fs.FilterFileSystem.setPermission(FilterFileSystem.java:353)
	at org.apache.hadoop.fs.FileSystem.mkdirs(FileSystem.java:428)
	at org.apache.hadoop.mapreduce.JobSubmitter.copyAndConfigureFiles(JobSubmitter.java:166)
	at org.apache.hadoop.mapreduce.JobSubmitter.copyAndConfigureFiles(JobSubmitter.java:283)
	at org.apache.hadoop.mapreduce.JobSubmitter.submitJobInternal(JobSubmitter.java:350)
	at org.apache.hadoop.mapreduce.Job$2.run(Job.java:1037)
	at org.apache.hadoop.mapreduce.Job$2.run(Job.java:1034)
	at java.security.AccessController.doPrivileged(Native Method)
	at javax.security.auth.Subject.doAs(Subject.java:396)
	at org.apache.hadoop.security.UserGroupInformation.doAs(UserGroupInformation.java:1142)
	at org.apache.hadoop.mapreduce.Job.submit(Job.java:1034)
	at org.apache.hadoop.mapred.JobClient.submitJob(JobClient.java:536)
	at org.apache.hadoop.mapred.JobClient.runJob(JobClient.java:781)
	at org.apache.hadoop.mapred.TestUserDefinedCounters.__CLR3_0_2nmr1ska2r(TestUserDefinedCounters.java:101)
	at org.apache.hadoop.mapred.TestUserDefinedCounters.testMapReduceJob(TestUserDefinedCounters.java:77)


REGRESSION:  org.apache.hadoop.mapred.jobcontrol.TestLocalJobControl.testLocalJobControlDataCopy

Error Message:
Some jobs failed expected:<0> but was:<4>

Stack Trace:
junit.framework.AssertionFailedError: Some jobs failed expected:<0> but was:<4>
	at org.apache.hadoop.mapred.jobcontrol.TestLocalJobControl.__CLR3_0_22dofof9pc(TestLocalJobControl.java:131)
	at org.apache.hadoop.mapred.jobcontrol.TestLocalJobControl.testLocalJobControlDataCopy(TestLocalJobControl.java:62)


REGRESSION:  org.apache.hadoop.mapred.join.TestDatamerge.testSimpleInnerJoin

Error Message:
chmod: cannot access `/tmp/hadoop-hudson/mapred/staging/hudson488663151/.staging/job_local_0001': No such file or directory 

Stack Trace:
org.apache.hadoop.util.Shell$ExitCodeException: chmod: cannot access `/tmp/hadoop-hudson/mapred/staging/hudson488663151/.staging/job_local_0001': No such file or directory

	at org.apache.hadoop.util.Shell.runCommand(Shell.java:261)
	at org.apache.hadoop.util.Shell.run(Shell.java:188)
	at org.apache.hadoop.util.Shell$ShellCommandExecutor.execute(Shell.java:381)
	at org.apache.hadoop.util.Shell.execCommand(Shell.java:467)
	at org.apache.hadoop.util.Shell.execCommand(Shell.java:450)
	at org.apache.hadoop.fs.RawLocalFileSystem.execCommand(RawLocalFileSystem.java:549)
	at org.apache.hadoop.fs.RawLocalFileSystem.setPermission(RawLocalFileSystem.java:540)
	at org.apache.hadoop.fs.FilterFileSystem.setPermission(FilterFileSystem.java:353)
	at org.apache.hadoop.fs.FileSystem.mkdirs(FileSystem.java:428)
	at org.apache.hadoop.mapreduce.JobSubmitter.copyAndConfigureFiles(JobSubmitter.java:166)
	at org.apache.hadoop.mapreduce.JobSubmitter.copyAndConfigureFiles(JobSubmitter.java:283)
	at org.apache.hadoop.mapreduce.JobSubmitter.submitJobInternal(JobSubmitter.java:350)
	at org.apache.hadoop.mapreduce.Job$2.run(Job.java:1037)
	at org.apache.hadoop.mapreduce.Job$2.run(Job.java:1034)
	at java.security.AccessController.doPrivileged(Native Method)
	at javax.security.auth.Subject.doAs(Subject.java:396)
	at org.apache.hadoop.security.UserGroupInformation.doAs(UserGroupInformation.java:1142)
	at org.apache.hadoop.mapreduce.Job.submit(Job.java:1034)
	at org.apache.hadoop.mapred.JobClient.submitJob(JobClient.java:536)
	at org.apache.hadoop.mapred.JobClient.runJob(JobClient.java:781)
	at org.apache.hadoop.mapred.join.TestDatamerge.joinAs(TestDatamerge.java:245)
	at org.apache.hadoop.mapred.join.TestDatamerge.__CLR3_0_239fxnh7xp(TestDatamerge.java:250)
	at org.apache.hadoop.mapred.join.TestDatamerge.testSimpleInnerJoin(TestDatamerge.java:249)
	at junit.extensions.TestDecorator.basicRun(TestDecorator.java:24)
	at junit.extensions.TestSetup$1.protect(TestSetup.java:23)
	at junit.extensions.TestSetup.run(TestSetup.java:27)


REGRESSION:  org.apache.hadoop.mapred.join.TestDatamerge.testSimpleOuterJoin

Error Message:
chmod: cannot access `/tmp/hadoop-hudson/mapred/staging/hudson-1986116261/.staging/job_local_0002': No such file or directory 

Stack Trace:
org.apache.hadoop.util.Shell$ExitCodeException: chmod: cannot access `/tmp/hadoop-hudson/mapred/staging/hudson-1986116261/.staging/job_local_0002': No such file or directory

	at org.apache.hadoop.util.Shell.runCommand(Shell.java:261)
	at org.apache.hadoop.util.Shell.run(Shell.java:188)
	at org.apache.hadoop.util.Shell$ShellCommandExecutor.execute(Shell.java:381)
	at org.apache.hadoop.util.Shell.execCommand(Shell.java:467)
	at org.apache.hadoop.util.Shell.execCommand(Shell.java:450)
	at org.apache.hadoop.fs.RawLocalFileSystem.execCommand(RawLocalFileSystem.java:549)
	at org.apache.hadoop.fs.RawLocalFileSystem.setPermission(RawLocalFileSystem.java:540)
	at org.apache.hadoop.fs.FilterFileSystem.setPermission(FilterFileSystem.java:353)
	at org.apache.hadoop.fs.FileSystem.mkdirs(FileSystem.java:428)
	at org.apache.hadoop.mapreduce.JobSubmitter.copyAndConfigureFiles(JobSubmitter.java:166)
	at org.apache.hadoop.mapreduce.JobSubmitter.copyAndConfigureFiles(JobSubmitter.java:283)
	at org.apache.hadoop.mapreduce.JobSubmitter.submitJobInternal(JobSubmitter.java:350)
	at org.apache.hadoop.mapreduce.Job$2.run(Job.java:1037)
	at org.apache.hadoop.mapreduce.Job$2.run(Job.java:1034)
	at java.security.AccessController.doPrivileged(Native Method)
	at javax.security.auth.Subject.doAs(Subject.java:396)
	at org.apache.hadoop.security.UserGroupInformation.doAs(UserGroupInformation.java:1142)
	at org.apache.hadoop.mapreduce.Job.submit(Job.java:1034)
	at org.apache.hadoop.mapred.JobClient.submitJob(JobClient.java:536)
	at org.apache.hadoop.mapred.JobClient.runJob(JobClient.java:781)
	at org.apache.hadoop.mapred.join.TestDatamerge.joinAs(TestDatamerge.java:245)
	at org.apache.hadoop.mapred.join.TestDatamerge.__CLR3_0_2abzcwo7xr(TestDatamerge.java:254)
	at org.apache.hadoop.mapred.join.TestDatamerge.testSimpleOuterJoin(TestDatamerge.java:253)
	at junit.extensions.TestDecorator.basicRun(TestDecorator.java:24)
	at junit.extensions.TestSetup$1.protect(TestSetup.java:23)
	at junit.extensions.TestSetup.run(TestSetup.java:27)


REGRESSION:  org.apache.hadoop.mapred.join.TestDatamerge.testSimpleOverride

Error Message:
chmod: cannot access `/tmp/hadoop-hudson/mapred/staging/hudson132665447/.staging/job_local_0003': No such file or directory 

Stack Trace:
org.apache.hadoop.util.Shell$ExitCodeException: chmod: cannot access `/tmp/hadoop-hudson/mapred/staging/hudson132665447/.staging/job_local_0003': No such file or directory

	at org.apache.hadoop.util.Shell.runCommand(Shell.java:261)
	at org.apache.hadoop.util.Shell.run(Shell.java:188)
	at org.apache.hadoop.util.Shell$ShellCommandExecutor.execute(Shell.java:381)
	at org.apache.hadoop.util.Shell.execCommand(Shell.java:467)
	at org.apache.hadoop.util.Shell.execCommand(Shell.java:450)
	at org.apache.hadoop.fs.RawLocalFileSystem.execCommand(RawLocalFileSystem.java:549)
	at org.apache.hadoop.fs.RawLocalFileSystem.setPermission(RawLocalFileSystem.java:540)
	at org.apache.hadoop.fs.FilterFileSystem.setPermission(FilterFileSystem.java:353)
	at org.apache.hadoop.fs.FileSystem.mkdirs(FileSystem.java:428)
	at org.apache.hadoop.mapreduce.JobSubmitter.copyAndConfigureFiles(JobSubmitter.java:166)
	at org.apache.hadoop.mapreduce.JobSubmitter.copyAndConfigureFiles(JobSubmitter.java:283)
	at org.apache.hadoop.mapreduce.JobSubmitter.submitJobInternal(JobSubmitter.java:350)
	at org.apache.hadoop.mapreduce.Job$2.run(Job.java:1037)
	at org.apache.hadoop.mapreduce.Job$2.run(Job.java:1034)
	at java.security.AccessController.doPrivileged(Native Method)
	at javax.security.auth.Subject.doAs(Subject.java:396)
	at org.apache.hadoop.security.UserGroupInformation.doAs(UserGroupInformation.java:1142)
	at org.apache.hadoop.mapreduce.Job.submit(Job.java:1034)
	at org.apache.hadoop.mapred.JobClient.submitJob(JobClient.java:536)
	at org.apache.hadoop.mapred.JobClient.runJob(JobClient.java:781)
	at org.apache.hadoop.mapred.join.TestDatamerge.joinAs(TestDatamerge.java:245)
	at org.apache.hadoop.mapred.join.TestDatamerge.__CLR3_0_2a19all7xt(TestDatamerge.java:258)
	at org.apache.hadoop.mapred.join.TestDatamerge.testSimpleOverride(TestDatamerge.java:257)
	at junit.extensions.TestDecorator.basicRun(TestDecorator.java:24)
	at junit.extensions.TestSetup$1.protect(TestSetup.java:23)
	at junit.extensions.TestSetup.run(TestSetup.java:27)


REGRESSION:  org.apache.hadoop.mapred.join.TestDatamerge.testNestedJoin

Error Message:
chmod: cannot access `/tmp/hadoop-hudson/mapred/staging/hudson1681069429/.staging/job_local_0004': No such file or directory 

Stack Trace:
org.apache.hadoop.util.Shell$ExitCodeException: chmod: cannot access `/tmp/hadoop-hudson/mapred/staging/hudson1681069429/.staging/job_local_0004': No such file or directory

	at org.apache.hadoop.util.Shell.runCommand(Shell.java:261)
	at org.apache.hadoop.util.Shell.run(Shell.java:188)
	at org.apache.hadoop.util.Shell$ShellCommandExecutor.execute(Shell.java:381)
	at org.apache.hadoop.util.Shell.execCommand(Shell.java:467)
	at org.apache.hadoop.util.Shell.execCommand(Shell.java:450)
	at org.apache.hadoop.fs.RawLocalFileSystem.execCommand(RawLocalFileSystem.java:549)
	at org.apache.hadoop.fs.RawLocalFileSystem.setPermission(RawLocalFileSystem.java:540)
	at org.apache.hadoop.fs.FilterFileSystem.setPermission(FilterFileSystem.java:353)
	at org.apache.hadoop.fs.FileSystem.mkdirs(FileSystem.java:428)
	at org.apache.hadoop.mapreduce.JobSubmitter.copyAndConfigureFiles(JobSubmitter.java:166)
	at org.apache.hadoop.mapreduce.JobSubmitter.copyAndConfigureFiles(JobSubmitter.java:283)
	at org.apache.hadoop.mapreduce.JobSubmitter.submitJobInternal(JobSubmitter.java:350)
	at org.apache.hadoop.mapreduce.Job$2.run(Job.java:1037)
	at org.apache.hadoop.mapreduce.Job$2.run(Job.java:1034)
	at java.security.AccessController.doPrivileged(Native Method)
	at javax.security.auth.Subject.doAs(Subject.java:396)
	at org.apache.hadoop.security.UserGroupInformation.doAs(UserGroupInformation.java:1142)
	at org.apache.hadoop.mapreduce.Job.submit(Job.java:1034)
	at org.apache.hadoop.mapred.JobClient.submitJob(JobClient.java:536)
	at org.apache.hadoop.mapred.JobClient.runJob(JobClient.java:781)
	at org.apache.hadoop.mapred.join.TestDatamerge.__CLR3_0_2fiduje7xv(TestDatamerge.java:319)
	at org.apache.hadoop.mapred.join.TestDatamerge.testNestedJoin(TestDatamerge.java:261)
	at junit.extensions.TestDecorator.basicRun(TestDecorator.java:24)
	at junit.extensions.TestSetup$1.protect(TestSetup.java:23)
	at junit.extensions.TestSetup.run(TestSetup.java:27)


REGRESSION:  org.apache.hadoop.mapred.join.TestDatamerge.testEmptyJoin

Error Message:
chmod: cannot access `/tmp/hadoop-hudson/mapred/staging/hudson1487310575/.staging/job_local_0005': No such file or directory 

Stack Trace:
org.apache.hadoop.util.Shell$ExitCodeException: chmod: cannot access `/tmp/hadoop-hudson/mapred/staging/hudson1487310575/.staging/job_local_0005': No such file or directory

	at org.apache.hadoop.util.Shell.runCommand(Shell.java:261)
	at org.apache.hadoop.util.Shell.run(Shell.java:188)
	at org.apache.hadoop.util.Shell$ShellCommandExecutor.execute(Shell.java:381)
	at org.apache.hadoop.util.Shell.execCommand(Shell.java:467)
	at org.apache.hadoop.util.Shell.execCommand(Shell.java:450)
	at org.apache.hadoop.fs.RawLocalFileSystem.execCommand(RawLocalFileSystem.java:549)
	at org.apache.hadoop.fs.RawLocalFileSystem.setPermission(RawLocalFileSystem.java:540)
	at org.apache.hadoop.fs.FilterFileSystem.setPermission(FilterFileSystem.java:353)
	at org.apache.hadoop.fs.FileSystem.mkdirs(FileSystem.java:428)
	at org.apache.hadoop.mapreduce.JobSubmitter.copyAndConfigureFiles(JobSubmitter.java:166)
	at org.apache.hadoop.mapreduce.JobSubmitter.copyAndConfigureFiles(JobSubmitter.java:283)
	at org.apache.hadoop.mapreduce.JobSubmitter.submitJobInternal(JobSubmitter.java:350)
	at org.apache.hadoop.mapreduce.Job$2.run(Job.java:1037)
	at org.apache.hadoop.mapreduce.Job$2.run(Job.java:1034)
	at java.security.AccessController.doPrivileged(Native Method)
	at javax.security.auth.Subject.doAs(Subject.java:396)
	at org.apache.hadoop.security.UserGroupInformation.doAs(UserGroupInformation.java:1142)
	at org.apache.hadoop.mapreduce.Job.submit(Job.java:1034)
	at org.apache.hadoop.mapred.JobClient.submitJob(JobClient.java:536)
	at org.apache.hadoop.mapred.JobClient.runJob(JobClient.java:781)
	at org.apache.hadoop.mapred.join.TestDatamerge.__CLR3_0_2f6b0b080f(TestDatamerge.java:367)
	at org.apache.hadoop.mapred.join.TestDatamerge.testEmptyJoin(TestDatamerge.java:353)
	at junit.extensions.TestDecorator.basicRun(TestDecorator.java:24)
	at junit.extensions.TestSetup$1.protect(TestSetup.java:23)
	at junit.extensions.TestSetup.run(TestSetup.java:27)


REGRESSION:  org.apache.hadoop.mapred.lib.TestChainMapReduce.testChain

Error Message:
chmod: cannot access `/tmp/hadoop-hudson/mapred/staging/hudson1699349489/.staging/job_local_0001': No such file or directory 

Stack Trace:
org.apache.hadoop.util.Shell$ExitCodeException: chmod: cannot access `/tmp/hadoop-hudson/mapred/staging/hudson1699349489/.staging/job_local_0001': No such file or directory

	at org.apache.hadoop.util.Shell.runCommand(Shell.java:261)
	at org.apache.hadoop.util.Shell.run(Shell.java:188)
	at org.apache.hadoop.util.Shell$ShellCommandExecutor.execute(Shell.java:381)
	at org.apache.hadoop.util.Shell.execCommand(Shell.java:467)
	at org.apache.hadoop.util.Shell.execCommand(Shell.java:450)
	at org.apache.hadoop.fs.RawLocalFileSystem.execCommand(RawLocalFileSystem.java:549)
	at org.apache.hadoop.fs.RawLocalFileSystem.setPermission(RawLocalFileSystem.java:540)
	at org.apache.hadoop.fs.FilterFileSystem.setPermission(FilterFileSystem.java:353)
	at org.apache.hadoop.fs.FileSystem.mkdirs(FileSystem.java:428)
	at org.apache.hadoop.mapreduce.JobSubmitter.copyAndConfigureFiles(JobSubmitter.java:166)
	at org.apache.hadoop.mapreduce.JobSubmitter.copyAndConfigureFiles(JobSubmitter.java:283)
	at org.apache.hadoop.mapreduce.JobSubmitter.submitJobInternal(JobSubmitter.java:350)
	at org.apache.hadoop.mapreduce.Job$2.run(Job.java:1037)
	at org.apache.hadoop.mapreduce.Job$2.run(Job.java:1034)
	at java.security.AccessController.doPrivileged(Native Method)
	at javax.security.auth.Subject.doAs(Subject.java:396)
	at org.apache.hadoop.security.UserGroupInformation.doAs(UserGroupInformation.java:1142)
	at org.apache.hadoop.mapreduce.Job.submit(Job.java:1034)
	at org.apache.hadoop.mapred.JobClient.submitJob(JobClient.java:536)
	at org.apache.hadoop.mapred.lib.TestChainMapReduce.__CLR3_0_2ke5z1yhnx(TestChainMapReduce.java:130)
	at org.apache.hadoop.mapred.lib.TestChainMapReduce.testChain(TestChainMapReduce.java:70)


REGRESSION:  org.apache.hadoop.mapred.lib.TestKeyFieldBasedComparator.testBasicUnixComparator

Error Message:
chmod: cannot access `/tmp/hadoop-hudson/mapred/staging/hudson876899489/.staging/job_local_0001': No such file or directory 

Stack Trace:
org.apache.hadoop.util.Shell$ExitCodeException: chmod: cannot access `/tmp/hadoop-hudson/mapred/staging/hudson876899489/.staging/job_local_0001': No such file or directory

	at org.apache.hadoop.util.Shell.runCommand(Shell.java:261)
	at org.apache.hadoop.util.Shell.run(Shell.java:188)
	at org.apache.hadoop.util.Shell$ShellCommandExecutor.execute(Shell.java:381)
	at org.apache.hadoop.util.Shell.execCommand(Shell.java:467)
	at org.apache.hadoop.util.Shell.execCommand(Shell.java:450)
	at org.apache.hadoop.fs.RawLocalFileSystem.execCommand(RawLocalFileSystem.java:549)
	at org.apache.hadoop.fs.RawLocalFileSystem.setPermission(RawLocalFileSystem.java:540)
	at org.apache.hadoop.fs.FilterFileSystem.setPermission(FilterFileSystem.java:353)
	at org.apache.hadoop.fs.FileSystem.mkdirs(FileSystem.java:428)
	at org.apache.hadoop.mapreduce.JobSubmitter.copyAndConfigureFiles(JobSubmitter.java:166)
	at org.apache.hadoop.mapreduce.JobSubmitter.copyAndConfigureFiles(JobSubmitter.java:283)
	at org.apache.hadoop.mapreduce.JobSubmitter.submitJobInternal(JobSubmitter.java:350)
	at org.apache.hadoop.mapreduce.Job$2.run(Job.java:1037)
	at org.apache.hadoop.mapreduce.Job$2.run(Job.java:1034)
	at java.security.AccessController.doPrivileged(Native Method)
	at javax.security.auth.Subject.doAs(Subject.java:396)
	at org.apache.hadoop.security.UserGroupInformation.doAs(UserGroupInformation.java:1142)
	at org.apache.hadoop.mapreduce.Job.submit(Job.java:1034)
	at org.apache.hadoop.mapred.JobClient.submitJob(JobClient.java:536)
	at org.apache.hadoop.mapred.lib.TestKeyFieldBasedComparator.configure(TestKeyFieldBasedComparator.java:88)
	at org.apache.hadoop.mapred.lib.TestKeyFieldBasedComparator.__CLR3_0_2efq8inuxk(TestKeyFieldBasedComparator.java:122)
	at org.apache.hadoop.mapred.lib.TestKeyFieldBasedComparator.testBasicUnixComparator(TestKeyFieldBasedComparator.java:121)


REGRESSION:  org.apache.hadoop.mapred.lib.TestMultipleOutputs.testWithoutCounters

Error Message:
chmod: cannot access `/tmp/hadoop-hudson/mapred/staging/hudson993123103/.staging/job_local_0001': No such file or directory 

Stack Trace:
org.apache.hadoop.util.Shell$ExitCodeException: chmod: cannot access `/tmp/hadoop-hudson/mapred/staging/hudson993123103/.staging/job_local_0001': No such file or directory

	at org.apache.hadoop.util.Shell.runCommand(Shell.java:261)
	at org.apache.hadoop.util.Shell.run(Shell.java:188)
	at org.apache.hadoop.util.Shell$ShellCommandExecutor.execute(Shell.java:381)
	at org.apache.hadoop.util.Shell.execCommand(Shell.java:467)
	at org.apache.hadoop.util.Shell.execCommand(Shell.java:450)
	at org.apache.hadoop.fs.RawLocalFileSystem.execCommand(RawLocalFileSystem.java:549)
	at org.apache.hadoop.fs.RawLocalFileSystem.setPermission(RawLocalFileSystem.java:540)
	at org.apache.hadoop.fs.FilterFileSystem.setPermission(FilterFileSystem.java:353)
	at org.apache.hadoop.fs.FileSystem.mkdirs(FileSystem.java:428)
	at org.apache.hadoop.mapreduce.JobSubmitter.copyAndConfigureFiles(JobSubmitter.java:166)
	at org.apache.hadoop.mapreduce.JobSubmitter.copyAndConfigureFiles(JobSubmitter.java:283)
	at org.apache.hadoop.mapreduce.JobSubmitter.submitJobInternal(JobSubmitter.java:350)
	at org.apache.hadoop.mapreduce.Job$2.run(Job.java:1037)
	at org.apache.hadoop.mapreduce.Job$2.run(Job.java:1034)
	at java.security.AccessController.doPrivileged(Native Method)
	at javax.security.auth.Subject.doAs(Subject.java:396)
	at org.apache.hadoop.security.UserGroupInformation.doAs(UserGroupInformation.java:1142)
	at org.apache.hadoop.mapreduce.Job.submit(Job.java:1034)
	at org.apache.hadoop.mapred.JobClient.submitJob(JobClient.java:536)
	at org.apache.hadoop.mapred.lib.TestMultipleOutputs._testMultipleOutputs(TestMultipleOutputs.java:215)
	at org.apache.hadoop.mapred.lib.TestMultipleOutputs.__CLR3_0_27rxkdoh6e(TestMultipleOutputs.java:42)
	at org.apache.hadoop.mapred.lib.TestMultipleOutputs.testWithoutCounters(TestMultipleOutputs.java:41)


REGRESSION:  org.apache.hadoop.mapred.lib.TestMultipleOutputs.testWithCounters

Error Message:
chmod: cannot access `/tmp/hadoop-hudson/mapred/staging/hudson-39173504/.staging/job_local_0002': No such file or directory 

Stack Trace:
org.apache.hadoop.util.Shell$ExitCodeException: chmod: cannot access `/tmp/hadoop-hudson/mapred/staging/hudson-39173504/.staging/job_local_0002': No such file or directory

	at org.apache.hadoop.util.Shell.runCommand(Shell.java:261)
	at org.apache.hadoop.util.Shell.run(Shell.java:188)
	at org.apache.hadoop.util.Shell$ShellCommandExecutor.execute(Shell.java:381)
	at org.apache.hadoop.util.Shell.execCommand(Shell.java:467)
	at org.apache.hadoop.util.Shell.execCommand(Shell.java:450)
	at org.apache.hadoop.fs.RawLocalFileSystem.execCommand(RawLocalFileSystem.java:549)
	at org.apache.hadoop.fs.RawLocalFileSystem.setPermission(RawLocalFileSystem.java:540)
	at org.apache.hadoop.fs.FilterFileSystem.setPermission(FilterFileSystem.java:353)
	at org.apache.hadoop.fs.FileSystem.mkdirs(FileSystem.java:428)
	at org.apache.hadoop.mapreduce.JobSubmitter.copyAndConfigureFiles(JobSubmitter.java:166)
	at org.apache.hadoop.mapreduce.JobSubmitter.copyAndConfigureFiles(JobSubmitter.java:283)
	at org.apache.hadoop.mapreduce.JobSubmitter.submitJobInternal(JobSubmitter.java:350)
	at org.apache.hadoop.mapreduce.Job$2.run(Job.java:1037)
	at org.apache.hadoop.mapreduce.Job$2.run(Job.java:1034)
	at java.security.AccessController.doPrivileged(Native Method)
	at javax.security.auth.Subject.doAs(Subject.java:396)
	at org.apache.hadoop.security.UserGroupInformation.doAs(UserGroupInformation.java:1142)
	at org.apache.hadoop.mapreduce.Job.submit(Job.java:1034)
	at org.apache.hadoop.mapred.JobClient.submitJob(JobClient.java:536)
	at org.apache.hadoop.mapred.lib.TestMultipleOutputs._testMultipleOutputs(TestMultipleOutputs.java:215)
	at org.apache.hadoop.mapred.lib.TestMultipleOutputs.__CLR3_0_2435lo6h6h(TestMultipleOutputs.java:47)
	at org.apache.hadoop.mapred.lib.TestMultipleOutputs.testWithCounters(TestMultipleOutputs.java:46)


REGRESSION:  org.apache.hadoop.mapred.lib.TestMultithreadedMapRunner.testOKRun

Error Message:
chmod: cannot access `/tmp/hadoop-hudson/mapred/staging/hudson-503547040/.staging/job_local_0001': No such file or directory 

Stack Trace:
org.apache.hadoop.util.Shell$ExitCodeException: chmod: cannot access `/tmp/hadoop-hudson/mapred/staging/hudson-503547040/.staging/job_local_0001': No such file or directory

	at org.apache.hadoop.util.Shell.runCommand(Shell.java:261)
	at org.apache.hadoop.util.Shell.run(Shell.java:188)
	at org.apache.hadoop.util.Shell$ShellCommandExecutor.execute(Shell.java:381)
	at org.apache.hadoop.util.Shell.execCommand(Shell.java:467)
	at org.apache.hadoop.util.Shell.execCommand(Shell.java:450)
	at org.apache.hadoop.fs.RawLocalFileSystem.execCommand(RawLocalFileSystem.java:549)
	at org.apache.hadoop.fs.RawLocalFileSystem.setPermission(RawLocalFileSystem.java:540)
	at org.apache.hadoop.fs.FilterFileSystem.setPermission(FilterFileSystem.java:353)
	at org.apache.hadoop.fs.FileSystem.mkdirs(FileSystem.java:428)
	at org.apache.hadoop.mapreduce.JobSubmitter.copyAndConfigureFiles(JobSubmitter.java:166)
	at org.apache.hadoop.mapreduce.JobSubmitter.copyAndConfigureFiles(JobSubmitter.java:283)
	at org.apache.hadoop.mapreduce.JobSubmitter.submitJobInternal(JobSubmitter.java:350)
	at org.apache.hadoop.mapreduce.Job$2.run(Job.java:1037)
	at org.apache.hadoop.mapreduce.Job$2.run(Job.java:1034)
	at java.security.AccessController.doPrivileged(Native Method)
	at javax.security.auth.Subject.doAs(Subject.java:396)
	at org.apache.hadoop.security.UserGroupInformation.doAs(UserGroupInformation.java:1142)
	at org.apache.hadoop.mapreduce.Job.submit(Job.java:1034)
	at org.apache.hadoop.mapred.JobClient.submitJob(JobClient.java:536)
	at org.apache.hadoop.mapred.lib.TestMultithreadedMapRunner.run(TestMultithreadedMapRunner.java:105)
	at org.apache.hadoop.mapred.lib.TestMultithreadedMapRunner.__CLR3_0_2dhspyc98r(TestMultithreadedMapRunner.java:39)
	at org.apache.hadoop.mapred.lib.TestMultithreadedMapRunner.testOKRun(TestMultithreadedMapRunner.java:38)


REGRESSION:  org.apache.hadoop.mapred.lib.TestMultithreadedMapRunner.testIOExRun

Error Message:
chmod: cannot access `/tmp/hadoop-hudson/mapred/staging/hudson-509145657/.staging/job_local_0002': No such file or directory 

Stack Trace:
org.apache.hadoop.util.Shell$ExitCodeException: chmod: cannot access `/tmp/hadoop-hudson/mapred/staging/hudson-509145657/.staging/job_local_0002': No such file or directory

	at org.apache.hadoop.util.Shell.runCommand(Shell.java:261)
	at org.apache.hadoop.util.Shell.run(Shell.java:188)
	at org.apache.hadoop.util.Shell$ShellCommandExecutor.execute(Shell.java:381)
	at org.apache.hadoop.util.Shell.execCommand(Shell.java:467)
	at org.apache.hadoop.util.Shell.execCommand(Shell.java:450)
	at org.apache.hadoop.fs.RawLocalFileSystem.execCommand(RawLocalFileSystem.java:549)
	at org.apache.hadoop.fs.RawLocalFileSystem.setPermission(RawLocalFileSystem.java:540)
	at org.apache.hadoop.fs.FilterFileSystem.setPermission(FilterFileSystem.java:353)
	at org.apache.hadoop.fs.FileSystem.mkdirs(FileSystem.java:428)
	at org.apache.hadoop.mapreduce.JobSubmitter.copyAndConfigureFiles(JobSubmitter.java:166)
	at org.apache.hadoop.mapreduce.JobSubmitter.copyAndConfigureFiles(JobSubmitter.java:283)
	at org.apache.hadoop.mapreduce.JobSubmitter.submitJobInternal(JobSubmitter.java:350)
	at org.apache.hadoop.mapreduce.Job$2.run(Job.java:1037)
	at org.apache.hadoop.mapreduce.Job$2.run(Job.java:1034)
	at java.security.AccessController.doPrivileged(Native Method)
	at javax.security.auth.Subject.doAs(Subject.java:396)
	at org.apache.hadoop.security.UserGroupInformation.doAs(UserGroupInformation.java:1142)
	at org.apache.hadoop.mapreduce.Job.submit(Job.java:1034)
	at org.apache.hadoop.mapred.JobClient.submitJob(JobClient.java:536)
	at org.apache.hadoop.mapred.lib.TestMultithreadedMapRunner.run(TestMultithreadedMapRunner.java:105)
	at org.apache.hadoop.mapred.lib.TestMultithreadedMapRunner.__CLR3_0_21nnwsn98t(TestMultithreadedMapRunner.java:43)
	at org.apache.hadoop.mapred.lib.TestMultithreadedMapRunner.testIOExRun(TestMultithreadedMapRunner.java:42)


REGRESSION:  org.apache.hadoop.mapred.lib.TestMultithreadedMapRunner.testRuntimeExRun

Error Message:
chmod: cannot access `/tmp/hadoop-hudson/mapred/staging/hudson-1203512304/.staging/job_local_0003': No such file or directory 

Stack Trace:
org.apache.hadoop.util.Shell$ExitCodeException: chmod: cannot access `/tmp/hadoop-hudson/mapred/staging/hudson-1203512304/.staging/job_local_0003': No such file or directory

	at org.apache.hadoop.util.Shell.runCommand(Shell.java:261)
	at org.apache.hadoop.util.Shell.run(Shell.java:188)
	at org.apache.hadoop.util.Shell$ShellCommandExecutor.execute(Shell.java:381)
	at org.apache.hadoop.util.Shell.execCommand(Shell.java:467)
	at org.apache.hadoop.util.Shell.execCommand(Shell.java:450)
	at org.apache.hadoop.fs.RawLocalFileSystem.execCommand(RawLocalFileSystem.java:549)
	at org.apache.hadoop.fs.RawLocalFileSystem.setPermission(RawLocalFileSystem.java:540)
	at org.apache.hadoop.fs.FilterFileSystem.setPermission(FilterFileSystem.java:353)
	at org.apache.hadoop.fs.FileSystem.mkdirs(FileSystem.java:428)
	at org.apache.hadoop.mapreduce.JobSubmitter.copyAndConfigureFiles(JobSubmitter.java:166)
	at org.apache.hadoop.mapreduce.JobSubmitter.copyAndConfigureFiles(JobSubmitter.java:283)
	at org.apache.hadoop.mapreduce.JobSubmitter.submitJobInternal(JobSubmitter.java:350)
	at org.apache.hadoop.mapreduce.Job$2.run(Job.java:1037)
	at org.apache.hadoop.mapreduce.Job$2.run(Job.java:1034)
	at java.security.AccessController.doPrivileged(Native Method)
	at javax.security.auth.Subject.doAs(Subject.java:396)
	at org.apache.hadoop.security.UserGroupInformation.doAs(UserGroupInformation.java:1142)
	at org.apache.hadoop.mapreduce.Job.submit(Job.java:1034)
	at org.apache.hadoop.mapred.JobClient.submitJob(JobClient.java:536)
	at org.apache.hadoop.mapred.lib.TestMultithreadedMapRunner.run(TestMultithreadedMapRunner.java:105)
	at org.apache.hadoop.mapred.lib.TestMultithreadedMapRunner.__CLR3_0_2zf5zzb98v(TestMultithreadedMapRunner.java:46)
	at org.apache.hadoop.mapred.lib.TestMultithreadedMapRunner.testRuntimeExRun(TestMultithreadedMapRunner.java:45)


REGRESSION:  org.apache.hadoop.mapred.lib.aggregate.TestAggregates.testAggregates

Error Message:
chmod: cannot access `/tmp/hadoop-hudson/mapred/staging/hudson1309849431/.staging/job_local_0001': No such file or directory 

Stack Trace:
org.apache.hadoop.util.Shell$ExitCodeException: chmod: cannot access `/tmp/hadoop-hudson/mapred/staging/hudson1309849431/.staging/job_local_0001': No such file or directory

	at org.apache.hadoop.util.Shell.runCommand(Shell.java:261)
	at org.apache.hadoop.util.Shell.run(Shell.java:188)
	at org.apache.hadoop.util.Shell$ShellCommandExecutor.execute(Shell.java:381)
	at org.apache.hadoop.util.Shell.execCommand(Shell.java:467)
	at org.apache.hadoop.util.Shell.execCommand(Shell.java:450)
	at org.apache.hadoop.fs.RawLocalFileSystem.execCommand(RawLocalFileSystem.java:549)
	at org.apache.hadoop.fs.RawLocalFileSystem.setPermission(RawLocalFileSystem.java:540)
	at org.apache.hadoop.fs.FilterFileSystem.setPermission(FilterFileSystem.java:353)
	at org.apache.hadoop.fs.FileSystem.mkdirs(FileSystem.java:428)
	at org.apache.hadoop.mapreduce.JobSubmitter.copyAndConfigureFiles(JobSubmitter.java:166)
	at org.apache.hadoop.mapreduce.JobSubmitter.copyAndConfigureFiles(JobSubmitter.java:283)
	at org.apache.hadoop.mapreduce.JobSubmitter.submitJobInternal(JobSubmitter.java:350)
	at org.apache.hadoop.mapreduce.Job$2.run(Job.java:1037)
	at org.apache.hadoop.mapreduce.Job$2.run(Job.java:1034)
	at java.security.AccessController.doPrivileged(Native Method)
	at javax.security.auth.Subject.doAs(Subject.java:396)
	at org.apache.hadoop.security.UserGroupInformation.doAs(UserGroupInformation.java:1142)
	at org.apache.hadoop.mapreduce.Job.submit(Job.java:1034)
	at org.apache.hadoop.mapred.JobClient.submitJob(JobClient.java:536)
	at org.apache.hadoop.mapred.JobClient.runJob(JobClient.java:781)
	at org.apache.hadoop.mapred.lib.aggregate.TestAggregates.launch(TestAggregates.java:103)
	at org.apache.hadoop.mapred.lib.aggregate.TestAggregates.__CLR3_0_21uoc3jpb(TestAggregates.java:41)
	at org.apache.hadoop.mapred.lib.aggregate.TestAggregates.testAggregates(TestAggregates.java:40)


REGRESSION:  org.apache.hadoop.mapreduce.TestLocalRunner.testGcCounter

Error Message:
chmod: cannot access `/tmp/hadoop-hudson/mapred/staging/hudson2098793626/.staging/job_local_0001': No such file or directory 

Stack Trace:
org.apache.hadoop.util.Shell$ExitCodeException: chmod: cannot access `/tmp/hadoop-hudson/mapred/staging/hudson2098793626/.staging/job_local_0001': No such file or directory

	at org.apache.hadoop.util.Shell.runCommand(Shell.java:261)
	at org.apache.hadoop.util.Shell.run(Shell.java:188)
	at org.apache.hadoop.util.Shell$ShellCommandExecutor.execute(Shell.java:381)
	at org.apache.hadoop.util.Shell.execCommand(Shell.java:467)
	at org.apache.hadoop.util.Shell.execCommand(Shell.java:450)
	at org.apache.hadoop.fs.RawLocalFileSystem.execCommand(RawLocalFileSystem.java:549)
	at org.apache.hadoop.fs.RawLocalFileSystem.setPermission(RawLocalFileSystem.java:540)
	at org.apache.hadoop.fs.FilterFileSystem.setPermission(FilterFileSystem.java:353)
	at org.apache.hadoop.fs.FileSystem.mkdirs(FileSystem.java:428)
	at org.apache.hadoop.mapreduce.JobSubmitter.copyAndConfigureFiles(JobSubmitter.java:166)
	at org.apache.hadoop.mapreduce.JobSubmitter.copyAndConfigureFiles(JobSubmitter.java:283)
	at org.apache.hadoop.mapreduce.JobSubmitter.submitJobInternal(JobSubmitter.java:350)
	at org.apache.hadoop.mapreduce.Job$2.run(Job.java:1037)
	at org.apache.hadoop.mapreduce.Job$2.run(Job.java:1034)
	at java.security.AccessController.doPrivileged(Native Method)
	at javax.security.auth.Subject.doAs(Subject.java:396)
	at org.apache.hadoop.security.UserGroupInformation.doAs(UserGroupInformation.java:1142)
	at org.apache.hadoop.mapreduce.Job.submit(Job.java:1034)
	at org.apache.hadoop.mapreduce.Job.waitForCompletion(Job.java:1054)
	at org.apache.hadoop.mapreduce.TestLocalRunner.__CLR3_0_2tnowa3qa8(TestLocalRunner.java:271)
	at org.apache.hadoop.mapreduce.TestLocalRunner.testGcCounter(TestLocalRunner.java:244)


REGRESSION:  org.apache.hadoop.mapreduce.TestLocalRunner.testMultiMaps

Error Message:
chmod: cannot access `/tmp/hadoop-hudson/mapred/staging/hudson-353991845/.staging/job_local_0002': No such file or directory 

Stack Trace:
org.apache.hadoop.util.Shell$ExitCodeException: chmod: cannot access `/tmp/hadoop-hudson/mapred/staging/hudson-353991845/.staging/job_local_0002': No such file or directory

	at org.apache.hadoop.util.Shell.runCommand(Shell.java:261)
	at org.apache.hadoop.util.Shell.run(Shell.java:188)
	at org.apache.hadoop.util.Shell$ShellCommandExecutor.execute(Shell.java:381)
	at org.apache.hadoop.util.Shell.execCommand(Shell.java:467)
	at org.apache.hadoop.util.Shell.execCommand(Shell.java:450)
	at org.apache.hadoop.fs.RawLocalFileSystem.execCommand(RawLocalFileSystem.java:549)
	at org.apache.hadoop.fs.RawLocalFileSystem.setPermission(RawLocalFileSystem.java:540)
	at org.apache.hadoop.fs.FilterFileSystem.setPermission(FilterFileSystem.java:353)
	at org.apache.hadoop.fs.FileSystem.mkdirs(FileSystem.java:428)
	at org.apache.hadoop.mapreduce.JobSubmitter.copyAndConfigureFiles(JobSubmitter.java:166)
	at org.apache.hadoop.mapreduce.JobSubmitter.copyAndConfigureFiles(JobSubmitter.java:283)
	at org.apache.hadoop.mapreduce.JobSubmitter.submitJobInternal(JobSubmitter.java:350)
	at org.apache.hadoop.mapreduce.Job$2.run(Job.java:1037)
	at org.apache.hadoop.mapreduce.Job$2.run(Job.java:1034)
	at java.security.AccessController.doPrivileged(Native Method)
	at javax.security.auth.Subject.doAs(Subject.java:396)
	at org.apache.hadoop.security.UserGroupInformation.doAs(UserGroupInformation.java:1142)
	at org.apache.hadoop.mapreduce.Job.submit(Job.java:1034)
	at org.apache.hadoop.mapreduce.TestLocalRunner.__CLR3_0_21tclffqax(TestLocalRunner.java:321)
	at org.apache.hadoop.mapreduce.TestLocalRunner.testMultiMaps(TestLocalRunner.java:289)


REGRESSION:  org.apache.hadoop.mapreduce.TestLocalRunner.testInvalidMultiMapParallelism

Error Message:
chmod: cannot access `/tmp/hadoop-hudson/mapred/staging/hudson-1552466682/.staging/job_local_0003': No such file or directory 

Stack Trace:
org.apache.hadoop.util.Shell$ExitCodeException: chmod: cannot access `/tmp/hadoop-hudson/mapred/staging/hudson-1552466682/.staging/job_local_0003': No such file or directory

	at org.apache.hadoop.util.Shell.runCommand(Shell.java:261)
	at org.apache.hadoop.util.Shell.run(Shell.java:188)
	at org.apache.hadoop.util.Shell$ShellCommandExecutor.execute(Shell.java:381)
	at org.apache.hadoop.util.Shell.execCommand(Shell.java:467)
	at org.apache.hadoop.util.Shell.execCommand(Shell.java:450)
	at org.apache.hadoop.fs.RawLocalFileSystem.execCommand(RawLocalFileSystem.java:549)
	at org.apache.hadoop.fs.RawLocalFileSystem.setPermission(RawLocalFileSystem.java:540)
	at org.apache.hadoop.fs.FilterFileSystem.setPermission(FilterFileSystem.java:353)
	at org.apache.hadoop.fs.FileSystem.mkdirs(FileSystem.java:428)
	at org.apache.hadoop.mapreduce.JobSubmitter.copyAndConfigureFiles(JobSubmitter.java:166)
	at org.apache.hadoop.mapreduce.JobSubmitter.copyAndConfigureFiles(JobSubmitter.java:283)
	at org.apache.hadoop.mapreduce.JobSubmitter.submitJobInternal(JobSubmitter.java:350)
	at org.apache.hadoop.mapreduce.Job$2.run(Job.java:1037)
	at org.apache.hadoop.mapreduce.Job$2.run(Job.java:1034)
	at java.security.AccessController.doPrivileged(Native Method)
	at javax.security.auth.Subject.doAs(Subject.java:396)
	at org.apache.hadoop.security.UserGroupInformation.doAs(UserGroupInformation.java:1142)
	at org.apache.hadoop.mapreduce.Job.submit(Job.java:1034)
	at org.apache.hadoop.mapreduce.Job.waitForCompletion(Job.java:1054)
	at org.apache.hadoop.mapreduce.TestLocalRunner.__CLR3_0_22jq81nqc6(TestLocalRunner.java:373)
	at org.apache.hadoop.mapreduce.TestLocalRunner.testInvalidMultiMapParallelism(TestLocalRunner.java:353)


REGRESSION:  org.apache.hadoop.mapreduce.TestLocalRunner.testEmptyMaps

Error Message:
chmod: cannot access `/tmp/hadoop-hudson/mapred/staging/hudson57975306/.staging/job_local_0004': No such file or directory 

Stack Trace:
org.apache.hadoop.util.Shell$ExitCodeException: chmod: cannot access `/tmp/hadoop-hudson/mapred/staging/hudson57975306/.staging/job_local_0004': No such file or directory

	at org.apache.hadoop.util.Shell.runCommand(Shell.java:261)
	at org.apache.hadoop.util.Shell.run(Shell.java:188)
	at org.apache.hadoop.util.Shell$ShellCommandExecutor.execute(Shell.java:381)
	at org.apache.hadoop.util.Shell.execCommand(Shell.java:467)
	at org.apache.hadoop.util.Shell.execCommand(Shell.java:450)
	at org.apache.hadoop.fs.RawLocalFileSystem.execCommand(RawLocalFileSystem.java:549)
	at org.apache.hadoop.fs.RawLocalFileSystem.setPermission(RawLocalFileSystem.java:540)
	at org.apache.hadoop.fs.FilterFileSystem.setPermission(FilterFileSystem.java:353)
	at org.apache.hadoop.fs.FileSystem.mkdirs(FileSystem.java:428)
	at org.apache.hadoop.mapreduce.JobSubmitter.copyAndConfigureFiles(JobSubmitter.java:166)
	at org.apache.hadoop.mapreduce.JobSubmitter.copyAndConfigureFiles(JobSubmitter.java:283)
	at org.apache.hadoop.mapreduce.JobSubmitter.submitJobInternal(JobSubmitter.java:350)
	at org.apache.hadoop.mapreduce.Job$2.run(Job.java:1037)
	at org.apache.hadoop.mapreduce.Job$2.run(Job.java:1034)
	at java.security.AccessController.doPrivileged(Native Method)
	at javax.security.auth.Subject.doAs(Subject.java:396)
	at org.apache.hadoop.security.UserGroupInformation.doAs(UserGroupInformation.java:1142)
	at org.apache.hadoop.mapreduce.Job.submit(Job.java:1034)
	at org.apache.hadoop.mapreduce.Job.waitForCompletion(Job.java:1054)
	at org.apache.hadoop.mapreduce.TestLocalRunner.__CLR3_0_285g4nqd2(TestLocalRunner.java:429)
	at org.apache.hadoop.mapreduce.TestLocalRunner.testEmptyMaps(TestLocalRunner.java:414)


REGRESSION:  org.apache.hadoop.mapreduce.TestMapCollection.testValLastByte

Error Message:
chmod: cannot access `/tmp/hadoop-hudson/mapred/staging/hudson830921020/.staging/job_local_0001': No such file or directory 

Stack Trace:
org.apache.hadoop.util.Shell$ExitCodeException: chmod: cannot access `/tmp/hadoop-hudson/mapred/staging/hudson830921020/.staging/job_local_0001': No such file or directory

	at org.apache.hadoop.util.Shell.runCommand(Shell.java:261)
	at org.apache.hadoop.util.Shell.run(Shell.java:188)
	at org.apache.hadoop.util.Shell$ShellCommandExecutor.execute(Shell.java:381)
	at org.apache.hadoop.util.Shell.execCommand(Shell.java:467)
	at org.apache.hadoop.util.Shell.execCommand(Shell.java:450)
	at org.apache.hadoop.fs.RawLocalFileSystem.execCommand(RawLocalFileSystem.java:549)
	at org.apache.hadoop.fs.RawLocalFileSystem.setPermission(RawLocalFileSystem.java:540)
	at org.apache.hadoop.fs.FilterFileSystem.setPermission(FilterFileSystem.java:353)
	at org.apache.hadoop.fs.FileSystem.mkdirs(FileSystem.java:428)
	at org.apache.hadoop.mapreduce.JobSubmitter.copyAndConfigureFiles(JobSubmitter.java:166)
	at org.apache.hadoop.mapreduce.JobSubmitter.copyAndConfigureFiles(JobSubmitter.java:283)
	at org.apache.hadoop.mapreduce.JobSubmitter.submitJobInternal(JobSubmitter.java:350)
	at org.apache.hadoop.mapreduce.Job$2.run(Job.java:1037)
	at org.apache.hadoop.mapreduce.Job$2.run(Job.java:1034)
	at java.security.AccessController.doPrivileged(Native Method)
	at javax.security.auth.Subject.doAs(Subject.java:396)
	at org.apache.hadoop.security.UserGroupInformation.doAs(UserGroupInformation.java:1142)
	at org.apache.hadoop.mapreduce.Job.submit(Job.java:1034)
	at org.apache.hadoop.mapreduce.Job.waitForCompletion(Job.java:1054)
	at org.apache.hadoop.mapreduce.TestMapCollection.runTest(TestMapCollection.java:326)
	at org.apache.hadoop.mapreduce.TestMapCollection.runTest(TestMapCollection.java:309)
	at org.apache.hadoop.mapreduce.TestMapCollection.__CLR3_0_2cypxscnri(TestMapCollection.java:332)
	at org.apache.hadoop.mapreduce.TestMapCollection.testValLastByte(TestMapCollection.java:330)


REGRESSION:  org.apache.hadoop.mapreduce.TestMapCollection.testLargeRecords

Error Message:
chmod: cannot access `/tmp/hadoop-hudson/mapred/staging/hudson2131216688/.staging/job_local_0002': No such file or directory 

Stack Trace:
org.apache.hadoop.util.Shell$ExitCodeException: chmod: cannot access `/tmp/hadoop-hudson/mapred/staging/hudson2131216688/.staging/job_local_0002': No such file or directory

	at org.apache.hadoop.util.Shell.runCommand(Shell.java:261)
	at org.apache.hadoop.util.Shell.run(Shell.java:188)
	at org.apache.hadoop.util.Shell$ShellCommandExecutor.execute(Shell.java:381)
	at org.apache.hadoop.util.Shell.execCommand(Shell.java:467)
	at org.apache.hadoop.util.Shell.execCommand(Shell.java:450)
	at org.apache.hadoop.fs.RawLocalFileSystem.execCommand(RawLocalFileSystem.java:549)
	at org.apache.hadoop.fs.RawLocalFileSystem.setPermission(RawLocalFileSystem.java:540)
	at org.apache.hadoop.fs.FilterFileSystem.setPermission(FilterFileSystem.java:353)
	at org.apache.hadoop.fs.FileSystem.mkdirs(FileSystem.java:428)
	at org.apache.hadoop.mapreduce.JobSubmitter.copyAndConfigureFiles(JobSubmitter.java:166)
	at org.apache.hadoop.mapreduce.JobSubmitter.copyAndConfigureFiles(JobSubmitter.java:283)
	at org.apache.hadoop.mapreduce.JobSubmitter.submitJobInternal(JobSubmitter.java:350)
	at org.apache.hadoop.mapreduce.Job$2.run(Job.java:1037)
	at org.apache.hadoop.mapreduce.Job$2.run(Job.java:1034)
	at java.security.AccessController.doPrivileged(Native Method)
	at javax.security.auth.Subject.doAs(Subject.java:396)
	at org.apache.hadoop.security.UserGroupInformation.doAs(UserGroupInformation.java:1142)
	at org.apache.hadoop.mapreduce.Job.submit(Job.java:1034)
	at org.apache.hadoop.mapreduce.Job.waitForCompletion(Job.java:1054)
	at org.apache.hadoop.mapreduce.TestMapCollection.runTest(TestMapCollection.java:326)
	at org.apache.hadoop.mapreduce.TestMapCollection.runTest(TestMapCollection.java:309)
	at org.apache.hadoop.mapreduce.TestMapCollection.__CLR3_0_2fe8528nrl(TestMapCollection.java:339)
	at org.apache.hadoop.mapreduce.TestMapCollection.testLargeRecords(TestMapCollection.java:337)


REGRESSION:  org.apache.hadoop.mapreduce.TestMapCollection.testSpillPer2B

Error Message:
chmod: cannot access `/tmp/hadoop-hudson/mapred/staging/hudson1785097351/.staging/job_local_0003': No such file or directory 

Stack Trace:
org.apache.hadoop.util.Shell$ExitCodeException: chmod: cannot access `/tmp/hadoop-hudson/mapred/staging/hudson1785097351/.staging/job_local_0003': No such file or directory

	at org.apache.hadoop.util.Shell.runCommand(Shell.java:261)
	at org.apache.hadoop.util.Shell.run(Shell.java:188)
	at org.apache.hadoop.util.Shell$ShellCommandExecutor.execute(Shell.java:381)
	at org.apache.hadoop.util.Shell.execCommand(Shell.java:467)
	at org.apache.hadoop.util.Shell.execCommand(Shell.java:450)
	at org.apache.hadoop.fs.RawLocalFileSystem.execCommand(RawLocalFileSystem.java:549)
	at org.apache.hadoop.fs.RawLocalFileSystem.setPermission(RawLocalFileSystem.java:540)
	at org.apache.hadoop.fs.FilterFileSystem.setPermission(FilterFileSystem.java:353)
	at org.apache.hadoop.fs.FileSystem.mkdirs(FileSystem.java:428)
	at org.apache.hadoop.mapreduce.JobSubmitter.copyAndConfigureFiles(JobSubmitter.java:166)
	at org.apache.hadoop.mapreduce.JobSubmitter.copyAndConfigureFiles(JobSubmitter.java:283)
	at org.apache.hadoop.mapreduce.JobSubmitter.submitJobInternal(JobSubmitter.java:350)
	at org.apache.hadoop.mapreduce.Job$2.run(Job.java:1037)
	at org.apache.hadoop.mapreduce.Job$2.run(Job.java:1034)
	at java.security.AccessController.doPrivileged(Native Method)
	at javax.security.auth.Subject.doAs(Subject.java:396)
	at org.apache.hadoop.security.UserGroupInformation.doAs(UserGroupInformation.java:1142)
	at org.apache.hadoop.mapreduce.Job.submit(Job.java:1034)
	at org.apache.hadoop.mapreduce.Job.waitForCompletion(Job.java:1054)
	at org.apache.hadoop.mapreduce.TestMapCollection.runTest(TestMapCollection.java:326)
	at org.apache.hadoop.mapreduce.TestMapCollection.runTest(TestMapCollection.java:309)
	at org.apache.hadoop.mapreduce.TestMapCollection.__CLR3_0_28yt0g6nro(TestMapCollection.java:346)
	at org.apache.hadoop.mapreduce.TestMapCollection.testSpillPer2B(TestMapCollection.java:344)


REGRESSION:  org.apache.hadoop.mapreduce.TestMapCollection.testZeroVal

Error Message:
chmod: cannot access `/tmp/hadoop-hudson/mapred/staging/hudson1016716424/.staging/job_local_0004': No such file or directory 

Stack Trace:
org.apache.hadoop.util.Shell$ExitCodeException: chmod: cannot access `/tmp/hadoop-hudson/mapred/staging/hudson1016716424/.staging/job_local_0004': No such file or directory

	at org.apache.hadoop.util.Shell.runCommand(Shell.java:261)
	at org.apache.hadoop.util.Shell.run(Shell.java:188)
	at org.apache.hadoop.util.Shell$ShellCommandExecutor.execute(Shell.java:381)
	at org.apache.hadoop.util.Shell.execCommand(Shell.java:467)
	at org.apache.hadoop.util.Shell.execCommand(Shell.java:450)
	at org.apache.hadoop.fs.RawLocalFileSystem.execCommand(RawLocalFileSystem.java:549)
	at org.apache.hadoop.fs.RawLocalFileSystem.setPermission(RawLocalFileSystem.java:540)
	at org.apache.hadoop.fs.FilterFileSystem.setPermission(FilterFileSystem.java:353)
	at org.apache.hadoop.fs.FileSystem.mkdirs(FileSystem.java:428)
	at org.apache.hadoop.mapreduce.JobSubmitter.copyAndConfigureFiles(JobSubmitter.java:166)
	at org.apache.hadoop.mapreduce.JobSubmitter.copyAndConfigureFiles(JobSubmitter.java:283)
	at org.apache.hadoop.mapreduce.JobSubmitter.submitJobInternal(JobSubmitter.java:350)
	at org.apache.hadoop.mapreduce.Job$2.run(Job.java:1037)
	at org.apache.hadoop.mapreduce.Job$2.run(Job.java:1034)
	at java.security.AccessController.doPrivileged(Native Method)
	at javax.security.auth.Subject.doAs(Subject.java:396)
	at org.apache.hadoop.security.UserGroupInformation.doAs(UserGroupInformation.java:1142)
	at org.apache.hadoop.mapreduce.Job.submit(Job.java:1034)
	at org.apache.hadoop.mapreduce.Job.waitForCompletion(Job.java:1054)
	at org.apache.hadoop.mapreduce.TestMapCollection.runTest(TestMapCollection.java:326)
	at org.apache.hadoop.mapreduce.TestMapCollection.runTest(TestMapCollection.java:309)
	at org.apache.hadoop.mapreduce.TestMapCollection.__CLR3_0_2u5xn7ynrt(TestMapCollection.java:355)
	at org.apache.hadoop.mapreduce.TestMapCollection.testZeroVal(TestMapCollection.java:353)


REGRESSION:  org.apache.hadoop.mapreduce.TestMapCollection.testSingleRecord

Error Message:
chmod: cannot access `/tmp/hadoop-hudson/mapred/staging/hudson-126024724/.staging/job_local_0005': No such file or directory 

Stack Trace:
org.apache.hadoop.util.Shell$ExitCodeException: chmod: cannot access `/tmp/hadoop-hudson/mapred/staging/hudson-126024724/.staging/job_local_0005': No such file or directory

	at org.apache.hadoop.util.Shell.runCommand(Shell.java:261)
	at org.apache.hadoop.util.Shell.run(Shell.java:188)
	at org.apache.hadoop.util.Shell$ShellCommandExecutor.execute(Shell.java:381)
	at org.apache.hadoop.util.Shell.execCommand(Shell.java:467)
	at org.apache.hadoop.util.Shell.execCommand(Shell.java:450)
	at org.apache.hadoop.fs.RawLocalFileSystem.execCommand(RawLocalFileSystem.java:549)
	at org.apache.hadoop.fs.RawLocalFileSystem.setPermission(RawLocalFileSystem.java:540)
	at org.apache.hadoop.fs.FilterFileSystem.setPermission(FilterFileSystem.java:353)
	at org.apache.hadoop.fs.FileSystem.mkdirs(FileSystem.java:428)
	at org.apache.hadoop.mapreduce.JobSubmitter.copyAndConfigureFiles(JobSubmitter.java:166)
	at org.apache.hadoop.mapreduce.JobSubmitter.copyAndConfigureFiles(JobSubmitter.java:283)
	at org.apache.hadoop.mapreduce.JobSubmitter.submitJobInternal(JobSubmitter.java:350)
	at org.apache.hadoop.mapreduce.Job$2.run(Job.java:1037)
	at org.apache.hadoop.mapreduce.Job$2.run(Job.java:1034)
	at java.security.AccessController.doPrivileged(Native Method)
	at javax.security.auth.Subject.doAs(Subject.java:396)
	at org.apache.hadoop.security.UserGroupInformation.doAs(UserGroupInformation.java:1142)
	at org.apache.hadoop.mapreduce.Job.submit(Job.java:1034)
	at org.apache.hadoop.mapreduce.Job.waitForCompletion(Job.java:1054)
	at org.apache.hadoop.mapreduce.TestMapCollection.runTest(TestMapCollection.java:326)
	at org.apache.hadoop.mapreduce.TestMapCollection.runTest(TestMapCollection.java:309)
	at org.apache.hadoop.mapreduce.TestMapCollection.__CLR3_0_2db2s32nry(TestMapCollection.java:363)
	at org.apache.hadoop.mapreduce.TestMapCollection.testSingleRecord(TestMapCollection.java:362)


REGRESSION:  org.apache.hadoop.mapreduce.TestMapCollection.testLowSpill

Error Message:
chmod: cannot access `/tmp/hadoop-hudson/mapred/staging/hudson-1800074658/.staging/job_local_0006': No such file or directory 

Stack Trace:
org.apache.hadoop.util.Shell$ExitCodeException: chmod: cannot access `/tmp/hadoop-hudson/mapred/staging/hudson-1800074658/.staging/job_local_0006': No such file or directory

	at org.apache.hadoop.util.Shell.runCommand(Shell.java:261)
	at org.apache.hadoop.util.Shell.run(Shell.java:188)
	at org.apache.hadoop.util.Shell$ShellCommandExecutor.execute(Shell.java:381)
	at org.apache.hadoop.util.Shell.execCommand(Shell.java:467)
	at org.apache.hadoop.util.Shell.execCommand(Shell.java:450)
	at org.apache.hadoop.fs.RawLocalFileSystem.execCommand(RawLocalFileSystem.java:549)
	at org.apache.hadoop.fs.RawLocalFileSystem.setPermission(RawLocalFileSystem.java:540)
	at org.apache.hadoop.fs.FilterFileSystem.setPermission(FilterFileSystem.java:353)
	at org.apache.hadoop.fs.FileSystem.mkdirs(FileSystem.java:428)
	at org.apache.hadoop.mapreduce.JobSubmitter.copyAndConfigureFiles(JobSubmitter.java:166)
	at org.apache.hadoop.mapreduce.JobSubmitter.copyAndConfigureFiles(JobSubmitter.java:283)
	at org.apache.hadoop.mapreduce.JobSubmitter.submitJobInternal(JobSubmitter.java:350)
	at org.apache.hadoop.mapreduce.Job$2.run(Job.java:1037)
	at org.apache.hadoop.mapreduce.Job$2.run(Job.java:1034)
	at java.security.AccessController.doPrivileged(Native Method)
	at javax.security.auth.Subject.doAs(Subject.java:396)
	at org.apache.hadoop.security.UserGroupInformation.doAs(UserGroupInformation.java:1142)
	at org.apache.hadoop.mapreduce.Job.submit(Job.java:1034)
	at org.apache.hadoop.mapreduce.Job.waitForCompletion(Job.java:1054)
	at org.apache.hadoop.mapreduce.TestMapCollection.runTest(TestMapCollection.java:326)
	at org.apache.hadoop.mapreduce.TestMapCollection.runTest(TestMapCollection.java:309)
	at org.apache.hadoop.mapreduce.TestMapCollection.__CLR3_0_2z3qgi7ns1(TestMapCollection.java:369)
	at org.apache.hadoop.mapreduce.TestMapCollection.testLowSpill(TestMapCollection.java:368)


REGRESSION:  org.apache.hadoop.mapreduce.TestMapCollection.testSplitMetaSpill

Error Message:
chmod: cannot access `/tmp/hadoop-hudson/mapred/staging/hudson1047333400/.staging/job_local_0007': No such file or directory 

Stack Trace:
org.apache.hadoop.util.Shell$ExitCodeException: chmod: cannot access `/tmp/hadoop-hudson/mapred/staging/hudson1047333400/.staging/job_local_0007': No such file or directory

	at org.apache.hadoop.util.Shell.runCommand(Shell.java:261)
	at org.apache.hadoop.util.Shell.run(Shell.java:188)
	at org.apache.hadoop.util.Shell$ShellCommandExecutor.execute(Shell.java:381)
	at org.apache.hadoop.util.Shell.execCommand(Shell.java:467)
	at org.apache.hadoop.util.Shell.execCommand(Shell.java:450)
	at org.apache.hadoop.fs.RawLocalFileSystem.execCommand(RawLocalFileSystem.java:549)
	at org.apache.hadoop.fs.RawLocalFileSystem.setPermission(RawLocalFileSystem.java:540)
	at org.apache.hadoop.fs.FilterFileSystem.setPermission(FilterFileSystem.java:353)
	at org.apache.hadoop.fs.FileSystem.mkdirs(FileSystem.java:428)
	at org.apache.hadoop.mapreduce.JobSubmitter.copyAndConfigureFiles(JobSubmitter.java:166)
	at org.apache.hadoop.mapreduce.JobSubmitter.copyAndConfigureFiles(JobSubmitter.java:283)
	at org.apache.hadoop.mapreduce.JobSubmitter.submitJobInternal(JobSubmitter.java:350)
	at org.apache.hadoop.mapreduce.Job$2.run(Job.java:1037)
	at org.apache.hadoop.mapreduce.Job$2.run(Job.java:1034)
	at java.security.AccessController.doPrivileged(Native Method)
	at javax.security.auth.Subject.doAs(Subject.java:396)
	at org.apache.hadoop.security.UserGroupInformation.doAs(UserGroupInformation.java:1142)
	at org.apache.hadoop.mapreduce.Job.submit(Job.java:1034)
	at org.apache.hadoop.mapreduce.Job.waitForCompletion(Job.java:1054)
	at org.apache.hadoop.mapreduce.TestMapCollection.runTest(TestMapCollection.java:326)
	at org.apache.hadoop.mapreduce.TestMapCollection.runTest(TestMapCollection.java:309)
	at org.apache.hadoop.mapreduce.TestMapCollection.__CLR3_0_2molruins3(TestMapCollection.java:374)
	at org.apache.hadoop.mapreduce.TestMapCollection.testSplitMetaSpill(TestMapCollection.java:373)


REGRESSION:  org.apache.hadoop.mapreduce.TestMapCollection.testPostSpillMeta

Error Message:
chmod: cannot access `/tmp/hadoop-hudson/mapred/staging/hudson-2105924992/.staging/job_local_0008': No such file or directory 

Stack Trace:
org.apache.hadoop.util.Shell$ExitCodeException: chmod: cannot access `/tmp/hadoop-hudson/mapred/staging/hudson-2105924992/.staging/job_local_0008': No such file or directory

	at org.apache.hadoop.util.Shell.runCommand(Shell.java:261)
	at org.apache.hadoop.util.Shell.run(Shell.java:188)
	at org.apache.hadoop.util.Shell$ShellCommandExecutor.execute(Shell.java:381)
	at org.apache.hadoop.util.Shell.execCommand(Shell.java:467)
	at org.apache.hadoop.util.Shell.execCommand(Shell.java:450)
	at org.apache.hadoop.fs.RawLocalFileSystem.execCommand(RawLocalFileSystem.java:549)
	at org.apache.hadoop.fs.RawLocalFileSystem.setPermission(RawLocalFileSystem.java:540)
	at org.apache.hadoop.fs.FilterFileSystem.setPermission(FilterFileSystem.java:353)
	at org.apache.hadoop.fs.FileSystem.mkdirs(FileSystem.java:428)
	at org.apache.hadoop.mapreduce.JobSubmitter.copyAndConfigureFiles(JobSubmitter.java:166)
	at org.apache.hadoop.mapreduce.JobSubmitter.copyAndConfigureFiles(JobSubmitter.java:283)
	at org.apache.hadoop.mapreduce.JobSubmitter.submitJobInternal(JobSubmitter.java:350)
	at org.apache.hadoop.mapreduce.Job$2.run(Job.java:1037)
	at org.apache.hadoop.mapreduce.Job$2.run(Job.java:1034)
	at java.security.AccessController.doPrivileged(Native Method)
	at javax.security.auth.Subject.doAs(Subject.java:396)
	at org.apache.hadoop.security.UserGroupInformation.doAs(UserGroupInformation.java:1142)
	at org.apache.hadoop.mapreduce.Job.submit(Job.java:1034)
	at org.apache.hadoop.mapreduce.Job.waitForCompletion(Job.java:1054)
	at org.apache.hadoop.mapreduce.TestMapCollection.runTest(TestMapCollection.java:326)
	at org.apache.hadoop.mapreduce.TestMapCollection.__CLR3_0_266dm6ensp(TestMapCollection.java:423)
	at org.apache.hadoop.mapreduce.TestMapCollection.testPostSpillMeta(TestMapCollection.java:407)


REGRESSION:  org.apache.hadoop.mapreduce.TestMapCollection.testLargeRecConcurrent

Error Message:
chmod: cannot access `/tmp/hadoop-hudson/mapred/staging/hudson1382382788/.staging/job_local_0009': No such file or directory 

Stack Trace:
org.apache.hadoop.util.Shell$ExitCodeException: chmod: cannot access `/tmp/hadoop-hudson/mapred/staging/hudson1382382788/.staging/job_local_0009': No such file or directory

	at org.apache.hadoop.util.Shell.runCommand(Shell.java:261)
	at org.apache.hadoop.util.Shell.run(Shell.java:188)
	at org.apache.hadoop.util.Shell$ShellCommandExecutor.execute(Shell.java:381)
	at org.apache.hadoop.util.Shell.execCommand(Shell.java:467)
	at org.apache.hadoop.util.Shell.execCommand(Shell.java:450)
	at org.apache.hadoop.fs.RawLocalFileSystem.execCommand(RawLocalFileSystem.java:549)
	at org.apache.hadoop.fs.RawLocalFileSystem.setPermission(RawLocalFileSystem.java:540)
	at org.apache.hadoop.fs.FilterFileSystem.setPermission(FilterFileSystem.java:353)
	at org.apache.hadoop.fs.FileSystem.mkdirs(FileSystem.java:428)
	at org.apache.hadoop.mapreduce.JobSubmitter.copyAndConfigureFiles(JobSubmitter.java:166)
	at org.apache.hadoop.mapreduce.JobSubmitter.copyAndConfigureFiles(JobSubmitter.java:283)
	at org.apache.hadoop.mapreduce.JobSubmitter.submitJobInternal(JobSubmitter.java:350)
	at org.apache.hadoop.mapreduce.Job$2.run(Job.java:1037)
	at org.apache.hadoop.mapreduce.Job$2.run(Job.java:1034)
	at java.security.AccessController.doPrivileged(Native Method)
	at javax.security.auth.Subject.doAs(Subject.java:396)
	at org.apache.hadoop.security.UserGroupInformation.doAs(UserGroupInformation.java:1142)
	at org.apache.hadoop.mapreduce.Job.submit(Job.java:1034)
	at org.apache.hadoop.mapreduce.Job.waitForCompletion(Job.java:1054)
	at org.apache.hadoop.mapreduce.TestMapCollection.runTest(TestMapCollection.java:326)
	at org.apache.hadoop.mapreduce.TestMapCollection.__CLR3_0_2qefqudnt2(TestMapCollection.java:440)
	at org.apache.hadoop.mapreduce.TestMapCollection.testLargeRecConcurrent(TestMapCollection.java:427)


REGRESSION:  org.apache.hadoop.mapreduce.TestMapCollection.testRandom

Error Message:
chmod: cannot access `/tmp/hadoop-hudson/mapred/staging/hudson-694359085/.staging/job_local_0010': No such file or directory 

Stack Trace:
org.apache.hadoop.util.Shell$ExitCodeException: chmod: cannot access `/tmp/hadoop-hudson/mapred/staging/hudson-694359085/.staging/job_local_0010': No such file or directory

	at org.apache.hadoop.util.Shell.runCommand(Shell.java:261)
	at org.apache.hadoop.util.Shell.run(Shell.java:188)
	at org.apache.hadoop.util.Shell$ShellCommandExecutor.execute(Shell.java:381)
	at org.apache.hadoop.util.Shell.execCommand(Shell.java:467)
	at org.apache.hadoop.util.Shell.execCommand(Shell.java:450)
	at org.apache.hadoop.fs.RawLocalFileSystem.execCommand(RawLocalFileSystem.java:549)
	at org.apache.hadoop.fs.RawLocalFileSystem.setPermission(RawLocalFileSystem.java:540)
	at org.apache.hadoop.fs.FilterFileSystem.setPermission(FilterFileSystem.java:353)
	at org.apache.hadoop.fs.FileSystem.mkdirs(FileSystem.java:428)
	at org.apache.hadoop.mapreduce.JobSubmitter.copyAndConfigureFiles(JobSubmitter.java:166)
	at org.apache.hadoop.mapreduce.JobSubmitter.copyAndConfigureFiles(JobSubmitter.java:283)
	at org.apache.hadoop.mapreduce.JobSubmitter.submitJobInternal(JobSubmitter.java:350)
	at org.apache.hadoop.mapreduce.Job$2.run(Job.java:1037)
	at org.apache.hadoop.mapreduce.Job$2.run(Job.java:1034)
	at java.security.AccessController.doPrivileged(Native Method)
	at javax.security.auth.Subject.doAs(Subject.java:396)
	at org.apache.hadoop.security.UserGroupInformation.doAs(UserGroupInformation.java:1142)
	at org.apache.hadoop.mapreduce.Job.submit(Job.java:1034)
	at org.apache.hadoop.mapreduce.Job.waitForCompletion(Job.java:1054)
	at org.apache.hadoop.mapreduce.TestMapCollection.runTest(TestMapCollection.java:326)
	at org.apache.hadoop.mapreduce.TestMapCollection.__CLR3_0_2ujoeasnuk(TestMapCollection.java:513)
	at org.apache.hadoop.mapreduce.TestMapCollection.testRandom(TestMapCollection.java:496)


REGRESSION:  org.apache.hadoop.mapreduce.TestMapCollection.testRandomCompress

Error Message:
chmod: cannot access `/tmp/hadoop-hudson/mapred/staging/hudson1137158635/.staging/job_local_0011': No such file or directory 

Stack Trace:
org.apache.hadoop.util.Shell$ExitCodeException: chmod: cannot access `/tmp/hadoop-hudson/mapred/staging/hudson1137158635/.staging/job_local_0011': No such file or directory

	at org.apache.hadoop.util.Shell.runCommand(Shell.java:261)
	at org.apache.hadoop.util.Shell.run(Shell.java:188)
	at org.apache.hadoop.util.Shell$ShellCommandExecutor.execute(Shell.java:381)
	at org.apache.hadoop.util.Shell.execCommand(Shell.java:467)
	at org.apache.hadoop.util.Shell.execCommand(Shell.java:450)
	at org.apache.hadoop.fs.RawLocalFileSystem.execCommand(RawLocalFileSystem.java:549)
	at org.apache.hadoop.fs.RawLocalFileSystem.setPermission(RawLocalFileSystem.java:540)
	at org.apache.hadoop.fs.FilterFileSystem.setPermission(FilterFileSystem.java:353)
	at org.apache.hadoop.fs.FileSystem.mkdirs(FileSystem.java:428)
	at org.apache.hadoop.mapreduce.JobSubmitter.copyAndConfigureFiles(JobSubmitter.java:166)
	at org.apache.hadoop.mapreduce.JobSubmitter.copyAndConfigureFiles(JobSubmitter.java:283)
	at org.apache.hadoop.mapreduce.JobSubmitter.submitJobInternal(JobSubmitter.java:350)
	at org.apache.hadoop.mapreduce.Job$2.run(Job.java:1037)
	at org.apache.hadoop.mapreduce.Job$2.run(Job.java:1034)
	at java.security.AccessController.doPrivileged(Native Method)
	at javax.security.auth.Subject.doAs(Subject.java:396)
	at org.apache.hadoop.security.UserGroupInformation.doAs(UserGroupInformation.java:1142)
	at org.apache.hadoop.mapreduce.Job.submit(Job.java:1034)
	at org.apache.hadoop.mapreduce.Job.waitForCompletion(Job.java:1054)
	at org.apache.hadoop.mapreduce.TestMapCollection.runTest(TestMapCollection.java:326)
	at org.apache.hadoop.mapreduce.TestMapCollection.__CLR3_0_2vyg2zmnv0(TestMapCollection.java:535)
	at org.apache.hadoop.mapreduce.TestMapCollection.testRandomCompress(TestMapCollection.java:517)


REGRESSION:  org.apache.hadoop.mapreduce.TestMapReduce.testMapred

Error Message:
chmod: cannot access `/tmp/hadoop-hudson/mapred/staging/hudson-1609500991/.staging/job_local_0001': No such file or directory 

Stack Trace:
org.apache.hadoop.util.Shell$ExitCodeException: chmod: cannot access `/tmp/hadoop-hudson/mapred/staging/hudson-1609500991/.staging/job_local_0001': No such file or directory

	at org.apache.hadoop.util.Shell.runCommand(Shell.java:261)
	at org.apache.hadoop.util.Shell.run(Shell.java:188)
	at org.apache.hadoop.util.Shell$ShellCommandExecutor.execute(Shell.java:381)
	at org.apache.hadoop.util.Shell.execCommand(Shell.java:467)
	at org.apache.hadoop.util.Shell.execCommand(Shell.java:450)
	at org.apache.hadoop.fs.RawLocalFileSystem.execCommand(RawLocalFileSystem.java:549)
	at org.apache.hadoop.fs.RawLocalFileSystem.setPermission(RawLocalFileSystem.java:540)
	at org.apache.hadoop.fs.FilterFileSystem.setPermission(FilterFileSystem.java:353)
	at org.apache.hadoop.fs.FileSystem.mkdirs(FileSystem.java:428)
	at org.apache.hadoop.mapreduce.JobSubmitter.copyAndConfigureFiles(JobSubmitter.java:166)
	at org.apache.hadoop.mapreduce.JobSubmitter.copyAndConfigureFiles(JobSubmitter.java:283)
	at org.apache.hadoop.mapreduce.JobSubmitter.submitJobInternal(JobSubmitter.java:350)
	at org.apache.hadoop.mapreduce.Job$2.run(Job.java:1037)
	at org.apache.hadoop.mapreduce.Job$2.run(Job.java:1034)
	at java.security.AccessController.doPrivileged(Native Method)
	at javax.security.auth.Subject.doAs(Subject.java:396)
	at org.apache.hadoop.security.UserGroupInformation.doAs(UserGroupInformation.java:1142)
	at org.apache.hadoop.mapreduce.Job.submit(Job.java:1034)
	at org.apache.hadoop.mapreduce.Job.waitForCompletion(Job.java:1054)
	at org.apache.hadoop.mapreduce.TestMapReduce.launch(TestMapReduce.java:300)
	at org.apache.hadoop.mapreduce.TestMapReduce.__CLR3_0_2vmf1hqep9(TestMapReduce.java:219)
	at org.apache.hadoop.mapreduce.TestMapReduce.testMapred(TestMapReduce.java:218)


REGRESSION:  org.apache.hadoop.mapreduce.TestValueIterReset.testValueIterReset

Error Message:
null

Stack Trace:
junit.framework.AssertionFailedError: null
	at org.apache.hadoop.mapreduce.TestValueIterReset.__CLR3_0_2hu3rohsuv(TestValueIterReset.java:547)
	at org.apache.hadoop.mapreduce.TestValueIterReset.testValueIterReset(TestValueIterReset.java:521)


REGRESSION:  org.apache.hadoop.mapreduce.lib.aggregate.TestMapReduceAggregates.testAggregates

Error Message:
chmod: cannot access `/tmp/hadoop-hudson/mapred/staging/hudson-949036550/.staging/job_local_0001': No such file or directory 

Stack Trace:
org.apache.hadoop.util.Shell$ExitCodeException: chmod: cannot access `/tmp/hadoop-hudson/mapred/staging/hudson-949036550/.staging/job_local_0001': No such file or directory

	at org.apache.hadoop.util.Shell.runCommand(Shell.java:261)
	at org.apache.hadoop.util.Shell.run(Shell.java:188)
	at org.apache.hadoop.util.Shell$ShellCommandExecutor.execute(Shell.java:381)
	at org.apache.hadoop.util.Shell.execCommand(Shell.java:467)
	at org.apache.hadoop.util.Shell.execCommand(Shell.java:450)
	at org.apache.hadoop.fs.RawLocalFileSystem.execCommand(RawLocalFileSystem.java:549)
	at org.apache.hadoop.fs.RawLocalFileSystem.setPermission(RawLocalFileSystem.java:540)
	at org.apache.hadoop.fs.FilterFileSystem.setPermission(FilterFileSystem.java:353)
	at org.apache.hadoop.fs.FileSystem.mkdirs(FileSystem.java:428)
	at org.apache.hadoop.mapreduce.JobSubmitter.copyAndConfigureFiles(JobSubmitter.java:166)
	at org.apache.hadoop.mapreduce.JobSubmitter.copyAndConfigureFiles(JobSubmitter.java:283)
	at org.apache.hadoop.mapreduce.JobSubmitter.submitJobInternal(JobSubmitter.java:350)
	at org.apache.hadoop.mapreduce.Job$2.run(Job.java:1037)
	at org.apache.hadoop.mapreduce.Job$2.run(Job.java:1034)
	at java.security.AccessController.doPrivileged(Native Method)
	at javax.security.auth.Subject.doAs(Subject.java:396)
	at org.apache.hadoop.security.UserGroupInformation.doAs(UserGroupInformation.java:1142)
	at org.apache.hadoop.mapreduce.Job.submit(Job.java:1034)
	at org.apache.hadoop.mapreduce.Job.waitForCompletion(Job.java:1054)
	at org.apache.hadoop.mapreduce.lib.aggregate.TestMapReduceAggregates.launch(TestMapReduceAggregates.java:108)
	at org.apache.hadoop.mapreduce.lib.aggregate.TestMapReduceAggregates.__CLR3_0_21uoc3b7k(TestMapReduceAggregates.java:46)
	at org.apache.hadoop.mapreduce.lib.aggregate.TestMapReduceAggregates.testAggregates(TestMapReduceAggregates.java:45)


REGRESSION:  org.apache.hadoop.mapreduce.lib.chain.TestChainErrors.testChainFail

Error Message:
chmod: cannot access `/tmp/hadoop-hudson/mapred/staging/hudson-286437462/.staging/job_local_0001': No such file or directory 

Stack Trace:
org.apache.hadoop.util.Shell$ExitCodeException: chmod: cannot access `/tmp/hadoop-hudson/mapred/staging/hudson-286437462/.staging/job_local_0001': No such file or directory

	at org.apache.hadoop.util.Shell.runCommand(Shell.java:261)
	at org.apache.hadoop.util.Shell.run(Shell.java:188)
	at org.apache.hadoop.util.Shell$ShellCommandExecutor.execute(Shell.java:381)
	at org.apache.hadoop.util.Shell.execCommand(Shell.java:467)
	at org.apache.hadoop.util.Shell.execCommand(Shell.java:450)
	at org.apache.hadoop.fs.RawLocalFileSystem.execCommand(RawLocalFileSystem.java:549)
	at org.apache.hadoop.fs.RawLocalFileSystem.setPermission(RawLocalFileSystem.java:540)
	at org.apache.hadoop.fs.FilterFileSystem.setPermission(FilterFileSystem.java:353)
	at org.apache.hadoop.fs.FileSystem.mkdirs(FileSystem.java:428)
	at org.apache.hadoop.mapreduce.JobSubmitter.copyAndConfigureFiles(JobSubmitter.java:166)
	at org.apache.hadoop.mapreduce.JobSubmitter.copyAndConfigureFiles(JobSubmitter.java:283)
	at org.apache.hadoop.mapreduce.JobSubmitter.submitJobInternal(JobSubmitter.java:350)
	at org.apache.hadoop.mapreduce.Job$2.run(Job.java:1037)
	at org.apache.hadoop.mapreduce.Job$2.run(Job.java:1034)
	at java.security.AccessController.doPrivileged(Native Method)
	at javax.security.auth.Subject.doAs(Subject.java:396)
	at org.apache.hadoop.security.UserGroupInformation.doAs(UserGroupInformation.java:1142)
	at org.apache.hadoop.mapreduce.Job.submit(Job.java:1034)
	at org.apache.hadoop.mapreduce.Job.waitForCompletion(Job.java:1054)
	at org.apache.hadoop.mapreduce.lib.chain.TestChainErrors.__CLR3_0_2bnfjqsh1h(TestChainErrors.java:108)
	at org.apache.hadoop.mapreduce.lib.chain.TestChainErrors.testChainFail(TestChainErrors.java:92)


REGRESSION:  org.apache.hadoop.mapreduce.lib.chain.TestChainErrors.testReducerFail

Error Message:
chmod: cannot access `/tmp/hadoop-hudson/mapred/staging/hudson598105577/.staging/job_local_0002': No such file or directory 

Stack Trace:
org.apache.hadoop.util.Shell$ExitCodeException: chmod: cannot access `/tmp/hadoop-hudson/mapred/staging/hudson598105577/.staging/job_local_0002': No such file or directory

	at org.apache.hadoop.util.Shell.runCommand(Shell.java:261)
	at org.apache.hadoop.util.Shell.run(Shell.java:188)
	at org.apache.hadoop.util.Shell$ShellCommandExecutor.execute(Shell.java:381)
	at org.apache.hadoop.util.Shell.execCommand(Shell.java:467)
	at org.apache.hadoop.util.Shell.execCommand(Shell.java:450)
	at org.apache.hadoop.fs.RawLocalFileSystem.execCommand(RawLocalFileSystem.java:549)
	at org.apache.hadoop.fs.RawLocalFileSystem.setPermission(RawLocalFileSystem.java:540)
	at org.apache.hadoop.fs.FilterFileSystem.setPermission(FilterFileSystem.java:353)
	at org.apache.hadoop.fs.FileSystem.mkdirs(FileSystem.java:428)
	at org.apache.hadoop.mapreduce.JobSubmitter.copyAndConfigureFiles(JobSubmitter.java:166)
	at org.apache.hadoop.mapreduce.JobSubmitter.copyAndConfigureFiles(JobSubmitter.java:283)
	at org.apache.hadoop.mapreduce.JobSubmitter.submitJobInternal(JobSubmitter.java:350)
	at org.apache.hadoop.mapreduce.Job$2.run(Job.java:1037)
	at org.apache.hadoop.mapreduce.Job$2.run(Job.java:1034)
	at java.security.AccessController.doPrivileged(Native Method)
	at javax.security.auth.Subject.doAs(Subject.java:396)
	at org.apache.hadoop.security.UserGroupInformation.doAs(UserGroupInformation.java:1142)
	at org.apache.hadoop.mapreduce.Job.submit(Job.java:1034)
	at org.apache.hadoop.mapreduce.Job.waitForCompletion(Job.java:1054)
	at org.apache.hadoop.mapreduce.lib.chain.TestChainErrors.__CLR3_0_25ewwv3h1q(TestChainErrors.java:133)
	at org.apache.hadoop.mapreduce.lib.chain.TestChainErrors.testReducerFail(TestChainErrors.java:117)


REGRESSION:  org.apache.hadoop.mapreduce.lib.chain.TestChainErrors.testChainMapNoOuptut

Error Message:
chmod: cannot access `/tmp/hadoop-hudson/mapred/staging/hudson208151334/.staging/job_local_0003': No such file or directory 

Stack Trace:
org.apache.hadoop.util.Shell$ExitCodeException: chmod: cannot access `/tmp/hadoop-hudson/mapred/staging/hudson208151334/.staging/job_local_0003': No such file or directory

	at org.apache.hadoop.util.Shell.runCommand(Shell.java:261)
	at org.apache.hadoop.util.Shell.run(Shell.java:188)
	at org.apache.hadoop.util.Shell$ShellCommandExecutor.execute(Shell.java:381)
	at org.apache.hadoop.util.Shell.execCommand(Shell.java:467)
	at org.apache.hadoop.util.Shell.execCommand(Shell.java:450)
	at org.apache.hadoop.fs.RawLocalFileSystem.execCommand(RawLocalFileSystem.java:549)
	at org.apache.hadoop.fs.RawLocalFileSystem.setPermission(RawLocalFileSystem.java:540)
	at org.apache.hadoop.fs.FilterFileSystem.setPermission(FilterFileSystem.java:353)
	at org.apache.hadoop.fs.FileSystem.mkdirs(FileSystem.java:428)
	at org.apache.hadoop.mapreduce.JobSubmitter.copyAndConfigureFiles(JobSubmitter.java:166)
	at org.apache.hadoop.mapreduce.JobSubmitter.copyAndConfigureFiles(JobSubmitter.java:283)
	at org.apache.hadoop.mapreduce.JobSubmitter.submitJobInternal(JobSubmitter.java:350)
	at org.apache.hadoop.mapreduce.Job$2.run(Job.java:1037)
	at org.apache.hadoop.mapreduce.Job$2.run(Job.java:1034)
	at java.security.AccessController.doPrivileged(Native Method)
	at javax.security.auth.Subject.doAs(Subject.java:396)
	at org.apache.hadoop.security.UserGroupInformation.doAs(UserGroupInformation.java:1142)
	at org.apache.hadoop.mapreduce.Job.submit(Job.java:1034)
	at org.apache.hadoop.mapreduce.Job.waitForCompletion(Job.java:1054)
	at org.apache.hadoop.mapreduce.lib.chain.TestChainErrors.__CLR3_0_2mbjvwih1z(TestChainErrors.java:155)
	at org.apache.hadoop.mapreduce.lib.chain.TestChainErrors.testChainMapNoOuptut(TestChainErrors.java:142)


REGRESSION:  org.apache.hadoop.mapreduce.lib.chain.TestChainErrors.testChainReduceNoOuptut

Error Message:
chmod: cannot access `/tmp/hadoop-hudson/mapred/staging/hudson1996970378/.staging/job_local_0004': No such file or directory 

Stack Trace:
org.apache.hadoop.util.Shell$ExitCodeException: chmod: cannot access `/tmp/hadoop-hudson/mapred/staging/hudson1996970378/.staging/job_local_0004': No such file or directory

	at org.apache.hadoop.util.Shell.runCommand(Shell.java:261)
	at org.apache.hadoop.util.Shell.run(Shell.java:188)
	at org.apache.hadoop.util.Shell$ShellCommandExecutor.execute(Shell.java:381)
	at org.apache.hadoop.util.Shell.execCommand(Shell.java:467)
	at org.apache.hadoop.util.Shell.execCommand(Shell.java:450)
	at org.apache.hadoop.fs.RawLocalFileSystem.execCommand(RawLocalFileSystem.java:549)
	at org.apache.hadoop.fs.RawLocalFileSystem.setPermission(RawLocalFileSystem.java:540)
	at org.apache.hadoop.fs.FilterFileSystem.setPermission(FilterFileSystem.java:353)
	at org.apache.hadoop.fs.FileSystem.mkdirs(FileSystem.java:428)
	at org.apache.hadoop.mapreduce.JobSubmitter.copyAndConfigureFiles(JobSubmitter.java:166)
	at org.apache.hadoop.mapreduce.JobSubmitter.copyAndConfigureFiles(JobSubmitter.java:283)
	at org.apache.hadoop.mapreduce.JobSubmitter.submitJobInternal(JobSubmitter.java:350)
	at org.apache.hadoop.mapreduce.Job$2.run(Job.java:1037)
	at org.apache.hadoop.mapreduce.Job$2.run(Job.java:1034)
	at java.security.AccessController.doPrivileged(Native Method)
	at javax.security.auth.Subject.doAs(Subject.java:396)
	at org.apache.hadoop.security.UserGroupInformation.doAs(UserGroupInformation.java:1142)
	at org.apache.hadoop.mapreduce.Job.submit(Job.java:1034)
	at org.apache.hadoop.mapreduce.Job.waitForCompletion(Job.java:1054)
	at org.apache.hadoop.mapreduce.lib.chain.TestChainErrors.__CLR3_0_24qjj5yh29(TestChainErrors.java:182)
	at org.apache.hadoop.mapreduce.lib.chain.TestChainErrors.testChainReduceNoOuptut(TestChainErrors.java:166)


REGRESSION:  org.apache.hadoop.mapreduce.lib.chain.TestMapReduceChain.testChain

Error Message:
chmod: cannot access `/tmp/hadoop-hudson/mapred/staging/hudson-1305105834/.staging/job_local_0001': No such file or directory 

Stack Trace:
org.apache.hadoop.util.Shell$ExitCodeException: chmod: cannot access `/tmp/hadoop-hudson/mapred/staging/hudson-1305105834/.staging/job_local_0001': No such file or directory

	at org.apache.hadoop.util.Shell.runCommand(Shell.java:261)
	at org.apache.hadoop.util.Shell.run(Shell.java:188)
	at org.apache.hadoop.util.Shell$ShellCommandExecutor.execute(Shell.java:381)
	at org.apache.hadoop.util.Shell.execCommand(Shell.java:467)
	at org.apache.hadoop.util.Shell.execCommand(Shell.java:450)
	at org.apache.hadoop.fs.RawLocalFileSystem.execCommand(RawLocalFileSystem.java:549)
	at org.apache.hadoop.fs.RawLocalFileSystem.setPermission(RawLocalFileSystem.java:540)
	at org.apache.hadoop.fs.FilterFileSystem.setPermission(FilterFileSystem.java:353)
	at org.apache.hadoop.fs.FileSystem.mkdirs(FileSystem.java:428)
	at org.apache.hadoop.mapreduce.JobSubmitter.copyAndConfigureFiles(JobSubmitter.java:166)
	at org.apache.hadoop.mapreduce.JobSubmitter.copyAndConfigureFiles(JobSubmitter.java:283)
	at org.apache.hadoop.mapreduce.JobSubmitter.submitJobInternal(JobSubmitter.java:350)
	at org.apache.hadoop.mapreduce.Job$2.run(Job.java:1037)
	at org.apache.hadoop.mapreduce.Job$2.run(Job.java:1034)
	at java.security.AccessController.doPrivileged(Native Method)
	at javax.security.auth.Subject.doAs(Subject.java:396)
	at org.apache.hadoop.security.UserGroupInformation.doAs(UserGroupInformation.java:1142)
	at org.apache.hadoop.mapreduce.Job.submit(Job.java:1034)
	at org.apache.hadoop.mapreduce.Job.waitForCompletion(Job.java:1054)
	at org.apache.hadoop.mapreduce.lib.chain.TestMapReduceChain.__CLR3_0_2ke5z1ypkc(TestMapReduceChain.java:106)
	at org.apache.hadoop.mapreduce.lib.chain.TestMapReduceChain.testChain(TestMapReduceChain.java:66)


REGRESSION:  org.apache.hadoop.mapreduce.lib.chain.TestSingleElementChain.testNoChain

Error Message:
chmod: cannot access `/tmp/hadoop-hudson/mapred/staging/hudson1549837073/.staging/job_local_0001': No such file or directory 

Stack Trace:
org.apache.hadoop.util.Shell$ExitCodeException: chmod: cannot access `/tmp/hadoop-hudson/mapred/staging/hudson1549837073/.staging/job_local_0001': No such file or directory

	at org.apache.hadoop.util.Shell.runCommand(Shell.java:261)
	at org.apache.hadoop.util.Shell.run(Shell.java:188)
	at org.apache.hadoop.util.Shell$ShellCommandExecutor.execute(Shell.java:381)
	at org.apache.hadoop.util.Shell.execCommand(Shell.java:467)
	at org.apache.hadoop.util.Shell.execCommand(Shell.java:450)
	at org.apache.hadoop.fs.RawLocalFileSystem.execCommand(RawLocalFileSystem.java:549)
	at org.apache.hadoop.fs.RawLocalFileSystem.setPermission(RawLocalFileSystem.java:540)
	at org.apache.hadoop.fs.FilterFileSystem.setPermission(FilterFileSystem.java:353)
	at org.apache.hadoop.fs.FileSystem.mkdirs(FileSystem.java:428)
	at org.apache.hadoop.mapreduce.JobSubmitter.copyAndConfigureFiles(JobSubmitter.java:166)
	at org.apache.hadoop.mapreduce.JobSubmitter.copyAndConfigureFiles(JobSubmitter.java:283)
	at org.apache.hadoop.mapreduce.JobSubmitter.submitJobInternal(JobSubmitter.java:350)
	at org.apache.hadoop.mapreduce.Job$2.run(Job.java:1037)
	at org.apache.hadoop.mapreduce.Job$2.run(Job.java:1034)
	at java.security.AccessController.doPrivileged(Native Method)
	at javax.security.auth.Subject.doAs(Subject.java:396)
	at org.apache.hadoop.security.UserGroupInformation.doAs(UserGroupInformation.java:1142)
	at org.apache.hadoop.mapreduce.Job.submit(Job.java:1034)
	at org.apache.hadoop.mapreduce.Job.waitForCompletion(Job.java:1054)
	at org.apache.hadoop.mapreduce.lib.chain.TestSingleElementChain.__CLR3_0_2tfhzhngfx(TestSingleElementChain.java:62)
	at org.apache.hadoop.mapreduce.lib.chain.TestSingleElementChain.testNoChain(TestSingleElementChain.java:45)


REGRESSION:  org.apache.hadoop.mapreduce.lib.db.TestDBJob.testRun

Error Message:
chmod: cannot access `/tmp/hadoop-hudson/mapred/staging/hudson-49085591/.staging/job_local_0001': No such file or directory 

Stack Trace:
org.apache.hadoop.util.Shell$ExitCodeException: chmod: cannot access `/tmp/hadoop-hudson/mapred/staging/hudson-49085591/.staging/job_local_0001': No such file or directory

	at org.apache.hadoop.util.Shell.runCommand(Shell.java:261)
	at org.apache.hadoop.util.Shell.run(Shell.java:188)
	at org.apache.hadoop.util.Shell$ShellCommandExecutor.execute(Shell.java:381)
	at org.apache.hadoop.util.Shell.execCommand(Shell.java:467)
	at org.apache.hadoop.util.Shell.execCommand(Shell.java:450)
	at org.apache.hadoop.fs.RawLocalFileSystem.execCommand(RawLocalFileSystem.java:549)
	at org.apache.hadoop.fs.RawLocalFileSystem.setPermission(RawLocalFileSystem.java:540)
	at org.apache.hadoop.fs.FilterFileSystem.setPermission(FilterFileSystem.java:353)
	at org.apache.hadoop.fs.FileSystem.mkdirs(FileSystem.java:428)
	at org.apache.hadoop.mapreduce.JobSubmitter.copyAndConfigureFiles(JobSubmitter.java:166)
	at org.apache.hadoop.mapreduce.JobSubmitter.copyAndConfigureFiles(JobSubmitter.java:283)
	at org.apache.hadoop.mapreduce.JobSubmitter.submitJobInternal(JobSubmitter.java:350)
	at org.apache.hadoop.mapreduce.Job$2.run(Job.java:1037)
	at org.apache.hadoop.mapreduce.Job$2.run(Job.java:1034)
	at java.security.AccessController.doPrivileged(Native Method)
	at javax.security.auth.Subject.doAs(Subject.java:396)
	at org.apache.hadoop.security.UserGroupInformation.doAs(UserGroupInformation.java:1142)
	at org.apache.hadoop.mapreduce.Job.submit(Job.java:1034)
	at org.apache.hadoop.mapreduce.Job.waitForCompletion(Job.java:1054)
	at org.apache.hadoop.examples.DBCountPageView.run(DBCountPageView.java:409)
	at org.apache.hadoop.util.ToolRunner.run(ToolRunner.java:69)
	at org.apache.hadoop.mapreduce.lib.db.TestDBJob.__CLR3_0_2yzvxa8lsk(TestDBJob.java:36)
	at org.apache.hadoop.mapreduce.lib.db.TestDBJob.testRun(TestDBJob.java:34)


REGRESSION:  org.apache.hadoop.mapreduce.lib.db.TestDataDrivenDBInputFormat.testDateSplits

Error Message:
chmod: cannot access `/tmp/hadoop-hudson/mapred/staging/hudson-2132083980/.staging/job_local_0001': No such file or directory 

Stack Trace:
org.apache.hadoop.util.Shell$ExitCodeException: chmod: cannot access `/tmp/hadoop-hudson/mapred/staging/hudson-2132083980/.staging/job_local_0001': No such file or directory

	at org.apache.hadoop.util.Shell.runCommand(Shell.java:261)
	at org.apache.hadoop.util.Shell.run(Shell.java:188)
	at org.apache.hadoop.util.Shell$ShellCommandExecutor.execute(Shell.java:381)
	at org.apache.hadoop.util.Shell.execCommand(Shell.java:467)
	at org.apache.hadoop.util.Shell.execCommand(Shell.java:450)
	at org.apache.hadoop.fs.RawLocalFileSystem.execCommand(RawLocalFileSystem.java:549)
	at org.apache.hadoop.fs.RawLocalFileSystem.setPermission(RawLocalFileSystem.java:540)
	at org.apache.hadoop.fs.FilterFileSystem.setPermission(FilterFileSystem.java:353)
	at org.apache.hadoop.fs.FileSystem.mkdirs(FileSystem.java:428)
	at org.apache.hadoop.mapreduce.JobSubmitter.copyAndConfigureFiles(JobSubmitter.java:166)
	at org.apache.hadoop.mapreduce.JobSubmitter.copyAndConfigureFiles(JobSubmitter.java:283)
	at org.apache.hadoop.mapreduce.JobSubmitter.submitJobInternal(JobSubmitter.java:350)
	at org.apache.hadoop.mapreduce.Job$2.run(Job.java:1037)
	at org.apache.hadoop.mapreduce.Job$2.run(Job.java:1034)
	at java.security.AccessController.doPrivileged(Native Method)
	at javax.security.auth.Subject.doAs(Subject.java:396)
	at org.apache.hadoop.security.UserGroupInformation.doAs(UserGroupInformation.java:1142)
	at org.apache.hadoop.mapreduce.Job.submit(Job.java:1034)
	at org.apache.hadoop.mapreduce.Job.waitForCompletion(Job.java:1054)
	at org.apache.hadoop.mapreduce.lib.db.TestDataDrivenDBInputFormat.__CLR3_0_2klofnkshw(TestDataDrivenDBInputFormat.java:214)
	at org.apache.hadoop.mapreduce.lib.db.TestDataDrivenDBInputFormat.testDateSplits(TestDataDrivenDBInputFormat.java:173)


REGRESSION:  org.apache.hadoop.mapreduce.lib.fieldsel.TestMRFieldSelection.testFieldSelection

Error Message:
chmod: cannot access `/tmp/hadoop-hudson/mapred/staging/hudson1448909940/.staging/job_local_0001': No such file or directory 

Stack Trace:
org.apache.hadoop.util.Shell$ExitCodeException: chmod: cannot access `/tmp/hadoop-hudson/mapred/staging/hudson1448909940/.staging/job_local_0001': No such file or directory

	at org.apache.hadoop.util.Shell.runCommand(Shell.java:261)
	at org.apache.hadoop.util.Shell.run(Shell.java:188)
	at org.apache.hadoop.util.Shell$ShellCommandExecutor.execute(Shell.java:381)
	at org.apache.hadoop.util.Shell.execCommand(Shell.java:467)
	at org.apache.hadoop.util.Shell.execCommand(Shell.java:450)
	at org.apache.hadoop.fs.RawLocalFileSystem.execCommand(RawLocalFileSystem.java:549)
	at org.apache.hadoop.fs.RawLocalFileSystem.setPermission(RawLocalFileSystem.java:540)
	at org.apache.hadoop.fs.FilterFileSystem.setPermission(FilterFileSystem.java:353)
	at org.apache.hadoop.fs.FileSystem.mkdirs(FileSystem.java:428)
	at org.apache.hadoop.mapreduce.JobSubmitter.copyAndConfigureFiles(JobSubmitter.java:166)
	at org.apache.hadoop.mapreduce.JobSubmitter.copyAndConfigureFiles(JobSubmitter.java:283)
	at org.apache.hadoop.mapreduce.JobSubmitter.submitJobInternal(JobSubmitter.java:350)
	at org.apache.hadoop.mapreduce.Job$2.run(Job.java:1037)
	at org.apache.hadoop.mapreduce.Job$2.run(Job.java:1034)
	at java.security.AccessController.doPrivileged(Native Method)
	at javax.security.auth.Subject.doAs(Subject.java:396)
	at org.apache.hadoop.security.UserGroupInformation.doAs(UserGroupInformation.java:1142)
	at org.apache.hadoop.mapreduce.Job.submit(Job.java:1034)
	at org.apache.hadoop.mapreduce.Job.waitForCompletion(Job.java:1054)
	at org.apache.hadoop.mapreduce.lib.fieldsel.TestMRFieldSelection.launch(TestMRFieldSelection.java:67)
	at org.apache.hadoop.mapreduce.lib.fieldsel.TestMRFieldSelection.__CLR3_0_2asm65nlmf(TestMRFieldSelection.java:38)
	at org.apache.hadoop.mapreduce.lib.fieldsel.TestMRFieldSelection.testFieldSelection(TestMRFieldSelection.java:37)


REGRESSION:  org.apache.hadoop.mapreduce.lib.input.TestLineRecordReader.testCustomRecordDelimiters

Error Message:
chmod: cannot access `/tmp/hadoop-hudson/mapred/staging/hudson-1463872046/.staging/job_local_0001': No such file or directory 

Stack Trace:
org.apache.hadoop.util.Shell$ExitCodeException: chmod: cannot access `/tmp/hadoop-hudson/mapred/staging/hudson-1463872046/.staging/job_local_0001': No such file or directory

	at org.apache.hadoop.util.Shell.runCommand(Shell.java:261)
	at org.apache.hadoop.util.Shell.run(Shell.java:188)
	at org.apache.hadoop.util.Shell$ShellCommandExecutor.execute(Shell.java:381)
	at org.apache.hadoop.util.Shell.execCommand(Shell.java:467)
	at org.apache.hadoop.util.Shell.execCommand(Shell.java:450)
	at org.apache.hadoop.fs.RawLocalFileSystem.execCommand(RawLocalFileSystem.java:549)
	at org.apache.hadoop.fs.RawLocalFileSystem.setPermission(RawLocalFileSystem.java:540)
	at org.apache.hadoop.fs.FilterFileSystem.setPermission(FilterFileSystem.java:353)
	at org.apache.hadoop.fs.FileSystem.mkdirs(FileSystem.java:428)
	at org.apache.hadoop.mapreduce.JobSubmitter.copyAndConfigureFiles(JobSubmitter.java:166)
	at org.apache.hadoop.mapreduce.JobSubmitter.copyAndConfigureFiles(JobSubmitter.java:283)
	at org.apache.hadoop.mapreduce.JobSubmitter.submitJobInternal(JobSubmitter.java:350)
	at org.apache.hadoop.mapreduce.Job$2.run(Job.java:1037)
	at org.apache.hadoop.mapreduce.Job$2.run(Job.java:1034)
	at java.security.AccessController.doPrivileged(Native Method)
	at javax.security.auth.Subject.doAs(Subject.java:396)
	at org.apache.hadoop.security.UserGroupInformation.doAs(UserGroupInformation.java:1142)
	at org.apache.hadoop.mapreduce.Job.submit(Job.java:1034)
	at org.apache.hadoop.mapreduce.Job.waitForCompletion(Job.java:1054)
	at org.apache.hadoop.mapreduce.lib.input.TestLineRecordReader.createAndRunJob(TestLineRecordReader.java:92)
	at org.apache.hadoop.mapreduce.lib.input.TestLineRecordReader.__CLR3_0_2xdlwnbtoi(TestLineRecordReader.java:113)
	at org.apache.hadoop.mapreduce.lib.input.TestLineRecordReader.testCustomRecordDelimiters(TestLineRecordReader.java:105)


REGRESSION:  org.apache.hadoop.mapreduce.lib.input.TestLineRecordReader.testDefaultRecordDelimiters

Error Message:
chmod: cannot access `/tmp/hadoop-hudson/mapred/staging/hudson-1152732698/.staging/job_local_0002': No such file or directory 

Stack Trace:
org.apache.hadoop.util.Shell$ExitCodeException: chmod: cannot access `/tmp/hadoop-hudson/mapred/staging/hudson-1152732698/.staging/job_local_0002': No such file or directory

	at org.apache.hadoop.util.Shell.runCommand(Shell.java:261)
	at org.apache.hadoop.util.Shell.run(Shell.java:188)
	at org.apache.hadoop.util.Shell$ShellCommandExecutor.execute(Shell.java:381)
	at org.apache.hadoop.util.Shell.execCommand(Shell.java:467)
	at org.apache.hadoop.util.Shell.execCommand(Shell.java:450)
	at org.apache.hadoop.fs.RawLocalFileSystem.execCommand(RawLocalFileSystem.java:549)
	at org.apache.hadoop.fs.RawLocalFileSystem.setPermission(RawLocalFileSystem.java:540)
	at org.apache.hadoop.fs.FilterFileSystem.setPermission(FilterFileSystem.java:353)
	at org.apache.hadoop.fs.FileSystem.mkdirs(FileSystem.java:428)
	at org.apache.hadoop.mapreduce.JobSubmitter.copyAndConfigureFiles(JobSubmitter.java:166)
	at org.apache.hadoop.mapreduce.JobSubmitter.copyAndConfigureFiles(JobSubmitter.java:283)
	at org.apache.hadoop.mapreduce.JobSubmitter.submitJobInternal(JobSubmitter.java:350)
	at org.apache.hadoop.mapreduce.Job$2.run(Job.java:1037)
	at org.apache.hadoop.mapreduce.Job$2.run(Job.java:1034)
	at java.security.AccessController.doPrivileged(Native Method)
	at javax.security.auth.Subject.doAs(Subject.java:396)
	at org.apache.hadoop.security.UserGroupInformation.doAs(UserGroupInformation.java:1142)
	at org.apache.hadoop.mapreduce.Job.submit(Job.java:1034)
	at org.apache.hadoop.mapreduce.Job.waitForCompletion(Job.java:1054)
	at org.apache.hadoop.mapreduce.lib.input.TestLineRecordReader.createAndRunJob(TestLineRecordReader.java:92)
	at org.apache.hadoop.mapreduce.lib.input.TestLineRecordReader.__CLR3_0_2qb6z77tor(TestLineRecordReader.java:135)
	at org.apache.hadoop.mapreduce.lib.input.TestLineRecordReader.testDefaultRecordDelimiters(TestLineRecordReader.java:128)


REGRESSION:  org.apache.hadoop.mapreduce.lib.input.TestMultipleInputs.testDoMultipleInputs

Error Message:
chmod: cannot access `/tmp/hadoop-hudson/mapred/staging/hudson1506124645/.staging/job_local_0001': No such file or directory 

Stack Trace:
org.apache.hadoop.util.Shell$ExitCodeException: chmod: cannot access `/tmp/hadoop-hudson/mapred/staging/hudson1506124645/.staging/job_local_0001': No such file or directory

	at org.apache.hadoop.util.Shell.runCommand(Shell.java:261)
	at org.apache.hadoop.util.Shell.run(Shell.java:188)
	at org.apache.hadoop.util.Shell$ShellCommandExecutor.execute(Shell.java:381)
	at org.apache.hadoop.util.Shell.execCommand(Shell.java:467)
	at org.apache.hadoop.util.Shell.execCommand(Shell.java:450)
	at org.apache.hadoop.fs.RawLocalFileSystem.execCommand(RawLocalFileSystem.java:549)
	at org.apache.hadoop.fs.RawLocalFileSystem.setPermission(RawLocalFileSystem.java:540)
	at org.apache.hadoop.fs.FilterFileSystem.setPermission(FilterFileSystem.java:353)
	at org.apache.hadoop.fs.FileSystem.mkdirs(FileSystem.java:428)
	at org.apache.hadoop.mapreduce.JobSubmitter.copyAndConfigureFiles(JobSubmitter.java:166)
	at org.apache.hadoop.mapreduce.JobSubmitter.copyAndConfigureFiles(JobSubmitter.java:283)
	at org.apache.hadoop.mapreduce.JobSubmitter.submitJobInternal(JobSubmitter.java:350)
	at org.apache.hadoop.mapreduce.Job$2.run(Job.java:1037)
	at org.apache.hadoop.mapreduce.Job$2.run(Job.java:1034)
	at java.security.AccessController.doPrivileged(Native Method)
	at javax.security.auth.Subject.doAs(Subject.java:396)
	at org.apache.hadoop.security.UserGroupInformation.doAs(UserGroupInformation.java:1142)
	at org.apache.hadoop.mapreduce.Job.submit(Job.java:1034)
	at org.apache.hadoop.mapreduce.Job.waitForCompletion(Job.java:1054)
	at org.apache.hadoop.mapreduce.lib.input.TestMultipleInputs.__CLR3_0_2l9fkqlcrk(TestMultipleInputs.java:122)
	at org.apache.hadoop.mapreduce.lib.input.TestMultipleInputs.testDoMultipleInputs(TestMultipleInputs.java:85)


REGRESSION:  org.apache.hadoop.mapreduce.lib.jobcontrol.TestMapReduceJobControl.testJobControlWithKillJob

Error Message:
Timeout occurred. Please note the time in the report does not reflect the time until the timeout.

Stack Trace:
junit.framework.AssertionFailedError: Timeout occurred. Please note the time in the report does not reflect the time until the timeout.


REGRESSION:  org.apache.hadoop.mapreduce.lib.join.TestJoinDatamerge.testSimpleInnerJoin

Error Message:
chmod: cannot access `/tmp/hadoop-hudson/mapred/staging/hudson2146415407/.staging/job_local_0001': No such file or directory 

Stack Trace:
org.apache.hadoop.util.Shell$ExitCodeException: chmod: cannot access `/tmp/hadoop-hudson/mapred/staging/hudson2146415407/.staging/job_local_0001': No such file or directory

	at org.apache.hadoop.util.Shell.runCommand(Shell.java:261)
	at org.apache.hadoop.util.Shell.run(Shell.java:188)
	at org.apache.hadoop.util.Shell$ShellCommandExecutor.execute(Shell.java:381)
	at org.apache.hadoop.util.Shell.execCommand(Shell.java:467)
	at org.apache.hadoop.util.Shell.execCommand(Shell.java:450)
	at org.apache.hadoop.fs.RawLocalFileSystem.execCommand(RawLocalFileSystem.java:549)
	at org.apache.hadoop.fs.RawLocalFileSystem.setPermission(RawLocalFileSystem.java:540)
	at org.apache.hadoop.fs.FilterFileSystem.setPermission(FilterFileSystem.java:353)
	at org.apache.hadoop.fs.FileSystem.mkdirs(FileSystem.java:428)
	at org.apache.hadoop.mapreduce.JobSubmitter.copyAndConfigureFiles(JobSubmitter.java:166)
	at org.apache.hadoop.mapreduce.JobSubmitter.copyAndConfigureFiles(JobSubmitter.java:283)
	at org.apache.hadoop.mapreduce.JobSubmitter.submitJobInternal(JobSubmitter.java:350)
	at org.apache.hadoop.mapreduce.Job$2.run(Job.java:1037)
	at org.apache.hadoop.mapreduce.Job$2.run(Job.java:1034)
	at java.security.AccessController.doPrivileged(Native Method)
	at javax.security.auth.Subject.doAs(Subject.java:396)
	at org.apache.hadoop.security.UserGroupInformation.doAs(UserGroupInformation.java:1142)
	at org.apache.hadoop.mapreduce.Job.submit(Job.java:1034)
	at org.apache.hadoop.mapreduce.Job.waitForCompletion(Job.java:1054)
	at org.apache.hadoop.mapreduce.lib.join.TestJoinDatamerge.joinAs(TestJoinDatamerge.java:267)
	at org.apache.hadoop.mapreduce.lib.join.TestJoinDatamerge.__CLR3_0_239fxnhf4e(TestJoinDatamerge.java:276)
	at org.apache.hadoop.mapreduce.lib.join.TestJoinDatamerge.testSimpleInnerJoin(TestJoinDatamerge.java:275)
	at junit.extensions.TestDecorator.basicRun(TestDecorator.java:24)
	at junit.extensions.TestSetup$1.protect(TestSetup.java:23)
	at junit.extensions.TestSetup.run(TestSetup.java:27)


REGRESSION:  org.apache.hadoop.mapreduce.lib.join.TestJoinDatamerge.testSimpleOuterJoin

Error Message:
chmod: cannot access `/tmp/hadoop-hudson/mapred/staging/hudson-2027013232/.staging/job_local_0002': No such file or directory 

Stack Trace:
org.apache.hadoop.util.Shell$ExitCodeException: chmod: cannot access `/tmp/hadoop-hudson/mapred/staging/hudson-2027013232/.staging/job_local_0002': No such file or directory

	at org.apache.hadoop.util.Shell.runCommand(Shell.java:261)
	at org.apache.hadoop.util.Shell.run(Shell.java:188)
	at org.apache.hadoop.util.Shell$ShellCommandExecutor.execute(Shell.java:381)
	at org.apache.hadoop.util.Shell.execCommand(Shell.java:467)
	at org.apache.hadoop.util.Shell.execCommand(Shell.java:450)
	at org.apache.hadoop.fs.RawLocalFileSystem.execCommand(RawLocalFileSystem.java:549)
	at org.apache.hadoop.fs.RawLocalFileSystem.setPermission(RawLocalFileSystem.java:540)
	at org.apache.hadoop.fs.FilterFileSystem.setPermission(FilterFileSystem.java:353)
	at org.apache.hadoop.fs.FileSystem.mkdirs(FileSystem.java:428)
	at org.apache.hadoop.mapreduce.JobSubmitter.copyAndConfigureFiles(JobSubmitter.java:166)
	at org.apache.hadoop.mapreduce.JobSubmitter.copyAndConfigureFiles(JobSubmitter.java:283)
	at org.apache.hadoop.mapreduce.JobSubmitter.submitJobInternal(JobSubmitter.java:350)
	at org.apache.hadoop.mapreduce.Job$2.run(Job.java:1037)
	at org.apache.hadoop.mapreduce.Job$2.run(Job.java:1034)
	at java.security.AccessController.doPrivileged(Native Method)
	at javax.security.auth.Subject.doAs(Subject.java:396)
	at org.apache.hadoop.security.UserGroupInformation.doAs(UserGroupInformation.java:1142)
	at org.apache.hadoop.mapreduce.Job.submit(Job.java:1034)
	at org.apache.hadoop.mapreduce.Job.waitForCompletion(Job.java:1054)
	at org.apache.hadoop.mapreduce.lib.join.TestJoinDatamerge.joinAs(TestJoinDatamerge.java:267)
	at org.apache.hadoop.mapreduce.lib.join.TestJoinDatamerge.__CLR3_0_2abzcwof4g(TestJoinDatamerge.java:280)
	at org.apache.hadoop.mapreduce.lib.join.TestJoinDatamerge.testSimpleOuterJoin(TestJoinDatamerge.java:279)
	at junit.extensions.TestDecorator.basicRun(TestDecorator.java:24)
	at junit.extensions.TestSetup$1.protect(TestSetup.java:23)
	at junit.extensions.TestSetup.run(TestSetup.java:27)


REGRESSION:  org.apache.hadoop.mapreduce.lib.join.TestJoinDatamerge.testSimpleOverride

Error Message:
chmod: cannot access `/tmp/hadoop-hudson/mapred/staging/hudson1391343215/.staging/job_local_0003': No such file or directory 

Stack Trace:
org.apache.hadoop.util.Shell$ExitCodeException: chmod: cannot access `/tmp/hadoop-hudson/mapred/staging/hudson1391343215/.staging/job_local_0003': No such file or directory

	at org.apache.hadoop.util.Shell.runCommand(Shell.java:261)
	at org.apache.hadoop.util.Shell.run(Shell.java:188)
	at org.apache.hadoop.util.Shell$ShellCommandExecutor.execute(Shell.java:381)
	at org.apache.hadoop.util.Shell.execCommand(Shell.java:467)
	at org.apache.hadoop.util.Shell.execCommand(Shell.java:450)
	at org.apache.hadoop.fs.RawLocalFileSystem.execCommand(RawLocalFileSystem.java:549)
	at org.apache.hadoop.fs.RawLocalFileSystem.setPermission(RawLocalFileSystem.java:540)
	at org.apache.hadoop.fs.FilterFileSystem.setPermission(FilterFileSystem.java:353)
	at org.apache.hadoop.fs.FileSystem.mkdirs(FileSystem.java:428)
	at org.apache.hadoop.mapreduce.JobSubmitter.copyAndConfigureFiles(JobSubmitter.java:166)
	at org.apache.hadoop.mapreduce.JobSubmitter.copyAndConfigureFiles(JobSubmitter.java:283)
	at org.apache.hadoop.mapreduce.JobSubmitter.submitJobInternal(JobSubmitter.java:350)
	at org.apache.hadoop.mapreduce.Job$2.run(Job.java:1037)
	at org.apache.hadoop.mapreduce.Job$2.run(Job.java:1034)
	at java.security.AccessController.doPrivileged(Native Method)
	at javax.security.auth.Subject.doAs(Subject.java:396)
	at org.apache.hadoop.security.UserGroupInformation.doAs(UserGroupInformation.java:1142)
	at org.apache.hadoop.mapreduce.Job.submit(Job.java:1034)
	at org.apache.hadoop.mapreduce.Job.waitForCompletion(Job.java:1054)
	at org.apache.hadoop.mapreduce.lib.join.TestJoinDatamerge.joinAs(TestJoinDatamerge.java:267)
	at org.apache.hadoop.mapreduce.lib.join.TestJoinDatamerge.__CLR3_0_2a19allf5f(TestJoinDatamerge.java:327)
	at org.apache.hadoop.mapreduce.lib.join.TestJoinDatamerge.testSimpleOverride(TestJoinDatamerge.java:326)
	at junit.extensions.TestDecorator.basicRun(TestDecorator.java:24)
	at junit.extensions.TestSetup$1.protect(TestSetup.java:23)
	at junit.extensions.TestSetup.run(TestSetup.java:27)


REGRESSION:  org.apache.hadoop.mapreduce.lib.join.TestJoinDatamerge.testNestedJoin

Error Message:
chmod: cannot access `/tmp/hadoop-hudson/mapred/staging/hudson839135346/.staging/job_local_0004': No such file or directory 

Stack Trace:
org.apache.hadoop.util.Shell$ExitCodeException: chmod: cannot access `/tmp/hadoop-hudson/mapred/staging/hudson839135346/.staging/job_local_0004': No such file or directory

	at org.apache.hadoop.util.Shell.runCommand(Shell.java:261)
	at org.apache.hadoop.util.Shell.run(Shell.java:188)
	at org.apache.hadoop.util.Shell$ShellCommandExecutor.execute(Shell.java:381)
	at org.apache.hadoop.util.Shell.execCommand(Shell.java:467)
	at org.apache.hadoop.util.Shell.execCommand(Shell.java:450)
	at org.apache.hadoop.fs.RawLocalFileSystem.execCommand(RawLocalFileSystem.java:549)
	at org.apache.hadoop.fs.RawLocalFileSystem.setPermission(RawLocalFileSystem.java:540)
	at org.apache.hadoop.fs.FilterFileSystem.setPermission(FilterFileSystem.java:353)
	at org.apache.hadoop.fs.FileSystem.mkdirs(FileSystem.java:428)
	at org.apache.hadoop.mapreduce.JobSubmitter.copyAndConfigureFiles(JobSubmitter.java:166)
	at org.apache.hadoop.mapreduce.JobSubmitter.copyAndConfigureFiles(JobSubmitter.java:283)
	at org.apache.hadoop.mapreduce.JobSubmitter.submitJobInternal(JobSubmitter.java:350)
	at org.apache.hadoop.mapreduce.Job$2.run(Job.java:1037)
	at org.apache.hadoop.mapreduce.Job$2.run(Job.java:1034)
	at java.security.AccessController.doPrivileged(Native Method)
	at javax.security.auth.Subject.doAs(Subject.java:396)
	at org.apache.hadoop.security.UserGroupInformation.doAs(UserGroupInformation.java:1142)
	at org.apache.hadoop.mapreduce.Job.submit(Job.java:1034)
	at org.apache.hadoop.mapreduce.Job.waitForCompletion(Job.java:1054)
	at org.apache.hadoop.mapreduce.lib.join.TestJoinDatamerge.__CLR3_0_2fidujef5h(TestJoinDatamerge.java:390)
	at org.apache.hadoop.mapreduce.lib.join.TestJoinDatamerge.testNestedJoin(TestJoinDatamerge.java:330)
	at junit.extensions.TestDecorator.basicRun(TestDecorator.java:24)
	at junit.extensions.TestSetup$1.protect(TestSetup.java:23)
	at junit.extensions.TestSetup.run(TestSetup.java:27)


REGRESSION:  org.apache.hadoop.mapreduce.lib.join.TestJoinDatamerge.testEmptyJoin

Error Message:
chmod: cannot access `/tmp/hadoop-hudson/mapred/staging/hudson-2046158247/.staging/job_local_0005': No such file or directory 

Stack Trace:
org.apache.hadoop.util.Shell$ExitCodeException: chmod: cannot access `/tmp/hadoop-hudson/mapred/staging/hudson-2046158247/.staging/job_local_0005': No such file or directory

	at org.apache.hadoop.util.Shell.runCommand(Shell.java:261)
	at org.apache.hadoop.util.Shell.run(Shell.java:188)
	at org.apache.hadoop.util.Shell$ShellCommandExecutor.execute(Shell.java:381)
	at org.apache.hadoop.util.Shell.execCommand(Shell.java:467)
	at org.apache.hadoop.util.Shell.execCommand(Shell.java:450)
	at org.apache.hadoop.fs.RawLocalFileSystem.execCommand(RawLocalFileSystem.java:549)
	at org.apache.hadoop.fs.RawLocalFileSystem.setPermission(RawLocalFileSystem.java:540)
	at org.apache.hadoop.fs.FilterFileSystem.setPermission(FilterFileSystem.java:353)
	at org.apache.hadoop.fs.FileSystem.mkdirs(FileSystem.java:428)
	at org.apache.hadoop.mapreduce.JobSubmitter.copyAndConfigureFiles(JobSubmitter.java:166)
	at org.apache.hadoop.mapreduce.JobSubmitter.copyAndConfigureFiles(JobSubmitter.java:283)
	at org.apache.hadoop.mapreduce.JobSubmitter.submitJobInternal(JobSubmitter.java:350)
	at org.apache.hadoop.mapreduce.Job$2.run(Job.java:1037)
	at org.apache.hadoop.mapreduce.Job$2.run(Job.java:1034)
	at java.security.AccessController.doPrivileged(Native Method)
	at javax.security.auth.Subject.doAs(Subject.java:396)
	at org.apache.hadoop.security.UserGroupInformation.doAs(UserGroupInformation.java:1142)
	at org.apache.hadoop.mapreduce.Job.submit(Job.java:1034)
	at org.apache.hadoop.mapreduce.Job.waitForCompletion(Job.java:1054)
	at org.apache.hadoop.mapreduce.lib.join.TestJoinDatamerge.__CLR3_0_2f6b0b0f83(TestJoinDatamerge.java:442)
	at org.apache.hadoop.mapreduce.lib.join.TestJoinDatamerge.testEmptyJoin(TestJoinDatamerge.java:425)
	at junit.extensions.TestDecorator.basicRun(TestDecorator.java:24)
	at junit.extensions.TestSetup$1.protect(TestSetup.java:23)
	at junit.extensions.TestSetup.run(TestSetup.java:27)


REGRESSION:  org.apache.hadoop.mapreduce.lib.map.TestMultithreadedMapper.testOKRun

Error Message:
chmod: cannot access `/tmp/hadoop-hudson/mapred/staging/hudson-1226393172/.staging/job_local_0001': No such file or directory 

Stack Trace:
org.apache.hadoop.util.Shell$ExitCodeException: chmod: cannot access `/tmp/hadoop-hudson/mapred/staging/hudson-1226393172/.staging/job_local_0001': No such file or directory

	at org.apache.hadoop.util.Shell.runCommand(Shell.java:261)
	at org.apache.hadoop.util.Shell.run(Shell.java:188)
	at org.apache.hadoop.util.Shell$ShellCommandExecutor.execute(Shell.java:381)
	at org.apache.hadoop.util.Shell.execCommand(Shell.java:467)
	at org.apache.hadoop.util.Shell.execCommand(Shell.java:450)
	at org.apache.hadoop.fs.RawLocalFileSystem.execCommand(RawLocalFileSystem.java:549)
	at org.apache.hadoop.fs.RawLocalFileSystem.setPermission(RawLocalFileSystem.java:540)
	at org.apache.hadoop.fs.FilterFileSystem.setPermission(FilterFileSystem.java:353)
	at org.apache.hadoop.fs.FileSystem.mkdirs(FileSystem.java:428)
	at org.apache.hadoop.mapreduce.JobSubmitter.copyAndConfigureFiles(JobSubmitter.java:166)
	at org.apache.hadoop.mapreduce.JobSubmitter.copyAndConfigureFiles(JobSubmitter.java:283)
	at org.apache.hadoop.mapreduce.JobSubmitter.submitJobInternal(JobSubmitter.java:350)
	at org.apache.hadoop.mapreduce.Job$2.run(Job.java:1037)
	at org.apache.hadoop.mapreduce.Job$2.run(Job.java:1034)
	at java.security.AccessController.doPrivileged(Native Method)
	at javax.security.auth.Subject.doAs(Subject.java:396)
	at org.apache.hadoop.security.UserGroupInformation.doAs(UserGroupInformation.java:1142)
	at org.apache.hadoop.mapreduce.Job.submit(Job.java:1034)
	at org.apache.hadoop.mapreduce.Job.waitForCompletion(Job.java:1054)
	at org.apache.hadoop.mapreduce.lib.map.TestMultithreadedMapper.run(TestMultithreadedMapper.java:69)
	at org.apache.hadoop.mapreduce.lib.map.TestMultithreadedMapper.__CLR3_0_2dhspycp6e(TestMultithreadedMapper.java:37)
	at org.apache.hadoop.mapreduce.lib.map.TestMultithreadedMapper.testOKRun(TestMultithreadedMapper.java:36)


REGRESSION:  org.apache.hadoop.mapreduce.lib.map.TestMultithreadedMapper.testIOExRun

Error Message:
chmod: cannot access `/tmp/hadoop-hudson/mapred/staging/hudson-96361713/.staging/job_local_0002': No such file or directory 

Stack Trace:
org.apache.hadoop.util.Shell$ExitCodeException: chmod: cannot access `/tmp/hadoop-hudson/mapred/staging/hudson-96361713/.staging/job_local_0002': No such file or directory

	at org.apache.hadoop.util.Shell.runCommand(Shell.java:261)
	at org.apache.hadoop.util.Shell.run(Shell.java:188)
	at org.apache.hadoop.util.Shell$ShellCommandExecutor.execute(Shell.java:381)
	at org.apache.hadoop.util.Shell.execCommand(Shell.java:467)
	at org.apache.hadoop.util.Shell.execCommand(Shell.java:450)
	at org.apache.hadoop.fs.RawLocalFileSystem.execCommand(RawLocalFileSystem.java:549)
	at org.apache.hadoop.fs.RawLocalFileSystem.setPermission(RawLocalFileSystem.java:540)
	at org.apache.hadoop.fs.FilterFileSystem.setPermission(FilterFileSystem.java:353)
	at org.apache.hadoop.fs.FileSystem.mkdirs(FileSystem.java:428)
	at org.apache.hadoop.mapreduce.JobSubmitter.copyAndConfigureFiles(JobSubmitter.java:166)
	at org.apache.hadoop.mapreduce.JobSubmitter.copyAndConfigureFiles(JobSubmitter.java:283)
	at org.apache.hadoop.mapreduce.JobSubmitter.submitJobInternal(JobSubmitter.java:350)
	at org.apache.hadoop.mapreduce.Job$2.run(Job.java:1037)
	at org.apache.hadoop.mapreduce.Job$2.run(Job.java:1034)
	at java.security.AccessController.doPrivileged(Native Method)
	at javax.security.auth.Subject.doAs(Subject.java:396)
	at org.apache.hadoop.security.UserGroupInformation.doAs(UserGroupInformation.java:1142)
	at org.apache.hadoop.mapreduce.Job.submit(Job.java:1034)
	at org.apache.hadoop.mapreduce.Job.waitForCompletion(Job.java:1054)
	at org.apache.hadoop.mapreduce.lib.map.TestMultithreadedMapper.run(TestMultithreadedMapper.java:69)
	at org.apache.hadoop.mapreduce.lib.map.TestMultithreadedMapper.__CLR3_0_21nnwsnp6g(TestMultithreadedMapper.java:41)
	at org.apache.hadoop.mapreduce.lib.map.TestMultithreadedMapper.testIOExRun(TestMultithreadedMapper.java:40)


REGRESSION:  org.apache.hadoop.mapreduce.lib.map.TestMultithreadedMapper.testRuntimeExRun

Error Message:
chmod: cannot access `/tmp/hadoop-hudson/mapred/staging/hudson-380021140/.staging/job_local_0003': No such file or directory 

Stack Trace:
org.apache.hadoop.util.Shell$ExitCodeException: chmod: cannot access `/tmp/hadoop-hudson/mapred/staging/hudson-380021140/.staging/job_local_0003': No such file or directory

	at org.apache.hadoop.util.Shell.runCommand(Shell.java:261)
	at org.apache.hadoop.util.Shell.run(Shell.java:188)
	at org.apache.hadoop.util.Shell$ShellCommandExecutor.execute(Shell.java:381)
	at org.apache.hadoop.util.Shell.execCommand(Shell.java:467)
	at org.apache.hadoop.util.Shell.execCommand(Shell.java:450)
	at org.apache.hadoop.fs.RawLocalFileSystem.execCommand(RawLocalFileSystem.java:549)
	at org.apache.hadoop.fs.RawLocalFileSystem.setPermission(RawLocalFileSystem.java:540)
	at org.apache.hadoop.fs.FilterFileSystem.setPermission(FilterFileSystem.java:353)
	at org.apache.hadoop.fs.FileSystem.mkdirs(FileSystem.java:428)
	at org.apache.hadoop.mapreduce.JobSubmitter.copyAndConfigureFiles(JobSubmitter.java:166)
	at org.apache.hadoop.mapreduce.JobSubmitter.copyAndConfigureFiles(JobSubmitter.java:283)
	at org.apache.hadoop.mapreduce.JobSubmitter.submitJobInternal(JobSubmitter.java:350)
	at org.apache.hadoop.mapreduce.Job$2.run(Job.java:1037)
	at org.apache.hadoop.mapreduce.Job$2.run(Job.java:1034)
	at java.security.AccessController.doPrivileged(Native Method)
	at javax.security.auth.Subject.doAs(Subject.java:396)
	at org.apache.hadoop.security.UserGroupInformation.doAs(UserGroupInformation.java:1142)
	at org.apache.hadoop.mapreduce.Job.submit(Job.java:1034)
	at org.apache.hadoop.mapreduce.Job.waitForCompletion(Job.java:1054)
	at org.apache.hadoop.mapreduce.lib.map.TestMultithreadedMapper.run(TestMultithreadedMapper.java:69)
	at org.apache.hadoop.mapreduce.lib.map.TestMultithreadedMapper.__CLR3_0_2zf5zzbp6i(TestMultithreadedMapper.java:44)
	at org.apache.hadoop.mapreduce.lib.map.TestMultithreadedMapper.testRuntimeExRun(TestMultithreadedMapper.java:43)


REGRESSION:  org.apache.hadoop.mapreduce.lib.output.TestMRMultipleOutputs.testWithoutCounters

Error Message:
chmod: cannot access `/tmp/hadoop-hudson/mapred/staging/hudson219715039/.staging/job_local_0001': No such file or directory 

Stack Trace:
org.apache.hadoop.util.Shell$ExitCodeException: chmod: cannot access `/tmp/hadoop-hudson/mapred/staging/hudson219715039/.staging/job_local_0001': No such file or directory

	at org.apache.hadoop.util.Shell.runCommand(Shell.java:261)
	at org.apache.hadoop.util.Shell.run(Shell.java:188)
	at org.apache.hadoop.util.Shell$ShellCommandExecutor.execute(Shell.java:381)
	at org.apache.hadoop.util.Shell.execCommand(Shell.java:467)
	at org.apache.hadoop.util.Shell.execCommand(Shell.java:450)
	at org.apache.hadoop.fs.RawLocalFileSystem.execCommand(RawLocalFileSystem.java:549)
	at org.apache.hadoop.fs.RawLocalFileSystem.setPermission(RawLocalFileSystem.java:540)
	at org.apache.hadoop.fs.FilterFileSystem.setPermission(FilterFileSystem.java:353)
	at org.apache.hadoop.fs.FileSystem.mkdirs(FileSystem.java:428)
	at org.apache.hadoop.mapreduce.JobSubmitter.copyAndConfigureFiles(JobSubmitter.java:166)
	at org.apache.hadoop.mapreduce.JobSubmitter.copyAndConfigureFiles(JobSubmitter.java:283)
	at org.apache.hadoop.mapreduce.JobSubmitter.submitJobInternal(JobSubmitter.java:350)
	at org.apache.hadoop.mapreduce.Job$2.run(Job.java:1037)
	at org.apache.hadoop.mapreduce.Job$2.run(Job.java:1034)
	at java.security.AccessController.doPrivileged(Native Method)
	at javax.security.auth.Subject.doAs(Subject.java:396)
	at org.apache.hadoop.security.UserGroupInformation.doAs(UserGroupInformation.java:1142)
	at org.apache.hadoop.mapreduce.Job.submit(Job.java:1034)
	at org.apache.hadoop.mapreduce.Job.waitForCompletion(Job.java:1054)
	at org.apache.hadoop.mapreduce.lib.output.TestMRMultipleOutputs._testMultipleOutputs(TestMRMultipleOutputs.java:169)
	at org.apache.hadoop.mapreduce.lib.output.TestMRMultipleOutputs.__CLR3_0_27rxkdondp(TestMRMultipleOutputs.java:43)
	at org.apache.hadoop.mapreduce.lib.output.TestMRMultipleOutputs.testWithoutCounters(TestMRMultipleOutputs.java:42)


REGRESSION:  org.apache.hadoop.mapreduce.lib.output.TestMRMultipleOutputs.testWithCounters

Error Message:
chmod: cannot access `/tmp/hadoop-hudson/mapred/staging/hudson-1779742073/.staging/job_local_0002': No such file or directory 

Stack Trace:
org.apache.hadoop.util.Shell$ExitCodeException: chmod: cannot access `/tmp/hadoop-hudson/mapred/staging/hudson-1779742073/.staging/job_local_0002': No such file or directory

	at org.apache.hadoop.util.Shell.runCommand(Shell.java:261)
	at org.apache.hadoop.util.Shell.run(Shell.java:188)
	at org.apache.hadoop.util.Shell$ShellCommandExecutor.execute(Shell.java:381)
	at org.apache.hadoop.util.Shell.execCommand(Shell.java:467)
	at org.apache.hadoop.util.Shell.execCommand(Shell.java:450)
	at org.apache.hadoop.fs.RawLocalFileSystem.execCommand(RawLocalFileSystem.java:549)
	at org.apache.hadoop.fs.RawLocalFileSystem.setPermission(RawLocalFileSystem.java:540)
	at org.apache.hadoop.fs.FilterFileSystem.setPermission(FilterFileSystem.java:353)
	at org.apache.hadoop.fs.FileSystem.mkdirs(FileSystem.java:428)
	at org.apache.hadoop.mapreduce.JobSubmitter.copyAndConfigureFiles(JobSubmitter.java:166)
	at org.apache.hadoop.mapreduce.JobSubmitter.copyAndConfigureFiles(JobSubmitter.java:283)
	at org.apache.hadoop.mapreduce.JobSubmitter.submitJobInternal(JobSubmitter.java:350)
	at org.apache.hadoop.mapreduce.Job$2.run(Job.java:1037)
	at org.apache.hadoop.mapreduce.Job$2.run(Job.java:1034)
	at java.security.AccessController.doPrivileged(Native Method)
	at javax.security.auth.Subject.doAs(Subject.java:396)
	at org.apache.hadoop.security.UserGroupInformation.doAs(UserGroupInformation.java:1142)
	at org.apache.hadoop.mapreduce.Job.submit(Job.java:1034)
	at org.apache.hadoop.mapreduce.Job.waitForCompletion(Job.java:1054)
	at org.apache.hadoop.mapreduce.lib.output.TestMRMultipleOutputs._testMultipleOutputs(TestMRMultipleOutputs.java:169)
	at org.apache.hadoop.mapreduce.lib.output.TestMRMultipleOutputs.__CLR3_0_2435lo6nds(TestMRMultipleOutputs.java:48)
	at org.apache.hadoop.mapreduce.lib.output.TestMRMultipleOutputs.testWithCounters(TestMRMultipleOutputs.java:47)


REGRESSION:  org.apache.hadoop.mapreduce.lib.partition.TestMRKeyFieldBasedComparator.testBasicUnixComparator

Error Message:
chmod: cannot access `/tmp/hadoop-hudson/mapred/staging/hudson2092546221/.staging/job_local_0001': No such file or directory 

Stack Trace:
org.apache.hadoop.util.Shell$ExitCodeException: chmod: cannot access `/tmp/hadoop-hudson/mapred/staging/hudson2092546221/.staging/job_local_0001': No such file or directory

	at org.apache.hadoop.util.Shell.runCommand(Shell.java:261)
	at org.apache.hadoop.util.Shell.run(Shell.java:188)
	at org.apache.hadoop.util.Shell$ShellCommandExecutor.execute(Shell.java:381)
	at org.apache.hadoop.util.Shell.execCommand(Shell.java:467)
	at org.apache.hadoop.util.Shell.execCommand(Shell.java:450)
	at org.apache.hadoop.fs.RawLocalFileSystem.execCommand(RawLocalFileSystem.java:549)
	at org.apache.hadoop.fs.RawLocalFileSystem.setPermission(RawLocalFileSystem.java:540)
	at org.apache.hadoop.fs.FilterFileSystem.setPermission(FilterFileSystem.java:353)
	at org.apache.hadoop.fs.FileSystem.mkdirs(FileSystem.java:428)
	at org.apache.hadoop.mapreduce.JobSubmitter.copyAndConfigureFiles(JobSubmitter.java:166)
	at org.apache.hadoop.mapreduce.JobSubmitter.copyAndConfigureFiles(JobSubmitter.java:283)
	at org.apache.hadoop.mapreduce.JobSubmitter.submitJobInternal(JobSubmitter.java:350)
	at org.apache.hadoop.mapreduce.Job$2.run(Job.java:1037)
	at org.apache.hadoop.mapreduce.Job$2.run(Job.java:1034)
	at java.security.AccessController.doPrivileged(Native Method)
	at javax.security.auth.Subject.doAs(Subject.java:396)
	at org.apache.hadoop.security.UserGroupInformation.doAs(UserGroupInformation.java:1142)
	at org.apache.hadoop.mapreduce.Job.submit(Job.java:1034)
	at org.apache.hadoop.mapreduce.Job.waitForCompletion(Job.java:1054)
	at org.apache.hadoop.mapreduce.lib.partition.TestMRKeyFieldBasedComparator.testComparator(TestMRKeyFieldBasedComparator.java:68)
	at org.apache.hadoop.mapreduce.lib.partition.TestMRKeyFieldBasedComparator.__CLR3_0_2efq8inc0g(TestMRKeyFieldBasedComparator.java:98)
	at org.apache.hadoop.mapreduce.lib.partition.TestMRKeyFieldBasedComparator.testBasicUnixComparator(TestMRKeyFieldBasedComparator.java:97)


REGRESSION:  org.apache.hadoop.record.TestRecordMR.testMapred

Error Message:
chmod: cannot access `/tmp/hadoop-hudson/mapred/staging/hudson335781123/.staging/job_local_0001': No such file or directory 

Stack Trace:
org.apache.hadoop.util.Shell$ExitCodeException: chmod: cannot access `/tmp/hadoop-hudson/mapred/staging/hudson335781123/.staging/job_local_0001': No such file or directory

	at org.apache.hadoop.util.Shell.runCommand(Shell.java:261)
	at org.apache.hadoop.util.Shell.run(Shell.java:188)
	at org.apache.hadoop.util.Shell$ShellCommandExecutor.execute(Shell.java:381)
	at org.apache.hadoop.util.Shell.execCommand(Shell.java:467)
	at org.apache.hadoop.util.Shell.execCommand(Shell.java:450)
	at org.apache.hadoop.fs.RawLocalFileSystem.execCommand(RawLocalFileSystem.java:549)
	at org.apache.hadoop.fs.RawLocalFileSystem.setPermission(RawLocalFileSystem.java:540)
	at org.apache.hadoop.fs.FilterFileSystem.setPermission(FilterFileSystem.java:353)
	at org.apache.hadoop.fs.FileSystem.mkdirs(FileSystem.java:428)
	at org.apache.hadoop.mapreduce.JobSubmitter.copyAndConfigureFiles(JobSubmitter.java:166)
	at org.apache.hadoop.mapreduce.JobSubmitter.copyAndConfigureFiles(JobSubmitter.java:283)
	at org.apache.hadoop.mapreduce.JobSubmitter.submitJobInternal(JobSubmitter.java:350)
	at org.apache.hadoop.mapreduce.Job$2.run(Job.java:1037)
	at org.apache.hadoop.mapreduce.Job$2.run(Job.java:1034)
	at java.security.AccessController.doPrivileged(Native Method)
	at javax.security.auth.Subject.doAs(Subject.java:396)
	at org.apache.hadoop.security.UserGroupInformation.doAs(UserGroupInformation.java:1142)
	at org.apache.hadoop.mapreduce.Job.submit(Job.java:1034)
	at org.apache.hadoop.mapred.JobClient.submitJob(JobClient.java:536)
	at org.apache.hadoop.mapred.JobClient.runJob(JobClient.java:781)
	at org.apache.hadoop.record.TestRecordMR.launch(TestRecordMR.java:322)
	at org.apache.hadoop.record.TestRecordMR.__CLR3_0_2vmf1hqbvc(TestRecordMR.java:237)
	at org.apache.hadoop.record.TestRecordMR.testMapred(TestRecordMR.java:236)


REGRESSION:  org.apache.hadoop.tools.TestCopyFiles.testCopyFromLocalToLocal

Error Message:
File /grid/0/hudson/hudson-slave/workspace/Hadoop-Mapreduce-trunk/trunk/build/test/data/destdat/eight/six/6517720089296614946 does not exist.

Stack Trace:
java.io.FileNotFoundException: File /grid/0/hudson/hudson-slave/workspace/Hadoop-Mapreduce-trunk/trunk/build/test/data/destdat/eight/six/6517720089296614946 does not exist.
	at org.apache.hadoop.fs.RawLocalFileSystem.getFileStatus(RawLocalFileSystem.java:424)
	at org.apache.hadoop.fs.FilterFileSystem.getFileStatus(FilterFileSystem.java:311)
	at org.apache.hadoop.tools.TestCopyFiles.checkFiles(TestCopyFiles.java:169)
	at org.apache.hadoop.tools.TestCopyFiles.checkFiles(TestCopyFiles.java:159)
	at org.apache.hadoop.tools.TestCopyFiles.__CLR3_0_2qikfc3w5p(TestCopyFiles.java:271)
	at org.apache.hadoop.tools.TestCopyFiles.testCopyFromLocalToLocal(TestCopyFiles.java:264)


REGRESSION:  org.apache.hadoop.tools.TestCopyFiles.testCopyFromDfsToDfs

Error Message:
File does not exist: /destdat/four/6879907165672285160

Stack Trace:
java.io.FileNotFoundException: File does not exist: /destdat/four/6879907165672285160
	at org.apache.hadoop.hdfs.DistributedFileSystem.getFileStatus(DistributedFileSystem.java:745)
	at org.apache.hadoop.tools.TestCopyFiles.checkFiles(TestCopyFiles.java:169)
	at org.apache.hadoop.tools.TestCopyFiles.checkFiles(TestCopyFiles.java:159)
	at org.apache.hadoop.tools.TestCopyFiles.__CLR3_0_2e6yof1w5x(TestCopyFiles.java:293)
	at org.apache.hadoop.tools.TestCopyFiles.testCopyFromDfsToDfs(TestCopyFiles.java:278)


REGRESSION:  org.apache.hadoop.tools.TestCopyFiles.testEmptyDir

Error Message:
Destination directory does not exist.

Stack Trace:
junit.framework.AssertionFailedError: Destination directory does not exist.
	at org.apache.hadoop.tools.TestCopyFiles.__CLR3_0_2v5ob47w6k(TestCopyFiles.java:327)
	at org.apache.hadoop.tools.TestCopyFiles.testEmptyDir(TestCopyFiles.java:308)


REGRESSION:  org.apache.hadoop.tools.TestCopyFiles.testCopyFromLocalToDfs

Error Message:
File does not exist: /destdat/six/4138156477821002038

Stack Trace:
java.io.FileNotFoundException: File does not exist: /destdat/six/4138156477821002038
	at org.apache.hadoop.hdfs.DistributedFileSystem.getFileStatus(DistributedFileSystem.java:745)
	at org.apache.hadoop.tools.TestCopyFiles.checkFiles(TestCopyFiles.java:169)
	at org.apache.hadoop.tools.TestCopyFiles.checkFiles(TestCopyFiles.java:159)
	at org.apache.hadoop.tools.TestCopyFiles.__CLR3_0_2hl9wyrw77(TestCopyFiles.java:353)
	at org.apache.hadoop.tools.TestCopyFiles.testCopyFromLocalToDfs(TestCopyFiles.java:339)


REGRESSION:  org.apache.hadoop.tools.TestCopyFiles.testCopyFromDfsToLocal

Error Message:
File /grid/0/hudson/hudson-slave/workspace/Hadoop-Mapreduce-trunk/trunk/build/test/data/destdat/five/3739035434375744121 does not exist.

Stack Trace:
java.io.FileNotFoundException: File /grid/0/hudson/hudson-slave/workspace/Hadoop-Mapreduce-trunk/trunk/build/test/data/destdat/five/3739035434375744121 does not exist.
	at org.apache.hadoop.fs.RawLocalFileSystem.getFileStatus(RawLocalFileSystem.java:424)
	at org.apache.hadoop.fs.FilterFileSystem.getFileStatus(FilterFileSystem.java:311)
	at org.apache.hadoop.tools.TestCopyFiles.checkFiles(TestCopyFiles.java:169)
	at org.apache.hadoop.tools.TestCopyFiles.checkFiles(TestCopyFiles.java:159)
	at org.apache.hadoop.tools.TestCopyFiles.__CLR3_0_2o5d2y1w7s(TestCopyFiles.java:382)
	at org.apache.hadoop.tools.TestCopyFiles.testCopyFromDfsToLocal(TestCopyFiles.java:367)


REGRESSION:  org.apache.hadoop.tools.TestCopyFiles.testCopyDfsToDfsUpdateOverwrite

Error Message:
File does not exist: /destdat/four/2779683435443260350

Stack Trace:
java.io.FileNotFoundException: File does not exist: /destdat/four/2779683435443260350
	at org.apache.hadoop.hdfs.DistributedFileSystem.getFileStatus(DistributedFileSystem.java:745)
	at org.apache.hadoop.tools.TestCopyFiles.checkFiles(TestCopyFiles.java:169)
	at org.apache.hadoop.tools.TestCopyFiles.checkFiles(TestCopyFiles.java:159)
	at org.apache.hadoop.tools.TestCopyFiles.__CLR3_0_2ddsv4zw8e(TestCopyFiles.java:410)
	at org.apache.hadoop.tools.TestCopyFiles.testCopyDfsToDfsUpdateOverwrite(TestCopyFiles.java:395)


REGRESSION:  org.apache.hadoop.tools.TestCopyFiles.testCopyDfsToDfsUpdateWithSkipCRC

Error Message:
Dest did not get overwritten without skip crc

Stack Trace:
junit.framework.AssertionFailedError: Dest did not get overwritten without skip crc
	at org.apache.hadoop.tools.TestCopyFiles.__CLR3_0_29z237lw9b(TestCopyFiles.java:517)
	at org.apache.hadoop.tools.TestCopyFiles.testCopyDfsToDfsUpdateWithSkipCRC(TestCopyFiles.java:455)


REGRESSION:  org.apache.hadoop.tools.TestCopyFiles.testCopyDuplication

Error Message:
File /grid/0/hudson/hudson-slave/workspace/Hadoop-Mapreduce-trunk/trunk/build/test/data/src2/srcdat/two/5708455503695996075 does not exist.

Stack Trace:
java.io.FileNotFoundException: File /grid/0/hudson/hudson-slave/workspace/Hadoop-Mapreduce-trunk/trunk/build/test/data/src2/srcdat/two/5708455503695996075 does not exist.
	at org.apache.hadoop.fs.RawLocalFileSystem.getFileStatus(RawLocalFileSystem.java:424)
	at org.apache.hadoop.fs.FilterFileSystem.getFileStatus(FilterFileSystem.java:311)
	at org.apache.hadoop.tools.TestCopyFiles.checkFiles(TestCopyFiles.java:169)
	at org.apache.hadoop.tools.TestCopyFiles.checkFiles(TestCopyFiles.java:159)
	at org.apache.hadoop.tools.TestCopyFiles.__CLR3_0_2px84yawai(TestCopyFiles.java:537)
	at org.apache.hadoop.tools.TestCopyFiles.testCopyDuplication(TestCopyFiles.java:530)


REGRESSION:  org.apache.hadoop.tools.TestCopyFiles.testCopySingleFile

Error Message:
File /grid/0/hudson/hudson-slave/workspace/Hadoop-Mapreduce-trunk/trunk/build/test/data/destdat/6235965641093789377 does not exist.

Stack Trace:
java.io.FileNotFoundException: File /grid/0/hudson/hudson-slave/workspace/Hadoop-Mapreduce-trunk/trunk/build/test/data/destdat/6235965641093789377 does not exist.
	at org.apache.hadoop.fs.RawLocalFileSystem.getFileStatus(RawLocalFileSystem.java:424)
	at org.apache.hadoop.fs.FilterFileSystem.getFileStatus(FilterFileSystem.java:311)
	at org.apache.hadoop.tools.TestCopyFiles.checkFiles(TestCopyFiles.java:169)
	at org.apache.hadoop.tools.TestCopyFiles.checkFiles(TestCopyFiles.java:159)
	at org.apache.hadoop.tools.TestCopyFiles.__CLR3_0_29cq27iwas(TestCopyFiles.java:562)
	at org.apache.hadoop.tools.TestCopyFiles.testCopySingleFile(TestCopyFiles.java:553)


REGRESSION:  org.apache.hadoop.tools.TestCopyFiles.testBasedir

Error Message:
File does not exist: /destdat/middle/srcdat/one/1990516174638317973

Stack Trace:
java.io.FileNotFoundException: File does not exist: /destdat/middle/srcdat/one/1990516174638317973
	at org.apache.hadoop.hdfs.DistributedFileSystem.getFileStatus(DistributedFileSystem.java:745)
	at org.apache.hadoop.tools.TestCopyFiles.checkFiles(TestCopyFiles.java:169)
	at org.apache.hadoop.tools.TestCopyFiles.checkFiles(TestCopyFiles.java:159)
	at org.apache.hadoop.tools.TestCopyFiles.__CLR3_0_2rlzv7zwbl(TestCopyFiles.java:627)
	at org.apache.hadoop.tools.TestCopyFiles.testBasedir(TestCopyFiles.java:612)


REGRESSION:  org.apache.hadoop.tools.TestCopyFiles.testPreserveOption

Error Message:
File does not exist: /destdat/5449012871160086088

Stack Trace:
java.io.FileNotFoundException: File does not exist: /destdat/5449012871160086088
	at org.apache.hadoop.hdfs.DistributedFileSystem.getFileStatus(DistributedFileSystem.java:745)
	at org.apache.hadoop.tools.TestCopyFiles.checkFiles(TestCopyFiles.java:169)
	at org.apache.hadoop.tools.TestCopyFiles.checkFiles(TestCopyFiles.java:159)
	at org.apache.hadoop.tools.TestCopyFiles.__CLR3_0_2p0v3lywc6(TestCopyFiles.java:654)
	at org.apache.hadoop.tools.TestCopyFiles.testPreserveOption(TestCopyFiles.java:638)


REGRESSION:  org.apache.hadoop.tools.TestCopyFiles.testLimits

Error Message:
expected:<10> but was:<0>

Stack Trace:
junit.framework.AssertionFailedError: expected:<10> but was:<0>
	at org.apache.hadoop.tools.TestCopyFiles.__CLR3_0_2gnl1gvwfc(TestCopyFiles.java:816)
	at org.apache.hadoop.tools.TestCopyFiles.testLimits(TestCopyFiles.java:789)


REGRESSION:  org.apache.hadoop.tools.TestCopyFiles.testDelete

Error Message:
null expected:</2[731538512545704384 /2926557284282641116 /5121420892451076656 /6642758236432603391 /760137318625486032 /9200118903646395077 /eight /eight/eight /eight/eight/8481568337786944666 /five /five/five /five/five/1836046930202281295 /four /four/4583587606811084947 /four/7106598102652738217 /nine /nine/four /nine/four/6590655714043279831 /one /one/2096665344412453855 /one/four /one/four/7612691181356140576 /seven /seven/seven /seven/seven/4825548371478264778 /six /six/5904944214398088625 /three /three/nine /three/nine/7097495820367840957 /three/six /three/six/7785618201797558888 /two /two/180847765395836562 /two/three /two/three/3821247372783847758 /zero /zero/six /zero/six/6585095727086812453] > but was:</2[200072852399338811 /2245939554577399863 /2795108605419514325 /482131397889012792 /6493147838031289088 /8114480467381822869 /eight /eight/one /eight/one/4013685042674309262 /four /four/4798938740756891432 /nine /nine/3860687217012122733 /one /one/4208929000889912593 /one/5008076415968839681 /three /three/795432704282428347 /three/940869365480068195 /two /two/3514062183911503914 /two/three /two/three/1778881023198029496 /zero /zero/2254495418237591248 /zero/285010592006749415 /zero/7514194803925087544 /zero/one /zero/one/7627726413962512587 /zero/three /zero/three/6837318382388359191] >

Stack Trace:
junit.framework.ComparisonFailure: null expected:</2[731538512545704384
/2926557284282641116
/5121420892451076656
/6642758236432603391
/760137318625486032
/9200118903646395077
/eight
/eight/eight
/eight/eight/8481568337786944666
/five
/five/five
/five/five/1836046930202281295
/four
/four/4583587606811084947
/four/7106598102652738217
/nine
/nine/four
/nine/four/6590655714043279831
/one
/one/2096665344412453855
/one/four
/one/four/7612691181356140576
/seven
/seven/seven
/seven/seven/4825548371478264778
/six
/six/5904944214398088625
/three
/three/nine
/three/nine/7097495820367840957
/three/six
/three/six/7785618201797558888
/two
/two/180847765395836562
/two/three
/two/three/3821247372783847758
/zero
/zero/six
/zero/six/6585095727086812453]
> but was:</2[200072852399338811
/2245939554577399863
/2795108605419514325
/482131397889012792
/6493147838031289088
/8114480467381822869
/eight
/eight/one
/eight/one/4013685042674309262
/four
/four/4798938740756891432
/nine
/nine/3860687217012122733
/one
/one/4208929000889912593
/one/5008076415968839681
/three
/three/795432704282428347
/three/940869365480068195
/two
/two/3514062183911503914
/two/three
/two/three/1778881023198029496
/zero
/zero/2254495418237591248
/zero/285010592006749415
/zero/7514194803925087544
/zero/one
/zero/one/7627726413962512587
/zero/three
/zero/three/6837318382388359191]
>
	at org.apache.hadoop.tools.TestCopyFiles.__CLR3_0_2yilj0cwij(TestCopyFiles.java:989)
	at org.apache.hadoop.tools.TestCopyFiles.testDelete(TestCopyFiles.java:952)


REGRESSION:  org.apache.hadoop.tools.TestCopyFiles.testDeleteLocal

Error Message:
File /grid/0/hudson/hudson-slave/workspace/Hadoop-Mapreduce-trunk/trunk/build/test/data/destdat/six/8331321036500055049 does not exist.

Stack Trace:
java.io.FileNotFoundException: File /grid/0/hudson/hudson-slave/workspace/Hadoop-Mapreduce-trunk/trunk/build/test/data/destdat/six/8331321036500055049 does not exist.
	at org.apache.hadoop.fs.RawLocalFileSystem.getFileStatus(RawLocalFileSystem.java:424)
	at org.apache.hadoop.fs.FilterFileSystem.getFileStatus(FilterFileSystem.java:311)
	at org.apache.hadoop.tools.TestCopyFiles.checkFiles(TestCopyFiles.java:169)
	at org.apache.hadoop.tools.TestCopyFiles.checkFiles(TestCopyFiles.java:159)
	at org.apache.hadoop.tools.TestCopyFiles.__CLR3_0_2tkhgbvwjn(TestCopyFiles.java:1043)
	at org.apache.hadoop.tools.TestCopyFiles.testDeleteLocal(TestCopyFiles.java:1024)


REGRESSION:  org.apache.hadoop.tools.TestCopyFiles.testGlobbing

Error Message:
File does not exist: /destdat/1966194940017857079

Stack Trace:
java.io.FileNotFoundException: File does not exist: /destdat/1966194940017857079
	at org.apache.hadoop.hdfs.DistributedFileSystem.getFileStatus(DistributedFileSystem.java:745)
	at org.apache.hadoop.tools.TestCopyFiles.checkFiles(TestCopyFiles.java:169)
	at org.apache.hadoop.tools.TestCopyFiles.checkFiles(TestCopyFiles.java:159)
	at org.apache.hadoop.tools.TestCopyFiles.__CLR3_0_23k01ovwkb(TestCopyFiles.java:1072)
	at org.apache.hadoop.tools.TestCopyFiles.testGlobbing(TestCopyFiles.java:1057)




Mime
View raw message