hadoop-mapreduce-dev mailing list archives

Site index · List index
Message view « Date » · « Thread »
Top « Date » · « Thread »
From Apache Hudson Server <hud...@hudson.apache.org>
Subject Hadoop-Mapreduce-trunk - Build # 615 - Still Failing
Date Thu, 10 Mar 2011 18:04:12 GMT
See https://hudson.apache.org/hudson/job/Hadoop-Mapreduce-trunk/615/

###################################################################################
########################## LAST 60 LINES OF THE CONSOLE ###########################
[...truncated 325427 lines...]
    [junit] 11/03/10 18:01:29 INFO datanode.FSDatasetAsyncDiskService: All async disk service
threads have been shut down.
    [junit] 11/03/10 18:01:29 WARN datanode.FSDatasetAsyncDiskService: AsyncDiskService has
already shut down.
    [junit] 11/03/10 18:01:29 INFO hdfs.MiniDFSCluster: Shutting down DataNode 0
    [junit] 11/03/10 18:01:29 INFO ipc.Server: Stopping server on 50832
    [junit] 11/03/10 18:01:29 INFO ipc.Server: IPC Server handler 0 on 50832: exiting
    [junit] 11/03/10 18:01:29 INFO ipc.Server: IPC Server handler 2 on 50832: exiting
    [junit] 11/03/10 18:01:29 INFO ipc.Server: IPC Server handler 1 on 50832: exiting
    [junit] 11/03/10 18:01:29 INFO ipc.Server: Stopping IPC Server Responder
    [junit] 11/03/10 18:01:29 INFO datanode.DataNode: Waiting for threadgroup to exit, active
threads is 1
    [junit] 11/03/10 18:01:29 INFO ipc.Server: Stopping IPC Server listener on 50832
    [junit] 11/03/10 18:01:29 WARN datanode.DataNode: DatanodeRegistration(127.0.0.1:56130,
storageID=DS-426401757-127.0.1.1-56130-1299780088699, infoPort=50339, ipcPort=50832):DataXceiveServer:
java.nio.channels.AsynchronousCloseException
    [junit] 	at java.nio.channels.spi.AbstractInterruptibleChannel.end(AbstractInterruptibleChannel.java:185)
    [junit] 	at sun.nio.ch.ServerSocketChannelImpl.accept(ServerSocketChannelImpl.java:159)
    [junit] 	at sun.nio.ch.ServerSocketAdaptor.accept(ServerSocketAdaptor.java:84)
    [junit] 	at org.apache.hadoop.hdfs.server.datanode.DataXceiverServer.run(DataXceiverServer.java:134)
    [junit] 	at java.lang.Thread.run(Thread.java:662)
    [junit] 
    [junit] 11/03/10 18:01:29 INFO datanode.DataNode: Waiting for threadgroup to exit, active
threads is 0
    [junit] 11/03/10 18:01:29 INFO datanode.DataBlockScanner: Exiting DataBlockScanner thread.
    [junit] 11/03/10 18:01:29 INFO datanode.DataNode: DatanodeRegistration(127.0.0.1:56130,
storageID=DS-426401757-127.0.1.1-56130-1299780088699, infoPort=50339, ipcPort=50832):Finishing
DataNode in: FSDataset{dirpath='/grid/0/hudson/hudson-slave/workspace/Hadoop-Mapreduce-trunk/trunk/build/contrib/raid/test/data/dfs/data/data1/current/finalized,/grid/0/hudson/hudson-slave/workspace/Hadoop-Mapreduce-trunk/trunk/build/contrib/raid/test/data/dfs/data/data2/current/finalized'}
    [junit] 11/03/10 18:01:29 INFO ipc.Server: Stopping server on 50832
    [junit] 11/03/10 18:01:29 INFO datanode.DataNode: Waiting for threadgroup to exit, active
threads is 0
    [junit] 11/03/10 18:01:29 INFO datanode.FSDatasetAsyncDiskService: Shutting down all async
disk service threads...
    [junit] 11/03/10 18:01:29 INFO datanode.FSDatasetAsyncDiskService: All async disk service
threads have been shut down.
    [junit] 11/03/10 18:01:29 WARN datanode.FSDatasetAsyncDiskService: AsyncDiskService has
already shut down.
    [junit] 11/03/10 18:01:29 WARN namenode.FSNamesystem: ReplicationMonitor thread received
InterruptedException.java.lang.InterruptedException: sleep interrupted
    [junit] 11/03/10 18:01:29 WARN namenode.DecommissionManager: Monitor interrupted: java.lang.InterruptedException:
sleep interrupted
    [junit] 11/03/10 18:01:29 INFO namenode.FSEditLog: Number of transactions: 14 Total time
for transactions(ms): 2Number of transactions batched in Syncs: 0 Number of syncs: 7 SyncTimes(ms):
7 6 
    [junit] 11/03/10 18:01:30 INFO ipc.Server: Stopping server on 53823
    [junit] 11/03/10 18:01:30 INFO ipc.Server: IPC Server handler 0 on 53823: exiting
    [junit] 11/03/10 18:01:30 INFO ipc.Server: IPC Server handler 2 on 53823: exiting
    [junit] 11/03/10 18:01:30 INFO ipc.Server: Stopping IPC Server listener on 53823
    [junit] 11/03/10 18:01:30 INFO ipc.Server: IPC Server handler 3 on 53823: exiting
    [junit] 11/03/10 18:01:30 INFO ipc.Server: IPC Server handler 6 on 53823: exiting
    [junit] 11/03/10 18:01:30 INFO ipc.Server: IPC Server handler 8 on 53823: exiting
    [junit] 11/03/10 18:01:30 INFO ipc.Server: IPC Server handler 1 on 53823: exiting
    [junit] 11/03/10 18:01:30 INFO ipc.Server: IPC Server handler 7 on 53823: exiting
    [junit] 11/03/10 18:01:30 INFO ipc.Server: IPC Server handler 9 on 53823: exiting
    [junit] 11/03/10 18:01:30 INFO ipc.Server: IPC Server handler 5 on 53823: exiting
    [junit] 11/03/10 18:01:30 INFO ipc.Server: Stopping IPC Server Responder
    [junit] 11/03/10 18:01:30 INFO ipc.Server: IPC Server handler 4 on 53823: exiting
    [junit] Tests run: 1, Failures: 0, Errors: 0, Time elapsed: 3.62 sec

BUILD FAILED
/grid/0/hudson/hudson-slave/workspace/Hadoop-Mapreduce-trunk/trunk/build.xml:834: The following
error occurred while executing this line:
/grid/0/hudson/hudson-slave/workspace/Hadoop-Mapreduce-trunk/trunk/build.xml:818: The following
error occurred while executing this line:
/grid/0/hudson/hudson-slave/workspace/Hadoop-Mapreduce-trunk/trunk/src/contrib/build.xml:60:
The following error occurred while executing this line:
/grid/0/hudson/hudson-slave/workspace/Hadoop-Mapreduce-trunk/trunk/src/contrib/raid/build.xml:60:
Tests failed!

Total time: 295 minutes 24 seconds
[FINDBUGS] Skipping publisher since build result is FAILURE
Recording fingerprints
Archiving artifacts
Recording test results
Publishing Javadoc
Publishing Clover coverage report...
No Clover report will be published due to a Build Failure
Email was triggered for: Failure
Sending email for trigger: Failure



###################################################################################
############################## FAILED TESTS (if any) ##############################
4 tests failed.
FAILED:  org.apache.hadoop.mapred.TestSimulatorDeterministicReplay.testMain

Error Message:
Timeout occurred. Please note the time in the report does not reflect the time until the timeout.

Stack Trace:
junit.framework.AssertionFailedError: Timeout occurred. Please note the time in the report
does not reflect the time until the timeout.


FAILED:  org.apache.hadoop.mapred.TestSimulatorEndToEnd.testMain

Error Message:
Timeout occurred. Please note the time in the report does not reflect the time until the timeout.

Stack Trace:
junit.framework.AssertionFailedError: Timeout occurred. Please note the time in the report
does not reflect the time until the timeout.


FAILED:  org.apache.hadoop.mapred.TestSimulatorSerialJobSubmission.testMain

Error Message:
Timeout occurred. Please note the time in the report does not reflect the time until the timeout.

Stack Trace:
junit.framework.AssertionFailedError: Timeout occurred. Please note the time in the report
does not reflect the time until the timeout.


FAILED:  org.apache.hadoop.mapred.TestSimulatorStressJobSubmission.testMain

Error Message:
Timeout occurred. Please note the time in the report does not reflect the time until the timeout.

Stack Trace:
junit.framework.AssertionFailedError: Timeout occurred. Please note the time in the report
does not reflect the time until the timeout.




Mime
View raw message