hadoop-mapreduce-dev mailing list archives

Site index · List index
Message view « Date » · « Thread »
Top « Date » · « Thread »
From Apache Hudson Server <hud...@hudson.apache.org>
Subject Hadoop-Mapreduce-trunk-Commit - Build # 622 - Still Failing
Date Fri, 04 Mar 2011 05:05:27 GMT
See https://hudson.apache.org/hudson/job/Hadoop-Mapreduce-trunk-Commit/622/

###################################################################################
########################## LAST 60 LINES OF THE CONSOLE ###########################
[...truncated 4480 lines...]

clean-sign:

sign:

signanddeploy:

simpledeploy:
[artifact:install-provider] Installing provider: org.apache.maven.wagon:wagon-http:jar:1.0-beta-2:runtime
[artifact:install-provider] Downloading: org/apache/maven/wagon/wagon-http/1.0-beta-2/wagon-http-1.0-beta-2.pom
from central
[artifact:install-provider] Downloading: org/apache/maven/wagon/wagon-providers/1.0-beta-2/wagon-providers-1.0-beta-2.pom
from central
[artifact:install-provider] Downloading: org/apache/maven/wagon/wagon/1.0-beta-2/wagon-1.0-beta-2.pom
from central
[artifact:install-provider] Downloading: org/apache/maven/wagon/wagon-http-shared/1.0-beta-2/wagon-http-shared-1.0-beta-2.pom
from central
[artifact:install-provider] Downloading: jtidy/jtidy/4aug2000r7-dev/jtidy-4aug2000r7-dev.pom
from central
[artifact:install-provider] Downloading: org/apache/maven/wagon/wagon-provider-api/1.0-beta-2/wagon-provider-api-1.0-beta-2.pom
from central
[artifact:install-provider] Downloading: commons-logging/commons-logging/1.0.3/commons-logging-1.0.3.pom
from central
[artifact:install-provider] Downloading: commons-httpclient/commons-httpclient/2.0.2/commons-httpclient-2.0.2.pom
from central
[artifact:install-provider] Downloading: org/apache/maven/wagon/wagon-http/1.0-beta-2/wagon-http-1.0-beta-2.jar
from central
[artifact:install-provider] Downloading: org/apache/maven/wagon/wagon-http-shared/1.0-beta-2/wagon-http-shared-1.0-beta-2.jar
from central
[artifact:install-provider] Downloading: jtidy/jtidy/4aug2000r7-dev/jtidy-4aug2000r7-dev.jar
from central
[artifact:install-provider] Downloading: org/apache/maven/wagon/wagon-provider-api/1.0-beta-2/wagon-provider-api-1.0-beta-2.jar
from central
[artifact:install-provider] Downloading: org/codehaus/plexus/plexus-utils/1.0.4/plexus-utils-1.0.4.jar
from central
[artifact:install-provider] Downloading: commons-logging/commons-logging/1.0.3/commons-logging-1.0.3.jar
from central
[artifact:install-provider] Downloading: commons-httpclient/commons-httpclient/2.0.2/commons-httpclient-2.0.2.jar
from central
[artifact:deploy] Deploying to https://repository.apache.org/content/repositories/snapshots
[artifact:deploy] [INFO] Retrieving previous build number from apache.snapshots.https
[artifact:deploy] Uploading: org/apache/hadoop/hadoop-mapred/0.23.0-SNAPSHOT/hadoop-mapred-0.23.0-20110304.050524-60.jar
to apache.snapshots.https
[artifact:deploy] Uploaded 1741K
[artifact:deploy] An error has occurred while processing the Maven artifact tasks.
[artifact:deploy]  Diagnosis:
[artifact:deploy] 
[artifact:deploy] Error deploying artifact 'org.apache.hadoop:hadoop-mapred:jar': Error deploying
artifact: Failed to transfer file: https://repository.apache.org/content/repositories/snapshots/org/apache/hadoop/hadoop-mapred/0.23.0-SNAPSHOT/hadoop-mapred-0.23.0-20110304.050524-60.jar.
Return code is: 401

BUILD FAILED
/grid/0/hudson/hudson-slave/workspace/Hadoop-Mapreduce-trunk-Commit/trunk/build.xml:1528:
Error deploying artifact 'org.apache.hadoop:hadoop-mapred:jar': Error deploying artifact:
Failed to transfer file: https://repository.apache.org/content/repositories/snapshots/org/apache/hadoop/hadoop-mapred/0.23.0-SNAPSHOT/hadoop-mapred-0.23.0-20110304.050524-60.jar.
Return code is: 401

Total time: 3 minutes 29 seconds


======================================================================
======================================================================
STORE: saving artifacts
======================================================================
======================================================================


mv: cannot stat `build/*.tar.gz': No such file or directory
mv: cannot stat `build/test/findbugs': No such file or directory
mv: cannot stat `build/docs/api': No such file or directory
Build Failed
[FINDBUGS] Skipping publisher since build result is FAILURE
Recording fingerprints
Archiving artifacts
Recording test results
Publishing Javadoc
Publishing Clover coverage report...
No Clover report will be published due to a Build Failure
Email was triggered for: Failure
Sending email for trigger: Failure



###################################################################################
############################## FAILED TESTS (if any) ##############################
No tests ran.

Mime
View raw message