hadoop-mapreduce-dev mailing list archives

Site index · List index
Message view « Date » · « Thread »
Top « Date » · « Thread »
From Apache Hudson Server <hud...@hudson.apache.org>
Subject Hadoop-Mapreduce-trunk - Build # 586 - Still Failing
Date Sun, 06 Feb 2011 16:35:08 GMT
See https://hudson.apache.org/hudson/job/Hadoop-Mapreduce-trunk/586/

###################################################################################
########################## LAST 60 LINES OF THE CONSOLE ###########################
[...truncated 228582 lines...]
    [javac]     assertFalse(new Pair<Integer, Integer>(
    [javac]     ^
    [javac] /grid/0/hudson/hudson-slave/workspace/Hadoop-Mapreduce-trunk/trunk/src/contrib/mrunit/src/test/org/apache/hadoop/mrunit/types/TestPair.java:54:
cannot find symbol
    [javac] symbol  : method assertFalse(boolean)
    [javac] location: class org.apache.hadoop.mrunit.types.TestPair
    [javac]     assertFalse(new Pair<Integer, Integer>(
    [javac]     ^
    [javac] /grid/0/hudson/hudson-slave/workspace/Hadoop-Mapreduce-trunk/trunk/src/contrib/mrunit/src/test/org/apache/hadoop/mrunit/types/TestPair.java:74:
cannot find symbol
    [javac] symbol  : method assertFalse(boolean)
    [javac] location: class org.apache.hadoop.mrunit.types.TestPair
    [javac]     assertFalse(new Pair<Integer, Integer>(null, null)
    [javac]     ^
    [javac] /grid/0/hudson/hudson-slave/workspace/Hadoop-Mapreduce-trunk/trunk/src/contrib/mrunit/src/test/org/apache/hadoop/mrunit/types/TestPair.java:80:
cannot find symbol
    [javac] symbol  : method assertFalse(boolean)
    [javac] location: class org.apache.hadoop.mrunit.types.TestPair
    [javac]     assertFalse(new Pair<Integer, Integer>(Integer.valueOf(VAL_A), null)
    [javac]     ^
    [javac] /grid/0/hudson/hudson-slave/workspace/Hadoop-Mapreduce-trunk/trunk/src/contrib/mrunit/src/test/org/apache/hadoop/mrunit/types/TestPair.java:92:
cannot find symbol
    [javac] symbol  : method assertFalse(boolean)
    [javac] location: class org.apache.hadoop.mrunit.types.TestPair
    [javac]     assertFalse(new Pair<Integer, Integer>(null, null)
    [javac]     ^
    [javac] /grid/0/hudson/hudson-slave/workspace/Hadoop-Mapreduce-trunk/trunk/src/contrib/mrunit/src/test/org/apache/hadoop/mrunit/types/TestPair.java:98:
cannot find symbol
    [javac] symbol  : method assertFalse(boolean)
    [javac] location: class org.apache.hadoop.mrunit.types.TestPair
    [javac]     assertFalse(new Pair<Integer, Integer>(null, Integer.valueOf(VAL_A))
    [javac]     ^
    [javac] /grid/0/hudson/hudson-slave/workspace/Hadoop-Mapreduce-trunk/trunk/src/contrib/mrunit/src/test/org/apache/hadoop/mrunit/types/TestPair.java:117:
cannot find symbol
    [javac] symbol  : method assertFalse(boolean)
    [javac] location: class org.apache.hadoop.mrunit.types.TestPair
    [javac]     assertFalse(0 == new Pair<Integer, Integer>(Integer.valueOf(VAL_A),
    [javac]     ^
    [javac] /grid/0/hudson/hudson-slave/workspace/Hadoop-Mapreduce-trunk/trunk/src/contrib/mrunit/src/test/org/apache/hadoop/mrunit/types/TestPair.java:125:
cannot find symbol
    [javac] symbol  : method assertFalse(boolean)
    [javac] location: class org.apache.hadoop.mrunit.types.TestPair
    [javac]     assertFalse(0 == new Pair<Integer, Integer>(Integer.valueOf(VAL_A),
    [javac]     ^
    [javac] Note: Some input files use or override a deprecated API.
    [javac] Note: Recompile with -Xlint:deprecation for details.
    [javac] Note: Some input files use unchecked or unsafe operations.
    [javac] Note: Recompile with -Xlint:unchecked for details.
    [javac] 22 errors

BUILD FAILED
/grid/0/hudson/hudson-slave/workspace/Hadoop-Mapreduce-trunk/trunk/build.xml:821: The following
error occurred while executing this line:
/grid/0/hudson/hudson-slave/workspace/Hadoop-Mapreduce-trunk/trunk/build.xml:805: The following
error occurred while executing this line:
/grid/0/hudson/hudson-slave/workspace/Hadoop-Mapreduce-trunk/trunk/src/contrib/build.xml:60:
The following error occurred while executing this line:
/grid/0/hudson/hudson-slave/workspace/Hadoop-Mapreduce-trunk/trunk/src/contrib/build-contrib.xml:229:
Compile failed; see the compiler error output for details.

Total time: 192 minutes 30 seconds
[FINDBUGS] Skipping publisher since build result is FAILURE
Publishing Javadoc
Archiving artifacts
Recording test results
Recording fingerprints
Publishing Clover coverage report...
No Clover report will be published due to a Build Failure
Email was triggered for: Failure
Sending email for trigger: Failure



###################################################################################
############################## FAILED TESTS (if any) ##############################
33 tests failed.
FAILED:  org.apache.hadoop.mapred.TestFairScheduler.testSmallJobs

Error Message:
expected:<2> but was:<0>

Stack Trace:
junit.framework.AssertionFailedError: expected:<2> but was:<0>
	at org.apache.hadoop.mapred.TestFairScheduler.testSmallJobs(TestFairScheduler.java:685)


FAILED:  org.apache.hadoop.mapred.TestFairScheduler.testSmallJobsWithAssignMultiple

Error Message:
expected:<2> but was:<0>

Stack Trace:
junit.framework.AssertionFailedError: expected:<2> but was:<0>
	at org.apache.hadoop.mapred.TestFairScheduler.testSmallJobsWithAssignMultiple(TestFairScheduler.java:744)


FAILED:  org.apache.hadoop.mapred.TestFairScheduler.testLargeJobs

Error Message:
expected:<10> but was:<0>

Stack Trace:
junit.framework.AssertionFailedError: expected:<10> but was:<0>
	at org.apache.hadoop.mapred.TestFairScheduler.testLargeJobs(TestFairScheduler.java:805)


FAILED:  org.apache.hadoop.mapred.TestFairScheduler.testLargeJobsWithAssignMultiple

Error Message:
expected:<10> but was:<0>

Stack Trace:
junit.framework.AssertionFailedError: expected:<10> but was:<0>
	at org.apache.hadoop.mapred.TestFairScheduler.testLargeJobsWithAssignMultiple(TestFairScheduler.java:913)


FAILED:  org.apache.hadoop.mapred.TestFairScheduler.testJobsWithPriorities

Error Message:
expected:<10> but was:<0>

Stack Trace:
junit.framework.AssertionFailedError: expected:<10> but was:<0>
	at org.apache.hadoop.mapred.TestFairScheduler.testJobsWithPriorities(TestFairScheduler.java:1027)


FAILED:  org.apache.hadoop.mapred.TestFairScheduler.testLargeJobsWithPools

Error Message:
expected:<10> but was:<0>

Stack Trace:
junit.framework.AssertionFailedError: expected:<10> but was:<0>
	at org.apache.hadoop.mapred.TestFairScheduler.testLargeJobsWithPools(TestFairScheduler.java:1100)


FAILED:  org.apache.hadoop.mapred.TestFairScheduler.testLargeJobsWithExcessCapacity

Error Message:
expected:<10> but was:<0>

Stack Trace:
junit.framework.AssertionFailedError: expected:<10> but was:<0>
	at org.apache.hadoop.mapred.TestFairScheduler.testLargeJobsWithExcessCapacity(TestFairScheduler.java:1173)


FAILED:  org.apache.hadoop.mapred.TestFairScheduler.testLargeJobsWithExcessCapacityAndAssignMultiple

Error Message:
expected:<10> but was:<0>

Stack Trace:
junit.framework.AssertionFailedError: expected:<10> but was:<0>
	at org.apache.hadoop.mapred.TestFairScheduler.testLargeJobsWithExcessCapacityAndAssignMultiple(TestFairScheduler.java:1249)


FAILED:  org.apache.hadoop.mapred.TestFairScheduler.testSmallJobInLargePool

Error Message:
expected:<10> but was:<0>

Stack Trace:
junit.framework.AssertionFailedError: expected:<10> but was:<0>
	at org.apache.hadoop.mapred.TestFairScheduler.testSmallJobInLargePool(TestFairScheduler.java:1327)


FAILED:  org.apache.hadoop.mapred.TestFairScheduler.testPoolMaxJobs

Error Message:
null

Stack Trace:
junit.framework.AssertionFailedError: null
	at org.apache.hadoop.mapred.TestFairScheduler.testPoolMaxJobs(TestFairScheduler.java:1369)


FAILED:  org.apache.hadoop.mapred.TestFairScheduler.testUserMaxJobs

Error Message:
expected:<1.33> but was:<0.0>

Stack Trace:
junit.framework.AssertionFailedError: expected:<1.33> but was:<0.0>
	at org.apache.hadoop.mapred.TestFairScheduler.testUserMaxJobs(TestFairScheduler.java:1448)


FAILED:  org.apache.hadoop.mapred.TestFairScheduler.testComplexJobLimits

Error Message:
expected:<0.33> but was:<0.0>

Stack Trace:
junit.framework.AssertionFailedError: expected:<0.33> but was:<0.0>
	at org.apache.hadoop.mapred.TestFairScheduler.testComplexJobLimits(TestFairScheduler.java:1549)


FAILED:  org.apache.hadoop.mapred.TestFairScheduler.testSizeBasedWeight

Error Message:
null

Stack Trace:
junit.framework.AssertionFailedError: null
	at org.apache.hadoop.mapred.TestFairScheduler.testSizeBasedWeight(TestFairScheduler.java:1575)


FAILED:  org.apache.hadoop.mapred.TestFairScheduler.testPoolWeights

Error Message:
expected:<1.14> but was:<0.0>

Stack Trace:
junit.framework.AssertionFailedError: expected:<1.14> but was:<0.0>
	at org.apache.hadoop.mapred.TestFairScheduler.testPoolWeights(TestFairScheduler.java:1613)


FAILED:  org.apache.hadoop.mapred.TestFairScheduler.testPoolWeightsWhenNoMaps

Error Message:
expected:<1.33> but was:<0.0>

Stack Trace:
junit.framework.AssertionFailedError: expected:<1.33> but was:<0.0>
	at org.apache.hadoop.mapred.TestFairScheduler.testPoolWeightsWhenNoMaps(TestFairScheduler.java:1674)


FAILED:  org.apache.hadoop.mapred.TestFairScheduler.testPoolMaxMapsReduces

Error Message:
null

Stack Trace:
junit.framework.AssertionFailedError: null
	at org.apache.hadoop.mapred.TestFairScheduler.checkAssignment(TestFairScheduler.java:2743)
	at org.apache.hadoop.mapred.TestFairScheduler.testPoolMaxMapsReduces(TestFairScheduler.java:1698)


FAILED:  org.apache.hadoop.mapred.TestFairScheduler.testMinSharePreemption

Error Message:
null

Stack Trace:
junit.framework.AssertionFailedError: null
	at org.apache.hadoop.mapred.TestFairScheduler.checkAssignment(TestFairScheduler.java:2743)
	at org.apache.hadoop.mapred.TestFairScheduler.testMinSharePreemption(TestFairScheduler.java:1766)


FAILED:  org.apache.hadoop.mapred.TestFairScheduler.testMinSharePreemptionWithSmallJob

Error Message:
null

Stack Trace:
junit.framework.AssertionFailedError: null
	at org.apache.hadoop.mapred.TestFairScheduler.checkAssignment(TestFairScheduler.java:2743)
	at org.apache.hadoop.mapred.TestFairScheduler.testMinSharePreemptionWithSmallJob(TestFairScheduler.java:1844)


FAILED:  org.apache.hadoop.mapred.TestFairScheduler.testFairSharePreemption

Error Message:
null

Stack Trace:
junit.framework.AssertionFailedError: null
	at org.apache.hadoop.mapred.TestFairScheduler.checkAssignment(TestFairScheduler.java:2743)
	at org.apache.hadoop.mapred.TestFairScheduler.testFairSharePreemption(TestFairScheduler.java:1923)


FAILED:  org.apache.hadoop.mapred.TestFairScheduler.testFairSharePreemptionFromMultiplePools

Error Message:
null

Stack Trace:
junit.framework.AssertionFailedError: null
	at org.apache.hadoop.mapred.TestFairScheduler.checkAssignment(TestFairScheduler.java:2743)
	at org.apache.hadoop.mapred.TestFairScheduler.testFairSharePreemptionFromMultiplePools(TestFairScheduler.java:2027)


FAILED:  org.apache.hadoop.mapred.TestFairScheduler.testMinAndFairSharePreemption

Error Message:
null

Stack Trace:
junit.framework.AssertionFailedError: null
	at org.apache.hadoop.mapred.TestFairScheduler.checkAssignment(TestFairScheduler.java:2743)
	at org.apache.hadoop.mapred.TestFairScheduler.testMinAndFairSharePreemption(TestFairScheduler.java:2115)


FAILED:  org.apache.hadoop.mapred.TestFairScheduler.testNoPreemptionIfDisabled

Error Message:
null

Stack Trace:
junit.framework.AssertionFailedError: null
	at org.apache.hadoop.mapred.TestFairScheduler.checkAssignment(TestFairScheduler.java:2743)
	at org.apache.hadoop.mapred.TestFairScheduler.testNoPreemptionIfDisabled(TestFairScheduler.java:2189)


FAILED:  org.apache.hadoop.mapred.TestFairScheduler.testNoPreemptionIfOnlyLogging

Error Message:
null

Stack Trace:
junit.framework.AssertionFailedError: null
	at org.apache.hadoop.mapred.TestFairScheduler.checkAssignment(TestFairScheduler.java:2743)
	at org.apache.hadoop.mapred.TestFairScheduler.testNoPreemptionIfOnlyLogging(TestFairScheduler.java:2243)


FAILED:  org.apache.hadoop.mapred.TestFairScheduler.testDelaySchedulingAtNodeLevel

Error Message:
null

Stack Trace:
junit.framework.AssertionFailedError: null
	at org.apache.hadoop.mapred.TestFairScheduler.checkAssignment(TestFairScheduler.java:2743)
	at org.apache.hadoop.mapred.TestFairScheduler.testDelaySchedulingAtNodeLevel(TestFairScheduler.java:2295)


FAILED:  org.apache.hadoop.mapred.TestFairScheduler.testDelaySchedulingAtRackLevel

Error Message:
null

Stack Trace:
junit.framework.AssertionFailedError: null
	at org.apache.hadoop.mapred.TestFairScheduler.checkAssignment(TestFairScheduler.java:2743)
	at org.apache.hadoop.mapred.TestFairScheduler.testDelaySchedulingAtRackLevel(TestFairScheduler.java:2343)


FAILED:  org.apache.hadoop.mapred.TestFairScheduler.testDelaySchedulingOffRack

Error Message:
expected:<0> but was:<6200>

Stack Trace:
junit.framework.AssertionFailedError: expected:<0> but was:<6200>
	at org.apache.hadoop.mapred.TestFairScheduler.testDelaySchedulingOffRack(TestFairScheduler.java:2444)


FAILED:  org.apache.hadoop.mapred.TestFairScheduler.testAssignMultipleWithUnderloadedCluster

Error Message:
null

Stack Trace:
junit.framework.AssertionFailedError: null
	at org.apache.hadoop.mapred.TestFairScheduler.checkAssignment(TestFairScheduler.java:2743)
	at org.apache.hadoop.mapred.TestFairScheduler.testAssignMultipleWithUnderloadedCluster(TestFairScheduler.java:2511)


FAILED:  org.apache.hadoop.mapred.TestFairScheduler.testFifoPool

Error Message:
null

Stack Trace:
junit.framework.AssertionFailedError: null
	at org.apache.hadoop.mapred.TestFairScheduler.checkAssignment(TestFairScheduler.java:2743)
	at org.apache.hadoop.mapred.TestFairScheduler.testFifoPool(TestFairScheduler.java:2559)


FAILED:  org.apache.hadoop.mapred.TestFairScheduler.testMultipleFifoPools

Error Message:
null

Stack Trace:
junit.framework.AssertionFailedError: null
	at org.apache.hadoop.mapred.TestFairScheduler.checkAssignment(TestFairScheduler.java:2743)
	at org.apache.hadoop.mapred.TestFairScheduler.testMultipleFifoPools(TestFairScheduler.java:2597)


FAILED:  org.apache.hadoop.mapred.TestFairScheduler.testFifoAndFairPools

Error Message:
null

Stack Trace:
junit.framework.AssertionFailedError: null
	at org.apache.hadoop.mapred.TestFairScheduler.checkAssignment(TestFairScheduler.java:2743)
	at org.apache.hadoop.mapred.TestFairScheduler.testFifoAndFairPools(TestFairScheduler.java:2638)


FAILED:  org.apache.hadoop.mapred.TestFairScheduler.testPoolAssignment

Error Message:
expected:<1> but was:<0>

Stack Trace:
junit.framework.AssertionFailedError: expected:<1> but was:<0>
	at org.apache.hadoop.mapred.TestFairScheduler.testPoolAssignment(TestFairScheduler.java:2671)


FAILED:  org.apache.hadoop.mapred.TestFairScheduler.testFairSharePreemptionWithShortTimeout

Error Message:
null

Stack Trace:
junit.framework.AssertionFailedError: null
	at org.apache.hadoop.mapred.TestFairScheduler.checkAssignment(TestFairScheduler.java:2743)
	at org.apache.hadoop.mapred.TestFairScheduler.testFairSharePreemptionWithShortTimeout(TestFairScheduler.java:2782)


FAILED:  org.apache.hadoop.mapred.TestFairSchedulerSystem.testFairSchedulerSystem

Error Message:
Timeout occurred. Please note the time in the report does not reflect the time until the timeout.

Stack Trace:
junit.framework.AssertionFailedError: Timeout occurred. Please note the time in the report
does not reflect the time until the timeout.




Mime
View raw message