hadoop-mapreduce-dev mailing list archives

Site index · List index
Message view « Date » · « Thread »
Top « Date » · « Thread »
From Apache Hudson Server <hud...@hudson.apache.org>
Subject Hadoop-Mapreduce-trunk-Commit - Build # 593 - Still Failing
Date Tue, 01 Feb 2011 01:47:17 GMT
See https://hudson.apache.org/hudson/job/Hadoop-Mapreduce-trunk-Commit/593/

###################################################################################
########################## LAST 60 LINES OF THE CONSOLE ###########################
[...truncated 8292 lines...]
[ivy:resolve] 	commons-logging#commons-logging;1.0.3 by [commons-logging#commons-logging;1.1.1]
in [test]
[ivy:resolve] 	commons-codec#commons-codec;1.3 by [commons-codec#commons-codec;1.4] in [test]
[ivy:resolve] 	org.slf4j#slf4j-api;1.5.2 by [org.slf4j#slf4j-api;1.5.11] in [test]
[ivy:resolve] 	org.apache.mina#mina-core;2.0.0-M4 by [org.apache.mina#mina-core;2.0.0-M5]
in [test]
[ivy:resolve] 	org.apache.ftpserver#ftplet-api;1.0.0-M2 by [org.apache.ftpserver#ftplet-api;1.0.0]
in [test]
[ivy:resolve] 	org.apache.ftpserver#ftpserver-core;1.0.0-M2 by [org.apache.ftpserver#ftpserver-core;1.0.0]
in [test]
[ivy:resolve] 	org.apache.mina#mina-core;2.0.0-M2 by [org.apache.mina#mina-core;2.0.0-M5]
in [test]
[ivy:resolve] 	org.codehaus.jackson#jackson-mapper-asl;1.0.1 by [org.codehaus.jackson#jackson-mapper-asl;1.4.2]
in [test]
[ivy:resolve] 	org.codehaus.jackson#jackson-core-asl;1.0.1 by [org.codehaus.jackson#jackson-core-asl;1.4.2]
in [test]
[ivy:resolve] 	commons-codec#commons-codec;${commons-codec.version} by [commons-codec#commons-codec;1.4]
in [test]
	---------------------------------------------------------------------
	|                  |            modules            ||   artifacts   |
	|       conf       | number| search|dwnlded|evicted|| number|dwnlded|
	---------------------------------------------------------------------
	|       test       |   54  |   4   |   0   |   12  ||   42  |   0   |
	---------------------------------------------------------------------

ivy-retrieve-test:
[ivy:retrieve] :: retrieving :: org.apache.hadoop#mumak [sync]
[ivy:retrieve] 	confs: [test]
[ivy:retrieve] 	42 artifacts copied, 0 already retrieved (24335kB/82ms)

compile-test:
     [echo] contrib: mumak
    [javac] Compiling 15 source files to /grid/0/hudson/hudson-slave/workspace/Hadoop-Mapreduce-trunk-Commit/trunk/build/contrib/mumak/test
    [javac] /grid/0/hudson/hudson-slave/workspace/Hadoop-Mapreduce-trunk-Commit/trunk/src/contrib/mumak/src/test/org/apache/hadoop/mapred/MockSimulatorJobTracker.java:56:
org.apache.hadoop.mapred.MockSimulatorJobTracker is not abstract and does not override abstract
method getProtocolSignature(java.lang.String,long,int) in org.apache.hadoop.ipc.VersionedProtocol
    [javac] public class MockSimulatorJobTracker implements InterTrackerProtocol,
    [javac]        ^
    [javac] Note: Some input files use or override a deprecated API.
    [javac] Note: Recompile with -Xlint:deprecation for details.
    [javac] 1 error

BUILD FAILED
/grid/0/hudson/hudson-slave/workspace/Hadoop-Mapreduce-trunk-Commit/trunk/build.xml:1149:
The following error occurred while executing this line:
/grid/0/hudson/hudson-slave/workspace/Hadoop-Mapreduce-trunk-Commit/trunk/src/contrib/build.xml:39:
The following error occurred while executing this line:
/grid/0/hudson/hudson-slave/workspace/Hadoop-Mapreduce-trunk-Commit/trunk/src/contrib/build-contrib.xml:229:
Compile failed; see the compiler error output for details.

Total time: 5 minutes 33 seconds


======================================================================
======================================================================
STORE: saving artifacts
======================================================================
======================================================================


mv: cannot stat `build/*.tar.gz': No such file or directory
mv: cannot stat `build/test/findbugs': No such file or directory
Build Failed
[FINDBUGS] Skipping publisher since build result is FAILURE
Publishing Javadoc
Archiving artifacts
Recording test results
Recording fingerprints
Publishing Clover coverage report...
No Clover report will be published due to a Build Failure
Email was triggered for: Failure
Sending email for trigger: Failure



###################################################################################
############################## FAILED TESTS (if any) ##############################
No tests ran.

Mime
View raw message