hadoop-mapreduce-dev mailing list archives

Site index · List index
Message view « Date » · « Thread »
Top « Date » · « Thread »
From Apache Hudson Server <hud...@hudson.apache.org>
Subject Hadoop-Mapreduce-trunk - Build # 589 - Still Failing
Date Wed, 09 Feb 2011 18:24:18 GMT
See https://hudson.apache.org/hudson/job/Hadoop-Mapreduce-trunk/589/

###################################################################################
########################## LAST 60 LINES OF THE CONSOLE ###########################
[...truncated 319831 lines...]
    [junit] 11/02/09 18:20:01 INFO datanode.FSDatasetAsyncDiskService: All async disk service
threads have been shut down.
    [junit] 11/02/09 18:20:01 WARN datanode.FSDatasetAsyncDiskService: AsyncDiskService has
already shut down.
    [junit] 11/02/09 18:20:01 INFO hdfs.MiniDFSCluster: Shutting down DataNode 0
    [junit] 11/02/09 18:20:02 INFO ipc.Server: Stopping server on 56258
    [junit] 11/02/09 18:20:02 INFO ipc.Server: IPC Server handler 0 on 56258: exiting
    [junit] 11/02/09 18:20:02 INFO datanode.DataNode: Waiting for threadgroup to exit, active
threads is 1
    [junit] 11/02/09 18:20:02 INFO ipc.Server: IPC Server handler 1 on 56258: exiting
    [junit] 11/02/09 18:20:02 WARN datanode.DataNode: DatanodeRegistration(127.0.0.1:60658,
storageID=DS-1133570672-127.0.1.1-60658-1297275600631, infoPort=42252, ipcPort=56258):DataXceiveServer:
java.nio.channels.AsynchronousCloseException
    [junit] 	at java.nio.channels.spi.AbstractInterruptibleChannel.end(AbstractInterruptibleChannel.java:185)
    [junit] 	at sun.nio.ch.ServerSocketChannelImpl.accept(ServerSocketChannelImpl.java:152)
    [junit] 	at sun.nio.ch.ServerSocketAdaptor.accept(ServerSocketAdaptor.java:84)
    [junit] 	at org.apache.hadoop.hdfs.server.datanode.DataXceiverServer.run(DataXceiverServer.java:134)
    [junit] 	at java.lang.Thread.run(Thread.java:619)
    [junit] 
    [junit] 11/02/09 18:20:02 INFO ipc.Server: IPC Server handler 2 on 56258: exiting
    [junit] 11/02/09 18:20:02 INFO ipc.Server: Stopping IPC Server Responder
    [junit] 11/02/09 18:20:02 INFO ipc.Server: Stopping IPC Server listener on 56258
    [junit] 11/02/09 18:20:02 INFO datanode.DataNode: Waiting for threadgroup to exit, active
threads is 0
    [junit] 11/02/09 18:20:02 INFO datanode.DataBlockScanner: Exiting DataBlockScanner thread.
    [junit] 11/02/09 18:20:02 INFO datanode.DataNode: DatanodeRegistration(127.0.0.1:60658,
storageID=DS-1133570672-127.0.1.1-60658-1297275600631, infoPort=42252, ipcPort=56258):Finishing
DataNode in: FSDataset{dirpath='/grid/0/hudson/hudson-slave/workspace/Hadoop-Mapreduce-trunk/trunk/build/contrib/raid/test/data/dfs/data/data1/current/finalized,/grid/0/hudson/hudson-slave/workspace/Hadoop-Mapreduce-trunk/trunk/build/contrib/raid/test/data/dfs/data/data2/current/finalized'}
    [junit] 11/02/09 18:20:02 INFO ipc.Server: Stopping server on 56258
    [junit] 11/02/09 18:20:02 INFO datanode.DataNode: Waiting for threadgroup to exit, active
threads is 0
    [junit] 11/02/09 18:20:02 INFO datanode.FSDatasetAsyncDiskService: Shutting down all async
disk service threads...
    [junit] 11/02/09 18:20:02 INFO datanode.FSDatasetAsyncDiskService: All async disk service
threads have been shut down.
    [junit] 11/02/09 18:20:02 WARN datanode.FSDatasetAsyncDiskService: AsyncDiskService has
already shut down.
    [junit] 11/02/09 18:20:02 WARN namenode.DecommissionManager: Monitor interrupted: java.lang.InterruptedException:
sleep interrupted
    [junit] 11/02/09 18:20:02 INFO namenode.FSEditLog: Number of transactions: 14 Total time
for transactions(ms): 1Number of transactions batched in Syncs: 0 Number of syncs: 7 SyncTimes(ms):
8 6 
    [junit] 11/02/09 18:20:02 WARN namenode.FSNamesystem: ReplicationMonitor thread received
InterruptedException.java.lang.InterruptedException: sleep interrupted
    [junit] 11/02/09 18:20:02 INFO ipc.Server: Stopping server on 40221
    [junit] 11/02/09 18:20:02 INFO ipc.Server: IPC Server handler 0 on 40221: exiting
    [junit] 11/02/09 18:20:02 INFO ipc.Server: IPC Server handler 1 on 40221: exiting
    [junit] 11/02/09 18:20:02 INFO ipc.Server: Stopping IPC Server listener on 40221
    [junit] 11/02/09 18:20:02 INFO ipc.Server: Stopping IPC Server Responder
    [junit] 11/02/09 18:20:02 INFO ipc.Server: IPC Server handler 2 on 40221: exiting
    [junit] 11/02/09 18:20:02 INFO ipc.Server: IPC Server handler 3 on 40221: exiting
    [junit] 11/02/09 18:20:02 INFO ipc.Server: IPC Server handler 5 on 40221: exiting
    [junit] 11/02/09 18:20:02 INFO ipc.Server: IPC Server handler 4 on 40221: exiting
    [junit] 11/02/09 18:20:02 INFO ipc.Server: IPC Server handler 6 on 40221: exiting
    [junit] 11/02/09 18:20:02 INFO ipc.Server: IPC Server handler 9 on 40221: exiting
    [junit] 11/02/09 18:20:02 INFO ipc.Server: IPC Server handler 7 on 40221: exiting
    [junit] 11/02/09 18:20:02 INFO ipc.Server: IPC Server handler 8 on 40221: exiting
    [junit] Tests run: 1, Failures: 0, Errors: 0, Time elapsed: 3.608 sec

BUILD FAILED
/grid/0/hudson/hudson-slave/workspace/Hadoop-Mapreduce-trunk/trunk/build.xml:821: The following
error occurred while executing this line:
/grid/0/hudson/hudson-slave/workspace/Hadoop-Mapreduce-trunk/trunk/build.xml:805: The following
error occurred while executing this line:
/grid/0/hudson/hudson-slave/workspace/Hadoop-Mapreduce-trunk/trunk/src/contrib/build.xml:60:
The following error occurred while executing this line:
/grid/0/hudson/hudson-slave/workspace/Hadoop-Mapreduce-trunk/trunk/src/contrib/raid/build.xml:60:
Tests failed!

Total time: 312 minutes 36 seconds
[FINDBUGS] Skipping publisher since build result is FAILURE
Publishing Javadoc
Archiving artifacts
Recording test results
Recording fingerprints
Publishing Clover coverage report...
No Clover report will be published due to a Build Failure
Email was triggered for: Failure
Sending email for trigger: Failure



###################################################################################
############################## FAILED TESTS (if any) ##############################
37 tests failed.
FAILED:  org.apache.hadoop.mapred.TestFairScheduler.testSmallJobs

Error Message:
expected:<2> but was:<0>

Stack Trace:
junit.framework.AssertionFailedError: expected:<2> but was:<0>
	at org.apache.hadoop.mapred.TestFairScheduler.testSmallJobs(TestFairScheduler.java:685)


FAILED:  org.apache.hadoop.mapred.TestFairScheduler.testSmallJobsWithAssignMultiple

Error Message:
expected:<2> but was:<0>

Stack Trace:
junit.framework.AssertionFailedError: expected:<2> but was:<0>
	at org.apache.hadoop.mapred.TestFairScheduler.testSmallJobsWithAssignMultiple(TestFairScheduler.java:744)


FAILED:  org.apache.hadoop.mapred.TestFairScheduler.testLargeJobs

Error Message:
expected:<10> but was:<0>

Stack Trace:
junit.framework.AssertionFailedError: expected:<10> but was:<0>
	at org.apache.hadoop.mapred.TestFairScheduler.testLargeJobs(TestFairScheduler.java:805)


FAILED:  org.apache.hadoop.mapred.TestFairScheduler.testLargeJobsWithAssignMultiple

Error Message:
expected:<10> but was:<0>

Stack Trace:
junit.framework.AssertionFailedError: expected:<10> but was:<0>
	at org.apache.hadoop.mapred.TestFairScheduler.testLargeJobsWithAssignMultiple(TestFairScheduler.java:913)


FAILED:  org.apache.hadoop.mapred.TestFairScheduler.testJobsWithPriorities

Error Message:
expected:<10> but was:<0>

Stack Trace:
junit.framework.AssertionFailedError: expected:<10> but was:<0>
	at org.apache.hadoop.mapred.TestFairScheduler.testJobsWithPriorities(TestFairScheduler.java:1027)


FAILED:  org.apache.hadoop.mapred.TestFairScheduler.testLargeJobsWithPools

Error Message:
expected:<10> but was:<0>

Stack Trace:
junit.framework.AssertionFailedError: expected:<10> but was:<0>
	at org.apache.hadoop.mapred.TestFairScheduler.testLargeJobsWithPools(TestFairScheduler.java:1100)


FAILED:  org.apache.hadoop.mapred.TestFairScheduler.testLargeJobsWithExcessCapacity

Error Message:
expected:<10> but was:<0>

Stack Trace:
junit.framework.AssertionFailedError: expected:<10> but was:<0>
	at org.apache.hadoop.mapred.TestFairScheduler.testLargeJobsWithExcessCapacity(TestFairScheduler.java:1173)


FAILED:  org.apache.hadoop.mapred.TestFairScheduler.testLargeJobsWithExcessCapacityAndAssignMultiple

Error Message:
expected:<10> but was:<0>

Stack Trace:
junit.framework.AssertionFailedError: expected:<10> but was:<0>
	at org.apache.hadoop.mapred.TestFairScheduler.testLargeJobsWithExcessCapacityAndAssignMultiple(TestFairScheduler.java:1249)


FAILED:  org.apache.hadoop.mapred.TestFairScheduler.testSmallJobInLargePool

Error Message:
expected:<10> but was:<0>

Stack Trace:
junit.framework.AssertionFailedError: expected:<10> but was:<0>
	at org.apache.hadoop.mapred.TestFairScheduler.testSmallJobInLargePool(TestFairScheduler.java:1327)


FAILED:  org.apache.hadoop.mapred.TestFairScheduler.testPoolMaxJobs

Error Message:
null

Stack Trace:
junit.framework.AssertionFailedError: null
	at org.apache.hadoop.mapred.TestFairScheduler.testPoolMaxJobs(TestFairScheduler.java:1369)


FAILED:  org.apache.hadoop.mapred.TestFairScheduler.testUserMaxJobs

Error Message:
expected:<1.33> but was:<0.0>

Stack Trace:
junit.framework.AssertionFailedError: expected:<1.33> but was:<0.0>
	at org.apache.hadoop.mapred.TestFairScheduler.testUserMaxJobs(TestFairScheduler.java:1448)


FAILED:  org.apache.hadoop.mapred.TestFairScheduler.testComplexJobLimits

Error Message:
expected:<0.33> but was:<0.0>

Stack Trace:
junit.framework.AssertionFailedError: expected:<0.33> but was:<0.0>
	at org.apache.hadoop.mapred.TestFairScheduler.testComplexJobLimits(TestFairScheduler.java:1549)


FAILED:  org.apache.hadoop.mapred.TestFairScheduler.testSizeBasedWeight

Error Message:
null

Stack Trace:
junit.framework.AssertionFailedError: null
	at org.apache.hadoop.mapred.TestFairScheduler.testSizeBasedWeight(TestFairScheduler.java:1575)


FAILED:  org.apache.hadoop.mapred.TestFairScheduler.testPoolWeights

Error Message:
expected:<1.14> but was:<0.0>

Stack Trace:
junit.framework.AssertionFailedError: expected:<1.14> but was:<0.0>
	at org.apache.hadoop.mapred.TestFairScheduler.testPoolWeights(TestFairScheduler.java:1613)


FAILED:  org.apache.hadoop.mapred.TestFairScheduler.testPoolWeightsWhenNoMaps

Error Message:
expected:<1.33> but was:<0.0>

Stack Trace:
junit.framework.AssertionFailedError: expected:<1.33> but was:<0.0>
	at org.apache.hadoop.mapred.TestFairScheduler.testPoolWeightsWhenNoMaps(TestFairScheduler.java:1674)


FAILED:  org.apache.hadoop.mapred.TestFairScheduler.testPoolMaxMapsReduces

Error Message:
null

Stack Trace:
junit.framework.AssertionFailedError: null
	at org.apache.hadoop.mapred.TestFairScheduler.checkAssignment(TestFairScheduler.java:2743)
	at org.apache.hadoop.mapred.TestFairScheduler.testPoolMaxMapsReduces(TestFairScheduler.java:1698)


FAILED:  org.apache.hadoop.mapred.TestFairScheduler.testMinSharePreemption

Error Message:
null

Stack Trace:
junit.framework.AssertionFailedError: null
	at org.apache.hadoop.mapred.TestFairScheduler.checkAssignment(TestFairScheduler.java:2743)
	at org.apache.hadoop.mapred.TestFairScheduler.testMinSharePreemption(TestFairScheduler.java:1766)


FAILED:  org.apache.hadoop.mapred.TestFairScheduler.testMinSharePreemptionWithSmallJob

Error Message:
null

Stack Trace:
junit.framework.AssertionFailedError: null
	at org.apache.hadoop.mapred.TestFairScheduler.checkAssignment(TestFairScheduler.java:2743)
	at org.apache.hadoop.mapred.TestFairScheduler.testMinSharePreemptionWithSmallJob(TestFairScheduler.java:1844)


FAILED:  org.apache.hadoop.mapred.TestFairScheduler.testFairSharePreemption

Error Message:
null

Stack Trace:
junit.framework.AssertionFailedError: null
	at org.apache.hadoop.mapred.TestFairScheduler.checkAssignment(TestFairScheduler.java:2743)
	at org.apache.hadoop.mapred.TestFairScheduler.testFairSharePreemption(TestFairScheduler.java:1923)


FAILED:  org.apache.hadoop.mapred.TestFairScheduler.testFairSharePreemptionFromMultiplePools

Error Message:
null

Stack Trace:
junit.framework.AssertionFailedError: null
	at org.apache.hadoop.mapred.TestFairScheduler.checkAssignment(TestFairScheduler.java:2743)
	at org.apache.hadoop.mapred.TestFairScheduler.testFairSharePreemptionFromMultiplePools(TestFairScheduler.java:2027)


FAILED:  org.apache.hadoop.mapred.TestFairScheduler.testMinAndFairSharePreemption

Error Message:
null

Stack Trace:
junit.framework.AssertionFailedError: null
	at org.apache.hadoop.mapred.TestFairScheduler.checkAssignment(TestFairScheduler.java:2743)
	at org.apache.hadoop.mapred.TestFairScheduler.testMinAndFairSharePreemption(TestFairScheduler.java:2115)


FAILED:  org.apache.hadoop.mapred.TestFairScheduler.testNoPreemptionIfDisabled

Error Message:
null

Stack Trace:
junit.framework.AssertionFailedError: null
	at org.apache.hadoop.mapred.TestFairScheduler.checkAssignment(TestFairScheduler.java:2743)
	at org.apache.hadoop.mapred.TestFairScheduler.testNoPreemptionIfDisabled(TestFairScheduler.java:2189)


FAILED:  org.apache.hadoop.mapred.TestFairScheduler.testNoPreemptionIfOnlyLogging

Error Message:
null

Stack Trace:
junit.framework.AssertionFailedError: null
	at org.apache.hadoop.mapred.TestFairScheduler.checkAssignment(TestFairScheduler.java:2743)
	at org.apache.hadoop.mapred.TestFairScheduler.testNoPreemptionIfOnlyLogging(TestFairScheduler.java:2243)


FAILED:  org.apache.hadoop.mapred.TestFairScheduler.testDelaySchedulingAtNodeLevel

Error Message:
null

Stack Trace:
junit.framework.AssertionFailedError: null
	at org.apache.hadoop.mapred.TestFairScheduler.checkAssignment(TestFairScheduler.java:2743)
	at org.apache.hadoop.mapred.TestFairScheduler.testDelaySchedulingAtNodeLevel(TestFairScheduler.java:2295)


FAILED:  org.apache.hadoop.mapred.TestFairScheduler.testDelaySchedulingAtRackLevel

Error Message:
null

Stack Trace:
junit.framework.AssertionFailedError: null
	at org.apache.hadoop.mapred.TestFairScheduler.checkAssignment(TestFairScheduler.java:2743)
	at org.apache.hadoop.mapred.TestFairScheduler.testDelaySchedulingAtRackLevel(TestFairScheduler.java:2343)


FAILED:  org.apache.hadoop.mapred.TestFairScheduler.testDelaySchedulingOffRack

Error Message:
expected:<0> but was:<6200>

Stack Trace:
junit.framework.AssertionFailedError: expected:<0> but was:<6200>
	at org.apache.hadoop.mapred.TestFairScheduler.testDelaySchedulingOffRack(TestFairScheduler.java:2444)


FAILED:  org.apache.hadoop.mapred.TestFairScheduler.testAssignMultipleWithUnderloadedCluster

Error Message:
null

Stack Trace:
junit.framework.AssertionFailedError: null
	at org.apache.hadoop.mapred.TestFairScheduler.checkAssignment(TestFairScheduler.java:2743)
	at org.apache.hadoop.mapred.TestFairScheduler.testAssignMultipleWithUnderloadedCluster(TestFairScheduler.java:2511)


FAILED:  org.apache.hadoop.mapred.TestFairScheduler.testFifoPool

Error Message:
null

Stack Trace:
junit.framework.AssertionFailedError: null
	at org.apache.hadoop.mapred.TestFairScheduler.checkAssignment(TestFairScheduler.java:2743)
	at org.apache.hadoop.mapred.TestFairScheduler.testFifoPool(TestFairScheduler.java:2559)


FAILED:  org.apache.hadoop.mapred.TestFairScheduler.testMultipleFifoPools

Error Message:
null

Stack Trace:
junit.framework.AssertionFailedError: null
	at org.apache.hadoop.mapred.TestFairScheduler.checkAssignment(TestFairScheduler.java:2743)
	at org.apache.hadoop.mapred.TestFairScheduler.testMultipleFifoPools(TestFairScheduler.java:2597)


FAILED:  org.apache.hadoop.mapred.TestFairScheduler.testFifoAndFairPools

Error Message:
null

Stack Trace:
junit.framework.AssertionFailedError: null
	at org.apache.hadoop.mapred.TestFairScheduler.checkAssignment(TestFairScheduler.java:2743)
	at org.apache.hadoop.mapred.TestFairScheduler.testFifoAndFairPools(TestFairScheduler.java:2638)


FAILED:  org.apache.hadoop.mapred.TestFairScheduler.testPoolAssignment

Error Message:
expected:<1> but was:<0>

Stack Trace:
junit.framework.AssertionFailedError: expected:<1> but was:<0>
	at org.apache.hadoop.mapred.TestFairScheduler.testPoolAssignment(TestFairScheduler.java:2671)


FAILED:  org.apache.hadoop.mapred.TestFairScheduler.testFairSharePreemptionWithShortTimeout

Error Message:
null

Stack Trace:
junit.framework.AssertionFailedError: null
	at org.apache.hadoop.mapred.TestFairScheduler.checkAssignment(TestFairScheduler.java:2743)
	at org.apache.hadoop.mapred.TestFairScheduler.testFairSharePreemptionWithShortTimeout(TestFairScheduler.java:2782)


FAILED:  org.apache.hadoop.mapred.TestFairSchedulerSystem.testFairSchedulerSystem

Error Message:
Timeout occurred. Please note the time in the report does not reflect the time until the timeout.

Stack Trace:
junit.framework.AssertionFailedError: Timeout occurred. Please note the time in the report
does not reflect the time until the timeout.


FAILED:  org.apache.hadoop.mapred.TestSimulatorDeterministicReplay.testMain

Error Message:
Timeout occurred. Please note the time in the report does not reflect the time until the timeout.

Stack Trace:
junit.framework.AssertionFailedError: Timeout occurred. Please note the time in the report
does not reflect the time until the timeout.


FAILED:  org.apache.hadoop.mapred.TestSimulatorEndToEnd.testMain

Error Message:
Timeout occurred. Please note the time in the report does not reflect the time until the timeout.

Stack Trace:
junit.framework.AssertionFailedError: Timeout occurred. Please note the time in the report
does not reflect the time until the timeout.


FAILED:  org.apache.hadoop.mapred.TestSimulatorSerialJobSubmission.testMain

Error Message:
Timeout occurred. Please note the time in the report does not reflect the time until the timeout.

Stack Trace:
junit.framework.AssertionFailedError: Timeout occurred. Please note the time in the report
does not reflect the time until the timeout.


FAILED:  org.apache.hadoop.mapred.TestSimulatorStressJobSubmission.testMain

Error Message:
Timeout occurred. Please note the time in the report does not reflect the time until the timeout.

Stack Trace:
junit.framework.AssertionFailedError: Timeout occurred. Please note the time in the report
does not reflect the time until the timeout.




Mime
View raw message