hadoop-mapreduce-dev mailing list archives

Site index · List index
Message view « Date » · « Thread »
Top « Date » · « Thread »
From Apache Hudson Server <hud...@hudson.apache.org>
Subject Hadoop-Mapreduce-trunk - Build # 518 - Still Failing
Date Sat, 04 Dec 2010 17:26:32 GMT
See https://hudson.apache.org/hudson/job/Hadoop-Mapreduce-trunk/518/

###################################################################################
########################## LAST 60 LINES OF THE CONSOLE ###########################
[...truncated 207860 lines...]
    [junit]    0.85:96549
    [junit]    0.9:96658
    [junit]    0.95:96670
    [junit] Failed Reduce CDF --------
    [junit] 0: -9223372036854775808--9223372036854775807
    [junit] map attempts to success -- 0.6567164179104478, 0.3283582089552239, 0.014925373134328358,

    [junit] ===============
    [junit] 2010-12-04 17:20:25,342 WARN  rumen.ZombieJob (ZombieJob.java:sanitizeLoggedTask(318))
- Task task_200904211745_0004_r_000025 has nulll TaskStatus
    [junit] 2010-12-04 17:20:25,343 WARN  rumen.ZombieJob (ZombieJob.java:sanitizeLoggedTask(318))
- Task task_200904211745_0004_r_000028 has nulll TaskStatus
    [junit] 2010-12-04 17:20:25,343 WARN  rumen.ZombieJob (ZombieJob.java:sanitizeLoggedTask(318))
- Task task_200904211745_0004_r_000029 has nulll TaskStatus
    [junit] 2010-12-04 17:20:25,343 WARN  rumen.ZombieJob (ZombieJob.java:sanitizeLoggedTask(318))
- Task task_200904211745_0004_r_000030 has nulll TaskStatus
    [junit] 2010-12-04 17:20:25,344 WARN  rumen.ZombieJob (ZombieJob.java:sanitizeLoggedTask(318))
- Task task_200904211745_0004_r_000031 has nulll TaskStatus
    [junit] 2010-12-04 17:20:25,344 WARN  rumen.ZombieJob (ZombieJob.java:sanitizeLoggedTask(318))
- Task task_200904211745_0004_r_000032 has nulll TaskStatus
    [junit] 2010-12-04 17:20:25,344 WARN  rumen.ZombieJob (ZombieJob.java:sanitizeLoggedTask(318))
- Task task_200904211745_0004_r_000033 has nulll TaskStatus
    [junit] 2010-12-04 17:20:25,345 WARN  rumen.ZombieJob (ZombieJob.java:sanitizeLoggedTask(318))
- Task task_200904211745_0004_r_000034 has nulll TaskStatus
    [junit] 2010-12-04 17:20:25,345 WARN  rumen.ZombieJob (ZombieJob.java:sanitizeLoggedTask(318))
- Task task_200904211745_0004_r_000035 has nulll TaskStatus
    [junit] 2010-12-04 17:20:25,345 WARN  rumen.ZombieJob (ZombieJob.java:sanitizeLoggedTask(318))
- Task task_200904211745_0004_r_000036 has nulll TaskStatus
    [junit] 2010-12-04 17:20:25,346 WARN  rumen.ZombieJob (ZombieJob.java:sanitizeLoggedTask(318))
- Task task_200904211745_0004_r_000037 has nulll TaskStatus
    [junit] 2010-12-04 17:20:25,346 WARN  rumen.ZombieJob (ZombieJob.java:sanitizeLoggedTask(318))
- Task task_200904211745_0004_r_000038 has nulll TaskStatus
    [junit] 2010-12-04 17:20:25,346 WARN  rumen.ZombieJob (ZombieJob.java:sanitizeLoggedTask(318))
- Task task_200904211745_0004_r_000039 has nulll TaskStatus
    [junit] 2010-12-04 17:20:25,347 WARN  rumen.ZombieJob (ZombieJob.java:sanitizeLoggedTask(318))
- Task task_200904211745_0004_r_000040 has nulll TaskStatus
    [junit] 2010-12-04 17:20:25,347 WARN  rumen.ZombieJob (ZombieJob.java:sanitizeLoggedTask(318))
- Task task_200904211745_0004_r_000041 has nulll TaskStatus
    [junit] 2010-12-04 17:20:25,347 WARN  rumen.ZombieJob (ZombieJob.java:sanitizeLoggedTask(318))
- Task task_200904211745_0004_r_000042 has nulll TaskStatus
    [junit] 2010-12-04 17:20:25,348 WARN  rumen.ZombieJob (ZombieJob.java:sanitizeLoggedTask(318))
- Task task_200904211745_0004_r_000043 has nulll TaskStatus
    [junit] 2010-12-04 17:20:25,348 WARN  rumen.ZombieJob (ZombieJob.java:sanitizeLoggedTask(318))
- Task task_200904211745_0004_r_000044 has nulll TaskStatus
    [junit] 2010-12-04 17:20:25,348 WARN  rumen.ZombieJob (ZombieJob.java:sanitizeLoggedTask(318))
- Task task_200904211745_0004_r_000045 has nulll TaskStatus
    [junit] 2010-12-04 17:20:25,349 WARN  rumen.ZombieJob (ZombieJob.java:sanitizeLoggedTask(318))
- Task task_200904211745_0004_r_000046 has nulll TaskStatus
    [junit] generated failed map runtime distribution
    [junit] 100000: 18592--18592
    [junit]    0.1:18592
    [junit]    0.5:18592
    [junit]    0.9:18592
    [junit] Tests run: 5, Failures: 0, Errors: 0, Time elapsed: 2.965 sec
    [junit] Running org.apache.hadoop.util.TestReflectionUtils
    [junit] Tests run: 1, Failures: 0, Errors: 0, Time elapsed: 0.358 sec
    [junit] Running org.apache.hadoop.util.TestRunJar
    [junit] Creating file/grid/0/hudson/hudson-slave/workspace/Hadoop-Mapreduce-trunk/trunk/build/test/data/out
    [junit] Tests run: 1, Failures: 0, Errors: 0, Time elapsed: 0.31 sec

checkfailure:
    [touch] Creating /grid/0/hudson/hudson-slave/workspace/Hadoop-Mapreduce-trunk/trunk/build/test/testsfailed

run-test-mapred-all-withtestcaseonly:

run-test-mapred:

BUILD FAILED
/grid/0/hudson/hudson-slave/workspace/Hadoop-Mapreduce-trunk/trunk/build.xml:811: Tests failed!

Total time: 258 minutes 37 seconds
[FINDBUGS] Skipping publisher since build result is FAILURE
Publishing Javadoc
Archiving artifacts
Recording test results
Recording fingerprints
Publishing Clover coverage report...
No Clover report will be published due to a Build Failure
Email was triggered for: Failure
Sending email for trigger: Failure



###################################################################################
############################## FAILED TESTS (if any) ##############################
5 tests failed.
REGRESSION:  org.apache.hadoop.mapred.TestShuffleJobToken.testInvalidJobToken

Error Message:
org/apache/hadoop/ipc/Server

Stack Trace:
java.lang.NoClassDefFoundError: org/apache/hadoop/ipc/Server
	at org.apache.hadoop.mapred.TestShuffleJobToken.__CLR3_0_2qbbiiwx28(TestShuffleJobToken.java:96)
	at org.apache.hadoop.mapred.TestShuffleJobToken.testInvalidJobToken(TestShuffleJobToken.java:90)
Caused by: java.lang.ClassNotFoundException: org.apache.hadoop.ipc.Server
	at java.net.URLClassLoader$1.run(URLClassLoader.java:197)
	at java.security.AccessController.doPrivileged(Native Method)
	at java.net.URLClassLoader.findClass(URLClassLoader.java:188)
	at java.lang.ClassLoader.loadClass(ClassLoader.java:307)
	at sun.misc.Launcher$AppClassLoader.loadClass(Launcher.java:301)
	at java.lang.ClassLoader.loadClass(ClassLoader.java:252)
	at java.lang.ClassLoader.loadClassInternal(ClassLoader.java:320)
Caused by: java.util.zip.ZipException: error reading zip file
	at java.util.zip.ZipFile.read(Native Method)
	at java.util.zip.ZipFile.access$1200(ZipFile.java:29)
	at java.util.zip.ZipFile$ZipFileInputStream.read(ZipFile.java:447)
	at java.util.zip.ZipFile$1.fill(ZipFile.java:230)
	at java.util.zip.InflaterInputStream.read(InflaterInputStream.java:141)
	at sun.misc.Resource.getBytes(Resource.java:97)
	at java.net.URLClassLoader.defineClass(URLClassLoader.java:256)
	at java.net.URLClassLoader.access$000(URLClassLoader.java:56)
	at java.net.URLClassLoader$1.run(URLClassLoader.java:195)


REGRESSION:  org.apache.hadoop.mapred.TestSpecialCharactersInOutputPath.testJobWithDFS

Error Message:
org/apache/hadoop/hdfs/MiniDFSCluster

Stack Trace:
java.lang.NoClassDefFoundError: org/apache/hadoop/hdfs/MiniDFSCluster
	at org.apache.hadoop.mapred.TestSpecialCharactersInOutputPath.__CLR3_0_2s239fdimt(TestSpecialCharactersInOutputPath.java:110)
	at org.apache.hadoop.mapred.TestSpecialCharactersInOutputPath.testJobWithDFS(TestSpecialCharactersInOutputPath.java:101)
Caused by: java.lang.ClassNotFoundException: org.apache.hadoop.hdfs.MiniDFSCluster
	at java.net.URLClassLoader$1.run(URLClassLoader.java:200)
	at java.security.AccessController.doPrivileged(Native Method)
	at java.net.URLClassLoader.findClass(URLClassLoader.java:188)
	at java.lang.ClassLoader.loadClass(ClassLoader.java:307)
	at sun.misc.Launcher$AppClassLoader.loadClass(Launcher.java:301)
	at java.lang.ClassLoader.loadClass(ClassLoader.java:252)
	at java.lang.ClassLoader.loadClassInternal(ClassLoader.java:320)


REGRESSION:  org.apache.hadoop.mapred.TestSubmitJob.testSecureJobExecution

Error Message:
org/apache/hadoop/hdfs/MiniDFSCluster

Stack Trace:
java.lang.NoClassDefFoundError: org/apache/hadoop/hdfs/MiniDFSCluster
	at org.apache.hadoop.mapred.TestSubmitJob.__CLR3_0_2jrhwd1akn(TestSubmitJob.java:201)
	at org.apache.hadoop.mapred.TestSubmitJob.testSecureJobExecution(TestSubmitJob.java:197)
Caused by: java.lang.ClassNotFoundException: org.apache.hadoop.hdfs.MiniDFSCluster
	at java.net.URLClassLoader$1.run(URLClassLoader.java:200)
	at java.security.AccessController.doPrivileged(Native Method)
	at java.net.URLClassLoader.findClass(URLClassLoader.java:188)
	at java.lang.ClassLoader.loadClass(ClassLoader.java:307)
	at sun.misc.Launcher$AppClassLoader.loadClass(Launcher.java:301)
	at java.lang.ClassLoader.loadClass(ClassLoader.java:252)
	at java.lang.ClassLoader.loadClassInternal(ClassLoader.java:320)


REGRESSION:  org.apache.hadoop.mapreduce.TestLocalRunner.testMultiMaps

Error Message:
Timeout occurred. Please note the time in the report does not reflect the time until the timeout.

Stack Trace:
junit.framework.AssertionFailedError: Timeout occurred. Please note the time in the report
does not reflect the time until the timeout.


FAILED:  org.apache.hadoop.mapred.TestControlledMapReduceJob.testControlledMapReduceJob

Error Message:
Timeout occurred. Please note the time in the report does not reflect the time until the timeout.

Stack Trace:
junit.framework.AssertionFailedError: Timeout occurred. Please note the time in the report
does not reflect the time until the timeout.




Mime
View raw message