hadoop-mapreduce-dev mailing list archives

Site index · List index
Message view « Date » · « Thread »
Top « Date » · « Thread »
From Apache Hudson Server <hud...@hudson.apache.org>
Subject Hadoop-Mapreduce-trunk-Commit - Build # 561 - Failure
Date Thu, 23 Dec 2010 00:01:21 GMT
See https://hudson.apache.org/hudson/job/Hadoop-Mapreduce-trunk-Commit/561/

###################################################################################
########################## LAST 60 LINES OF THE CONSOLE ###########################
[...truncated 2382 lines...]
clean:
     [echo] contrib: raid

clean:
     [echo] contrib: streaming

clean:
     [echo] contrib: vaidya

clean:
     [echo] contrib: vertica

clean-fi:

clean:

BUILD SUCCESSFUL
Total time: 0 seconds


======================================================================
======================================================================
BUILD: ant veryclean mvn-deploy tar findbugs -Dtest.junit.output.format=xml -Dtest.output=yes
-Dcompile.c++=true -Dcompile.native=true -Dfindbugs.home=$FINDBUGS_HOME -Djava5.home=$JAVA5_HOME
-Dforrest.home=$FORREST_HOME -Dclover.home=$CLOVER_HOME -Declipse.home=$ECLIPSE_HOME
======================================================================
======================================================================


Buildfile: build.xml

clean-cache:
   [delete] Deleting directory /homes/hudson/.ivy2/cache/org.apache.hadoop/hadoop-common

BUILD FAILED
/grid/0/hudson/hudson-slave/workspace/Hadoop-Mapreduce-trunk-Commit/trunk/build.xml:1367:
Unable to delete directory /homes/hudson/.ivy2/cache/org.apache.hadoop/hadoop-common

Total time: 0 seconds


======================================================================
======================================================================
STORE: saving artifacts
======================================================================
======================================================================


mv: cannot stat `build/*.tar.gz': No such file or directory
mv: cannot stat `build/*.jar': No such file or directory
mv: cannot stat `build/test/findbugs': No such file or directory
mv: cannot stat `build/docs/api': No such file or directory
Build Failed
[FINDBUGS] Skipping publisher since build result is FAILURE
Publishing Javadoc
Archiving artifacts
Recording test results
Recording fingerprints
Publishing Clover coverage report...
No Clover report will be published due to a Build Failure
Email was triggered for: Failure
Sending email for trigger: Failure



###################################################################################
############################## FAILED TESTS (if any) ##############################
No tests ran.

Mime
View raw message