hadoop-mapreduce-dev mailing list archives

Site index · List index
Message view « Date » · « Thread »
Top « Date » · « Thread »
From Apache Hudson Server <hud...@hudson.apache.org>
Subject Hadoop-Mapreduce-trunk - Build # 548 - Still Failing
Date Sun, 02 Jan 2011 13:00:53 GMT
See https://hudson.apache.org/hudson/job/Hadoop-Mapreduce-trunk/548/

###################################################################################
########################## LAST 60 LINES OF THE CONSOLE ###########################
Started by timer
Building remotely on hadoop7
hudson.util.IOException2: remote file operation failed: /grid/0/hudson/hudson-slave/workspace/Hadoop-Mapreduce-trunk
at hudson.remoting.Channel@2545938c:hadoop7
	at hudson.FilePath.act(FilePath.java:749)
	at hudson.FilePath.act(FilePath.java:735)
	at hudson.scm.SubversionSCM.checkout(SubversionSCM.java:589)
	at hudson.scm.SubversionSCM.checkout(SubversionSCM.java:537)
	at hudson.model.AbstractProject.checkout(AbstractProject.java:1116)
	at hudson.model.AbstractBuild$AbstractRunner.checkout(AbstractBuild.java:479)
	at hudson.model.AbstractBuild$AbstractRunner.run(AbstractBuild.java:411)
	at hudson.model.Run.run(Run.java:1324)
	at hudson.model.FreeStyleBuild.run(FreeStyleBuild.java:46)
	at hudson.model.ResourceController.execute(ResourceController.java:88)
	at hudson.model.Executor.run(Executor.java:139)
Caused by: java.io.IOException: Unable to delete /grid/0/hudson/hudson-slave/workspace/Hadoop-Mapreduce-trunk/trunk/build/test/logs/userlogs/job_20101230131139886_0001/attempt_20101230131139886_0001_m_000000_0
	at hudson.Util.deleteFile(Util.java:261)
	at hudson.Util.deleteRecursive(Util.java:303)
	at hudson.Util.deleteContentsRecursive(Util.java:222)
	at hudson.Util.deleteRecursive(Util.java:302)
	at hudson.Util.deleteContentsRecursive(Util.java:222)
	at hudson.Util.deleteRecursive(Util.java:302)
	at hudson.Util.deleteContentsRecursive(Util.java:222)
	at hudson.Util.deleteRecursive(Util.java:302)
	at hudson.Util.deleteContentsRecursive(Util.java:222)
	at hudson.Util.deleteRecursive(Util.java:302)
	at hudson.Util.deleteContentsRecursive(Util.java:222)
	at hudson.Util.deleteRecursive(Util.java:302)
	at hudson.Util.deleteContentsRecursive(Util.java:222)
	at hudson.Util.deleteRecursive(Util.java:302)
	at hudson.Util.deleteContentsRecursive(Util.java:222)
	at hudson.scm.SubversionSCM$CheckOutTask.invoke(SubversionSCM.java:662)
	at hudson.scm.SubversionSCM$CheckOutTask.invoke(SubversionSCM.java:596)
	at hudson.FilePath$FileCallableWrapper.call(FilePath.java:1899)
	at hudson.remoting.UserRequest.perform(UserRequest.java:114)
	at hudson.remoting.UserRequest.perform(UserRequest.java:48)
	at hudson.remoting.Request$2.run(Request.java:270)
	at java.util.concurrent.Executors$RunnableAdapter.call(Executors.java:441)
	at java.util.concurrent.FutureTask$Sync.innerRun(FutureTask.java:303)
	at java.util.concurrent.FutureTask.run(FutureTask.java:138)
	at java.util.concurrent.ThreadPoolExecutor$Worker.runTask(ThreadPoolExecutor.java:886)
	at java.util.concurrent.ThreadPoolExecutor$Worker.run(ThreadPoolExecutor.java:908)
	at java.lang.Thread.run(Thread.java:619)
[FINDBUGS] Skipping publisher since build result is FAILURE
Publishing Javadoc
Archiving artifacts
Recording test results
Recording fingerprints
Publishing Clover coverage report...
No Clover report will be published due to a Build Failure
Email was triggered for: Failure
Sending email for trigger: Failure



###################################################################################
############################## FAILED TESTS (if any) ##############################
No tests ran.

Mime
View raw message