hadoop-mapreduce-dev mailing list archives

Site index · List index
Message view « Date » · « Thread »
Top « Date » · « Thread »
From Apache Hudson Server <hud...@hudson.apache.org>
Subject Hadoop-Mapreduce-trunk - Build # 521 - Still Failing
Date Tue, 07 Dec 2010 17:04:48 GMT
See https://hudson.apache.org/hudson/job/Hadoop-Mapreduce-trunk/521/

###################################################################################
########################## LAST 60 LINES OF THE CONSOLE ###########################
[...truncated 208503 lines...]
    [junit]    0.85:96549
    [junit]    0.9:96658
    [junit]    0.95:96670
    [junit] Failed Reduce CDF --------
    [junit] 0: -9223372036854775808--9223372036854775807
    [junit] map attempts to success -- 0.6567164179104478, 0.3283582089552239, 0.014925373134328358,

    [junit] ===============
    [junit] 2010-12-07 16:58:35,299 WARN  rumen.ZombieJob (ZombieJob.java:sanitizeLoggedTask(318))
- Task task_200904211745_0004_r_000025 has nulll TaskStatus
    [junit] 2010-12-07 16:58:35,299 WARN  rumen.ZombieJob (ZombieJob.java:sanitizeLoggedTask(318))
- Task task_200904211745_0004_r_000028 has nulll TaskStatus
    [junit] 2010-12-07 16:58:35,300 WARN  rumen.ZombieJob (ZombieJob.java:sanitizeLoggedTask(318))
- Task task_200904211745_0004_r_000029 has nulll TaskStatus
    [junit] 2010-12-07 16:58:35,300 WARN  rumen.ZombieJob (ZombieJob.java:sanitizeLoggedTask(318))
- Task task_200904211745_0004_r_000030 has nulll TaskStatus
    [junit] 2010-12-07 16:58:35,300 WARN  rumen.ZombieJob (ZombieJob.java:sanitizeLoggedTask(318))
- Task task_200904211745_0004_r_000031 has nulll TaskStatus
    [junit] 2010-12-07 16:58:35,301 WARN  rumen.ZombieJob (ZombieJob.java:sanitizeLoggedTask(318))
- Task task_200904211745_0004_r_000032 has nulll TaskStatus
    [junit] 2010-12-07 16:58:35,301 WARN  rumen.ZombieJob (ZombieJob.java:sanitizeLoggedTask(318))
- Task task_200904211745_0004_r_000033 has nulll TaskStatus
    [junit] 2010-12-07 16:58:35,301 WARN  rumen.ZombieJob (ZombieJob.java:sanitizeLoggedTask(318))
- Task task_200904211745_0004_r_000034 has nulll TaskStatus
    [junit] 2010-12-07 16:58:35,302 WARN  rumen.ZombieJob (ZombieJob.java:sanitizeLoggedTask(318))
- Task task_200904211745_0004_r_000035 has nulll TaskStatus
    [junit] 2010-12-07 16:58:35,302 WARN  rumen.ZombieJob (ZombieJob.java:sanitizeLoggedTask(318))
- Task task_200904211745_0004_r_000036 has nulll TaskStatus
    [junit] 2010-12-07 16:58:35,302 WARN  rumen.ZombieJob (ZombieJob.java:sanitizeLoggedTask(318))
- Task task_200904211745_0004_r_000037 has nulll TaskStatus
    [junit] 2010-12-07 16:58:35,303 WARN  rumen.ZombieJob (ZombieJob.java:sanitizeLoggedTask(318))
- Task task_200904211745_0004_r_000038 has nulll TaskStatus
    [junit] 2010-12-07 16:58:35,303 WARN  rumen.ZombieJob (ZombieJob.java:sanitizeLoggedTask(318))
- Task task_200904211745_0004_r_000039 has nulll TaskStatus
    [junit] 2010-12-07 16:58:35,304 WARN  rumen.ZombieJob (ZombieJob.java:sanitizeLoggedTask(318))
- Task task_200904211745_0004_r_000040 has nulll TaskStatus
    [junit] 2010-12-07 16:58:35,304 WARN  rumen.ZombieJob (ZombieJob.java:sanitizeLoggedTask(318))
- Task task_200904211745_0004_r_000041 has nulll TaskStatus
    [junit] 2010-12-07 16:58:35,304 WARN  rumen.ZombieJob (ZombieJob.java:sanitizeLoggedTask(318))
- Task task_200904211745_0004_r_000042 has nulll TaskStatus
    [junit] 2010-12-07 16:58:35,305 WARN  rumen.ZombieJob (ZombieJob.java:sanitizeLoggedTask(318))
- Task task_200904211745_0004_r_000043 has nulll TaskStatus
    [junit] 2010-12-07 16:58:35,305 WARN  rumen.ZombieJob (ZombieJob.java:sanitizeLoggedTask(318))
- Task task_200904211745_0004_r_000044 has nulll TaskStatus
    [junit] 2010-12-07 16:58:35,305 WARN  rumen.ZombieJob (ZombieJob.java:sanitizeLoggedTask(318))
- Task task_200904211745_0004_r_000045 has nulll TaskStatus
    [junit] 2010-12-07 16:58:35,306 WARN  rumen.ZombieJob (ZombieJob.java:sanitizeLoggedTask(318))
- Task task_200904211745_0004_r_000046 has nulll TaskStatus
    [junit] generated failed map runtime distribution
    [junit] 100000: 18592--18592
    [junit]    0.1:18592
    [junit]    0.5:18592
    [junit]    0.9:18592
    [junit] Tests run: 5, Failures: 0, Errors: 0, Time elapsed: 2.971 sec
    [junit] Running org.apache.hadoop.util.TestReflectionUtils
    [junit] Tests run: 1, Failures: 0, Errors: 0, Time elapsed: 0.332 sec
    [junit] Running org.apache.hadoop.util.TestRunJar
    [junit] Creating file/grid/0/hudson/hudson-slave/workspace/Hadoop-Mapreduce-trunk/trunk/build/test/data/out
    [junit] Tests run: 1, Failures: 0, Errors: 0, Time elapsed: 0.3 sec

checkfailure:
    [touch] Creating /grid/0/hudson/hudson-slave/workspace/Hadoop-Mapreduce-trunk/trunk/build/test/testsfailed

run-test-mapred-all-withtestcaseonly:

run-test-mapred:

BUILD FAILED
/grid/0/hudson/hudson-slave/workspace/Hadoop-Mapreduce-trunk/trunk/build.xml:811: Tests failed!

Total time: 236 minutes 24 seconds
[FINDBUGS] Skipping publisher since build result is FAILURE
Publishing Javadoc
Archiving artifacts
Recording test results
Recording fingerprints
Publishing Clover coverage report...
No Clover report will be published due to a Build Failure
Email was triggered for: Failure
Sending email for trigger: Failure



###################################################################################
############################## FAILED TESTS (if any) ##############################
1 tests failed.
FAILED:  org.apache.hadoop.mapred.TestControlledMapReduceJob.testControlledMapReduceJob

Error Message:
Timeout occurred. Please note the time in the report does not reflect the time until the timeout.

Stack Trace:
junit.framework.AssertionFailedError: Timeout occurred. Please note the time in the report
does not reflect the time until the timeout.




Mime
View raw message