hadoop-mapreduce-dev mailing list archives

Site index · List index
Message view « Date » · « Thread »
Top « Date » · « Thread »
From Apache Hudson Server <hud...@hudson.apache.org>
Subject Hadoop-Mapreduce-trunk - Build # 539 - Still Failing
Date Fri, 24 Dec 2010 13:04:33 GMT
See https://hudson.apache.org/hudson/job/Hadoop-Mapreduce-trunk/539/

###################################################################################
########################## LAST 60 LINES OF THE CONSOLE ###########################
[...truncated 4999 lines...]
     [exec] make[1]: Entering directory `/grid/0/hudson/hudson-slave/workspace/Hadoop-Mapreduce-trunk/trunk/build/c++-build/Linux-i386-32/examples/pipes'
     [exec] test -z "/grid/0/hudson/hudson-slave/workspace/Hadoop-Mapreduce-trunk/trunk/build/c++-examples/Linux-i386-32/bin"
|| /bin/mkdir -p "/grid/0/hudson/hudson-slave/workspace/Hadoop-Mapreduce-trunk/trunk/build/c++-examples/Linux-i386-32/bin"
     [exec]   /bin/bash ./libtool   --mode=install /usr/bin/install -c 'wordcount-simple'
'/grid/0/hudson/hudson-slave/workspace/Hadoop-Mapreduce-trunk/trunk/build/c++-examples/Linux-i386-32/bin/wordcount-simple'
     [exec] libtool: install: /usr/bin/install -c wordcount-simple /grid/0/hudson/hudson-slave/workspace/Hadoop-Mapreduce-trunk/trunk/build/c++-examples/Linux-i386-32/bin/wordcount-simple
     [exec]   /bin/bash ./libtool   --mode=install /usr/bin/install -c 'wordcount-part' '/grid/0/hudson/hudson-slave/workspace/Hadoop-Mapreduce-trunk/trunk/build/c++-examples/Linux-i386-32/bin/wordcount-part'
     [exec] libtool: install: /usr/bin/install -c wordcount-part /grid/0/hudson/hudson-slave/workspace/Hadoop-Mapreduce-trunk/trunk/build/c++-examples/Linux-i386-32/bin/wordcount-part
     [exec]   /bin/bash ./libtool   --mode=install /usr/bin/install -c 'wordcount-nopipe'
'/grid/0/hudson/hudson-slave/workspace/Hadoop-Mapreduce-trunk/trunk/build/c++-examples/Linux-i386-32/bin/wordcount-nopipe'
     [exec] libtool: install: /usr/bin/install -c wordcount-nopipe /grid/0/hudson/hudson-slave/workspace/Hadoop-Mapreduce-trunk/trunk/build/c++-examples/Linux-i386-32/bin/wordcount-nopipe
     [exec]   /bin/bash ./libtool   --mode=install /usr/bin/install -c 'pipes-sort' '/grid/0/hudson/hudson-slave/workspace/Hadoop-Mapreduce-trunk/trunk/build/c++-examples/Linux-i386-32/bin/pipes-sort'
     [exec] libtool: install: /usr/bin/install -c pipes-sort /grid/0/hudson/hudson-slave/workspace/Hadoop-Mapreduce-trunk/trunk/build/c++-examples/Linux-i386-32/bin/pipes-sort
     [exec] make[1]: Nothing to be done for `install-data-am'.
     [exec] make[1]: Leaving directory `/grid/0/hudson/hudson-slave/workspace/Hadoop-Mapreduce-trunk/trunk/build/c++-build/Linux-i386-32/examples/pipes'

compile-c++-examples:

compile-examples:
    [javac] Compiling 43 source files to /grid/0/hudson/hudson-slave/workspace/Hadoop-Mapreduce-trunk/trunk/build/examples
    [javac] Note: Some input files use or override a deprecated API.
    [javac] Note: Recompile with -Xlint:deprecation for details.

examples:
      [jar] Building jar: /grid/0/hudson/hudson-slave/workspace/Hadoop-Mapreduce-trunk/trunk/build/hadoop-mapred-examples-2010-12-24_13-00-55.jar
      [jar] Building jar: /grid/0/hudson/hudson-slave/workspace/Hadoop-Mapreduce-trunk/trunk/build/hadoop-mapred-examples-2010-12-24_13-00-55-sources.jar

ivy-resolve-test:

ivy-retrieve-test:

compile-mapred-test:
    [mkdir] Created dir: /grid/0/hudson/hudson-slave/workspace/Hadoop-Mapreduce-trunk/trunk/build/test/mapred/classes
    [mkdir] Created dir: /grid/0/hudson/hudson-slave/workspace/Hadoop-Mapreduce-trunk/trunk/build/test/mapred/testjar
    [mkdir] Created dir: /grid/0/hudson/hudson-slave/workspace/Hadoop-Mapreduce-trunk/trunk/build/test/mapred/testshell
    [javac] Compiling 321 source files to /grid/0/hudson/hudson-slave/workspace/Hadoop-Mapreduce-trunk/trunk/build/test/mapred/classes
    [javac] /grid/0/hudson/hudson-slave/workspace/Hadoop-Mapreduce-trunk/trunk/src/test/mapred/org/apache/hadoop/security/TestMapredGroupMappingServiceRefresh.java:66:
org.apache.hadoop.security.TestMapredGroupMappingServiceRefresh.MockUnixGroupsMapping is not
abstract and does not override abstract method cacheGroupsAdd(java.util.List<java.lang.String>)
in org.apache.hadoop.security.GroupMappingServiceProvider
    [javac]   public static class MockUnixGroupsMapping implements GroupMappingServiceProvider
{
    [javac]                 ^
    [javac] Note: Some input files use or override a deprecated API.
    [javac] Note: Recompile with -Xlint:deprecation for details.
    [javac] 1 error

BUILD FAILED
/grid/0/hudson/hudson-slave/workspace/Hadoop-Mapreduce-trunk/trunk/build.xml:527: The following
error occurred while executing this line:
/grid/0/hudson/hudson-slave/workspace/Hadoop-Mapreduce-trunk/trunk/build.xml:596: Compile
failed; see the compiler error output for details.

Total time: 3 minutes 16 seconds
+ RESULT=1
+ [ 1 != 0 ]
+ echo Build Failed: remaining tests not run
Build Failed: remaining tests not run
+ exit 1
[FINDBUGS] Skipping publisher since build result is FAILURE
Publishing Javadoc
Archiving artifacts
Recording test results
Recording fingerprints
Publishing Clover coverage report...
No Clover report will be published due to a Build Failure
Email was triggered for: Failure
Sending email for trigger: Failure



###################################################################################
############################## FAILED TESTS (if any) ##############################
No tests ran.

Mime
View raw message