hadoop-mapreduce-dev mailing list archives

Site index · List index
Message view « Date » · « Thread »
Top « Date » · « Thread »
From Apache Hudson Server <hud...@hudson.apache.org>
Subject Hadoop-Mapreduce-21-Build - Build # 127 - Still Failing
Date Tue, 21 Dec 2010 21:31:25 GMT
See https://hudson.apache.org/hudson/job/Hadoop-Mapreduce-21-Build/127/

###################################################################################
########################## LAST 60 LINES OF THE CONSOLE ###########################
[...truncated 2241 lines...]

clover:

ivy-download:
      [get] Getting: http://repo2.maven.org/maven2/org/apache/ivy/ivy/2.1.0/ivy-2.1.0.jar
      [get] To: /grid/0/hudson/hudson-slave/workspace/Hadoop-Mapreduce-21-Build/trunk/ivy/ivy-2.1.0.jar

ivy-init-dirs:
    [mkdir] Created dir: /grid/0/hudson/hudson-slave/workspace/Hadoop-Mapreduce-21-Build/trunk/build/ivy
    [mkdir] Created dir: /grid/0/hudson/hudson-slave/workspace/Hadoop-Mapreduce-21-Build/trunk/build/ivy/lib
    [mkdir] Created dir: /grid/0/hudson/hudson-slave/workspace/Hadoop-Mapreduce-21-Build/trunk/build/ivy/report
    [mkdir] Created dir: /grid/0/hudson/hudson-slave/workspace/Hadoop-Mapreduce-21-Build/trunk/build/ivy/maven

ivy-probe-antlib:

ivy-init-antlib:

ivy-init:
[ivy:configure] :: Ivy 2.1.0 - 20090925235825 :: http://ant.apache.org/ivy/ ::
[ivy:configure] :: loading settings :: file = /grid/0/hudson/hudson-slave/workspace/Hadoop-Mapreduce-21-Build/trunk/ivy/ivysettings.xml

ivy-resolve-common:
[ivy:resolve] downloading https://repository.apache.org/content/repositories/snapshots/org/apache/hadoop/hadoop-common-test/0.21.0-SNAPSHOT/hadoop-common-test-0.21.0-20101120.093342-38.jar
...
[ivy:resolve] ...........................................................................................
(608kB)
[ivy:resolve] .. (0kB)
[ivy:resolve] downloading https://repository.apache.org/content/repositories/snapshots/org/apache/hadoop/hadoop-hdfs/0.21.0-SNAPSHOT/hadoop-hdfs-0.21.0-20101124.061852-75.jar
...
[ivy:resolve] ..........................................................................................................................................
(912kB)
[ivy:resolve] .. (0kB)
[ivy:resolve] 	[SUCCESSFUL ] org.apache.hadoop#hadoop-hdfs;0.21.0-SNAPSHOT!hadoop-hdfs.jar
(374ms)
[ivy:resolve] 
[ivy:resolve] :: problems summary ::
[ivy:resolve] :::: WARNINGS
[ivy:resolve] 		[FAILED     ] org.apache.hadoop#hadoop-common-test;0.21.0-SNAPSHOT!hadoop-common-test.jar:
/homes/hudson/.ivy2/cache/org.apache.hadoop/hadoop-common-test/jars/hadoop-common-test-0.21.0-SNAPSHOT.jar.part
(No such file or directory) (486ms)
[ivy:resolve] 		[FAILED     ] org.apache.hadoop#hadoop-common-test;0.21.0-SNAPSHOT!hadoop-common-test.jar:
 (0ms)
[ivy:resolve] 	==== apache-snapshot: tried
[ivy:resolve] 	  https://repository.apache.org/content/repositories/snapshots/org/apache/hadoop/hadoop-common-test/0.21.0-SNAPSHOT/hadoop-common-test-0.21.0-20101120.093342-38.jar
[ivy:resolve] 	==== maven2: tried
[ivy:resolve] 	  http://repo1.maven.org/maven2/org/apache/hadoop/hadoop-common-test/0.21.0-SNAPSHOT/hadoop-common-test-0.21.0-SNAPSHOT.jar
[ivy:resolve] 		::::::::::::::::::::::::::::::::::::::::::::::
[ivy:resolve] 		::              FAILED DOWNLOADS            ::
[ivy:resolve] 		:: ^ see resolution messages for details  ^ ::
[ivy:resolve] 		::::::::::::::::::::::::::::::::::::::::::::::
[ivy:resolve] 		:: org.apache.hadoop#hadoop-common-test;0.21.0-SNAPSHOT!hadoop-common-test.jar
[ivy:resolve] 		::::::::::::::::::::::::::::::::::::::::::::::
[ivy:resolve] 
[ivy:resolve] :: USE VERBOSE OR DEBUG MESSAGE LEVEL FOR MORE DETAILS

BUILD FAILED
/grid/0/hudson/hudson-slave/workspace/Hadoop-Mapreduce-21-Build/trunk/build.xml:1861: impossible
to resolve dependencies:
	resolve failed - see output for details

Total time: 9 seconds
Publishing Javadoc
Archiving artifacts
Recording test results
Recording fingerprints
Description set: 
Email was triggered for: Failure
Sending email for trigger: Failure



###################################################################################
############################## FAILED TESTS (if any) ##############################
No tests ran.

Mime
View raw message