hadoop-mapreduce-dev mailing list archives

Site index · List index
Message view « Date » · « Thread »
Top « Date » · « Thread »
From Apache Hudson Server <hud...@hudson.apache.org>
Subject Build failed in Hudson: Hadoop-Mapreduce-trunk-Commit #526
Date Tue, 02 Nov 2010 05:43:20 GMT
See <https://hudson.apache.org/hudson/job/Hadoop-Mapreduce-trunk-Commit/526/changes>

Changes:

[nigel] HADOOP-7008. Enable test-patch.sh to have a configured number of acceptable findbugs
and javadoc warnings. Contributed by nigel and gkesavan.

------------------------------------------
[...truncated 2304 lines...]
A         hudsonEnv.sh
AU        hudsonBuildHadoopNightly.sh
AU        hudsonBuildHadoopPatch.sh
AU        hudsonBuildHadoopRelease.sh
AU        processHadoopPatchEmailRemote.sh
AU        hudsonPatchQueueAdmin.sh
AU        processHadoopPatchEmail.sh
A         README.txt
A         test-patch
A         test-patch/test-patch.sh
At revision 1029958
no change for http://svn.apache.org/repos/asf/hadoop/mapreduce/trunk since the previous build
no change for http://svn.apache.org/repos/asf/hadoop/nightly since the previous build
[Hadoop-Mapreduce-trunk-Commit] $ /bin/bash /tmp/hudson6933537414017006840.sh
Buildfile: build.xml

clean-contrib:

clean:

clean:
     [echo] contrib: block_forensics

clean:
     [echo] contrib: capacity-scheduler

clean:
     [echo] contrib: datajoin

clean:
     [echo] contrib: dynamic-priority

clean:
     [echo] contrib: eclipse-plugin

clean:
     [echo] contrib: fairscheduler

clean:
     [echo] contrib: gridmix

clean:
     [echo] contrib: index

clean:
     [echo] contrib: mrunit

clean:
     [echo] contrib: mumak

clean:
     [echo] contrib: raid

clean:
     [echo] contrib: streaming

clean:
     [echo] contrib: vaidya

clean:
     [echo] contrib: vertica

clean-fi:

clean:

BUILD SUCCESSFUL
Total time: 0 seconds
Buildfile: build.xml

clean-cache:
   [delete] Deleting directory /homes/hudson/.ivy2/cache/org.apache.hadoop/hadoop-common
   [delete] Deleting directory /homes/hudson/.ivy2/cache/org.apache.hadoop/hadoop-common-test
   [delete] Deleting directory /homes/hudson/.ivy2/cache/org.apache.hadoop/hadoop-hdfs
   [delete] Deleting directory /homes/hudson/.ivy2/cache/org.apache.hadoop/hadoop-hdfs-test

clean-contrib:

clean:

clean:
     [echo] contrib: block_forensics

clean:
     [echo] contrib: capacity-scheduler

clean:
     [echo] contrib: datajoin

clean:
     [echo] contrib: dynamic-priority

clean:
     [echo] contrib: eclipse-plugin

clean:
     [echo] contrib: fairscheduler

clean:
     [echo] contrib: gridmix

clean:
     [echo] contrib: index

clean:
     [echo] contrib: mrunit

clean:
     [echo] contrib: mumak

clean:
     [echo] contrib: raid

clean:
     [echo] contrib: streaming

clean:
     [echo] contrib: vaidya

clean:
     [echo] contrib: vertica

clean-fi:

clean:

veryclean:

ant-task-download:
      [get] Getting: http://repo2.maven.org/maven2/org/apache/maven/maven-ant-tasks/2.0.10/maven-ant-tasks-2.0.10.jar
      [get] To: <https://hudson.apache.org/hudson/job/Hadoop-Mapreduce-trunk-Commit/ws/trunk/ivy/maven-ant-tasks-2.0.10.jar>

mvn-taskdef:

clover.setup:

clover.info:

clover:

ivy-download:
      [get] Getting: http://repo2.maven.org/maven2/org/apache/ivy/ivy/2.1.0/ivy-2.1.0.jar
      [get] To: <https://hudson.apache.org/hudson/job/Hadoop-Mapreduce-trunk-Commit/ws/trunk/ivy/ivy-2.1.0.jar>

ivy-init-dirs:
    [mkdir] Created dir: <https://hudson.apache.org/hudson/job/Hadoop-Mapreduce-trunk-Commit/ws/trunk/build/ivy>
    [mkdir] Created dir: <https://hudson.apache.org/hudson/job/Hadoop-Mapreduce-trunk-Commit/ws/trunk/build/ivy/lib>
    [mkdir] Created dir: <https://hudson.apache.org/hudson/job/Hadoop-Mapreduce-trunk-Commit/ws/trunk/build/ivy/report>
    [mkdir] Created dir: <https://hudson.apache.org/hudson/job/Hadoop-Mapreduce-trunk-Commit/ws/trunk/build/ivy/maven>

ivy-probe-antlib:

ivy-init-antlib:

ivy-init:
[ivy:configure] :: Ivy 2.1.0 - 20090925235825 :: http://ant.apache.org/ivy/ ::
[ivy:configure] :: loading settings :: file = <https://hudson.apache.org/hudson/job/Hadoop-Mapreduce-trunk-Commit/ws/trunk/ivy/ivysettings.xml>

ivy-resolve-common:
[ivy:resolve] downloading https://repository.apache.org/content/repositories/snapshots/org/apache/hadoop/hadoop-common/0.22.0-SNAPSHOT/hadoop-common-0.22.0-20101102.054241-121.jar
...
[ivy:resolve] ........................................................................................................................................................................................................
(1334kB)
[ivy:resolve] .. (0kB)
[ivy:resolve] 	[SUCCESSFUL ] org.apache.hadoop#hadoop-common;0.22.0-SNAPSHOT!hadoop-common.jar
(844ms)
[ivy:resolve] downloading https://repository.apache.org/content/repositories/snapshots/org/apache/hadoop/hadoop-common-test/0.22.0-SNAPSHOT/hadoop-common-test-0.22.0-20101101.223250-116.jar
...
[ivy:resolve] .................................................................................................
(657kB)
[ivy:resolve] .. (0kB)
[ivy:resolve] 	[SUCCESSFUL ] org.apache.hadoop#hadoop-common-test;0.22.0-SNAPSHOT!hadoop-common-test.jar
(486ms)
[ivy:resolve] downloading https://repository.apache.org/content/repositories/snapshots/org/apache/hadoop/hadoop-hdfs/0.22.0-SNAPSHOT/hadoop-hdfs-0.22.0-20101029.231309-282.jar
...
[ivy:resolve] ...................................................................................................................................................
(995kB)
[ivy:resolve] .. (0kB)
[ivy:resolve] 	[SUCCESSFUL ] org.apache.hadoop#hadoop-hdfs;0.22.0-SNAPSHOT!hadoop-hdfs.jar
(878ms)
[ivy:resolve] downloading http://repo1.maven.org/maven2/org/mortbay/jetty/jetty/6.1.24/jetty-6.1.24.jar
...
[ivy:resolve] ........................................................................................................................................................................................................................................................................................................................................
(525kB)
[ivy:resolve] .. (0kB)
[ivy:resolve] 	[SUCCESSFUL ] org.mortbay.jetty#jetty;6.1.24!jetty.jar (1654ms)
[ivy:resolve] downloading http://repo1.maven.org/maven2/org/mortbay/jetty/jetty-util/6.1.24/jetty-util-6.1.24.jar
...
[ivy:resolve] .....................................................................................................
(173kB)
[ivy:resolve] .. (0kB)
[ivy:resolve] 	[SUCCESSFUL ] org.mortbay.jetty#jetty-util;6.1.24!jetty-util.jar (1891ms)
[ivy:resolve] downloading http://repo1.maven.org/maven2/tomcat/jasper-runtime/5.5.23/jasper-runtime-5.5.23.jar
...
[ivy:resolve] .................................................. (75kB)
[ivy:resolve] .. (0kB)
[ivy:resolve] 	[SUCCESSFUL ] tomcat#jasper-runtime;5.5.23!jasper-runtime.jar (1887ms)
[ivy:resolve] downloading http://repo1.maven.org/maven2/org/codehaus/jackson/jackson-core-asl/1.5.2/jackson-core-asl-1.5.2.jar
...
[ivy:resolve] ...................................................................................................................
(167kB)
[ivy:resolve] .. (0kB)
[ivy:resolve] 	[SUCCESSFUL ] org.codehaus.jackson#jackson-core-asl;1.5.2!jackson-core-asl.jar
(2062ms)
[ivy:resolve] downloading http://repo1.maven.org/maven2/org/codehaus/jackson/jackson-mapper-asl/1.5.2/jackson-mapper-asl-1.5.2.jar
...
[ivy:resolve] .........................................................................................................................................................................................................................................................................................................................................
(473kB)
[ivy:resolve] .. (0kB)
[ivy:resolve] 	[SUCCESSFUL ] org.codehaus.jackson#jackson-mapper-asl;1.5.2!jackson-mapper-asl.jar
(2385ms)
[ivy:resolve] downloading http://repo1.maven.org/maven2/javax/mail/mail/1.4/mail-1.4.jar ...
[ivy:resolve] .....................................................................................................................................................................................................................................................................
(379kB)
[ivy:resolve] .. (0kB)
[ivy:resolve] 	[SUCCESSFUL ] javax.mail#mail;1.4!mail.jar (2204ms)
[ivy:resolve] downloading http://repo1.maven.org/maven2/javax/activation/activation/1.1/activation-1.1.jar
...
[ivy:resolve] ....................................... (61kB)
[ivy:resolve] .. (0kB)
[ivy:resolve] 	[SUCCESSFUL ] javax.activation#activation;1.1!activation.jar (1900ms)
[ivy:resolve] downloading http://repo1.maven.org/maven2/javax/servlet/servlet-api/2.4/servlet-api-2.4.jar
...
[ivy:resolve] .................................................................. (95kB)
[ivy:resolve] .. (0kB)
[ivy:resolve] 	[SUCCESSFUL ] javax.servlet#servlet-api;2.4!servlet-api.jar (1886ms)
[ivy:resolve] 
[ivy:resolve] :: problems summary ::
[ivy:resolve] :::: WARNINGS
[ivy:resolve] 		[FAILED     ] javax.jms#jms;1.1!jms.jar:  (0ms)
[ivy:resolve] 	==== apache-snapshot: tried
[ivy:resolve] 	  https://repository.apache.org/content/repositories/snapshots/javax/jms/jms/1.1/jms-1.1.jar
[ivy:resolve] 	==== maven2: tried
[ivy:resolve] 	  http://repo1.maven.org/maven2/javax/jms/jms/1.1/jms-1.1.jar
[ivy:resolve] 		[FAILED     ] com.sun.jdmk#jmxtools;1.2.1!jmxtools.jar:  (0ms)
[ivy:resolve] 	==== apache-snapshot: tried
[ivy:resolve] 	  https://repository.apache.org/content/repositories/snapshots/com/sun/jdmk/jmxtools/1.2.1/jmxtools-1.2.1.jar
[ivy:resolve] 	==== maven2: tried
[ivy:resolve] 	  http://repo1.maven.org/maven2/com/sun/jdmk/jmxtools/1.2.1/jmxtools-1.2.1.jar
[ivy:resolve] 		[FAILED     ] com.sun.jmx#jmxri;1.2.1!jmxri.jar:  (0ms)
[ivy:resolve] 	==== apache-snapshot: tried
[ivy:resolve] 	  https://repository.apache.org/content/repositories/snapshots/com/sun/jmx/jmxri/1.2.1/jmxri-1.2.1.jar
[ivy:resolve] 	==== maven2: tried
[ivy:resolve] 	  http://repo1.maven.org/maven2/com/sun/jmx/jmxri/1.2.1/jmxri-1.2.1.jar
[ivy:resolve] 		::::::::::::::::::::::::::::::::::::::::::::::
[ivy:resolve] 		::              FAILED DOWNLOADS            ::
[ivy:resolve] 		:: ^ see resolution messages for details  ^ ::
[ivy:resolve] 		::::::::::::::::::::::::::::::::::::::::::::::
[ivy:resolve] 		:: javax.jms#jms;1.1!jms.jar
[ivy:resolve] 		:: com.sun.jdmk#jmxtools;1.2.1!jmxtools.jar
[ivy:resolve] 		:: com.sun.jmx#jmxri;1.2.1!jmxri.jar
[ivy:resolve] 		::::::::::::::::::::::::::::::::::::::::::::::
[ivy:resolve] 
[ivy:resolve] :: USE VERBOSE OR DEBUG MESSAGE LEVEL FOR MORE DETAILS

BUILD FAILED
<https://hudson.apache.org/hudson/job/Hadoop-Mapreduce-trunk-Commit/ws/trunk/build.xml>:1868:
impossible to resolve dependencies:
	resolve failed - see output for details

Total time: 1 minute 17 seconds
mv: cannot stat `build/*.tar.tgz': No such file or directory
mv: cannot stat `build/*.jar': No such file or directory
mv: cannot stat `build/test/findbugs': No such file or directory
mv: cannot stat `build/docs/api': No such file or directory
Build Failed
[FINDBUGS] Skipping publisher since build result is FAILURE
Publishing Javadoc
Archiving artifacts
Recording test results
Recording fingerprints
Publishing Clover coverage report...
No Clover report will be published due to a Build Failure


Mime
View raw message