hadoop-mapreduce-dev mailing list archives

Site index · List index
Message view « Date » · « Thread »
Top « Date » · « Thread »
From Apache Hudson Server <hud...@hudson.apache.org>
Subject Hadoop-Mapreduce-22-branch - Build # 1 - Failure
Date Wed, 24 Nov 2010 11:23:30 GMT
See https://hudson.apache.org/hudson/job/Hadoop-Mapreduce-22-branch/1/

###################################################################################
########################## LAST 60 LINES OF THE CONSOLE ###########################
[...truncated 207876 lines...]
    [junit]    0.85:96549
    [junit]    0.9:96658
    [junit]    0.95:96670
    [junit] Failed Reduce CDF --------
    [junit] 0: -9223372036854775808--9223372036854775807
    [junit] map attempts to success -- 0.6567164179104478, 0.3283582089552239, 0.014925373134328358,

    [junit] ===============
    [junit] 2010-11-24 11:25:01,323 WARN  rumen.ZombieJob (ZombieJob.java:sanitizeLoggedTask(318))
- Task task_200904211745_0004_r_000025 has nulll TaskStatus
    [junit] 2010-11-24 11:25:01,323 WARN  rumen.ZombieJob (ZombieJob.java:sanitizeLoggedTask(318))
- Task task_200904211745_0004_r_000028 has nulll TaskStatus
    [junit] 2010-11-24 11:25:01,324 WARN  rumen.ZombieJob (ZombieJob.java:sanitizeLoggedTask(318))
- Task task_200904211745_0004_r_000029 has nulll TaskStatus
    [junit] 2010-11-24 11:25:01,324 WARN  rumen.ZombieJob (ZombieJob.java:sanitizeLoggedTask(318))
- Task task_200904211745_0004_r_000030 has nulll TaskStatus
    [junit] 2010-11-24 11:25:01,324 WARN  rumen.ZombieJob (ZombieJob.java:sanitizeLoggedTask(318))
- Task task_200904211745_0004_r_000031 has nulll TaskStatus
    [junit] 2010-11-24 11:25:01,325 WARN  rumen.ZombieJob (ZombieJob.java:sanitizeLoggedTask(318))
- Task task_200904211745_0004_r_000032 has nulll TaskStatus
    [junit] 2010-11-24 11:25:01,325 WARN  rumen.ZombieJob (ZombieJob.java:sanitizeLoggedTask(318))
- Task task_200904211745_0004_r_000033 has nulll TaskStatus
    [junit] 2010-11-24 11:25:01,325 WARN  rumen.ZombieJob (ZombieJob.java:sanitizeLoggedTask(318))
- Task task_200904211745_0004_r_000034 has nulll TaskStatus
    [junit] 2010-11-24 11:25:01,326 WARN  rumen.ZombieJob (ZombieJob.java:sanitizeLoggedTask(318))
- Task task_200904211745_0004_r_000035 has nulll TaskStatus
    [junit] 2010-11-24 11:25:01,326 WARN  rumen.ZombieJob (ZombieJob.java:sanitizeLoggedTask(318))
- Task task_200904211745_0004_r_000036 has nulll TaskStatus
    [junit] 2010-11-24 11:25:01,326 WARN  rumen.ZombieJob (ZombieJob.java:sanitizeLoggedTask(318))
- Task task_200904211745_0004_r_000037 has nulll TaskStatus
    [junit] 2010-11-24 11:25:01,327 WARN  rumen.ZombieJob (ZombieJob.java:sanitizeLoggedTask(318))
- Task task_200904211745_0004_r_000038 has nulll TaskStatus
    [junit] 2010-11-24 11:25:01,327 WARN  rumen.ZombieJob (ZombieJob.java:sanitizeLoggedTask(318))
- Task task_200904211745_0004_r_000039 has nulll TaskStatus
    [junit] 2010-11-24 11:25:01,327 WARN  rumen.ZombieJob (ZombieJob.java:sanitizeLoggedTask(318))
- Task task_200904211745_0004_r_000040 has nulll TaskStatus
    [junit] 2010-11-24 11:25:01,328 WARN  rumen.ZombieJob (ZombieJob.java:sanitizeLoggedTask(318))
- Task task_200904211745_0004_r_000041 has nulll TaskStatus
    [junit] 2010-11-24 11:25:01,328 WARN  rumen.ZombieJob (ZombieJob.java:sanitizeLoggedTask(318))
- Task task_200904211745_0004_r_000042 has nulll TaskStatus
    [junit] 2010-11-24 11:25:01,328 WARN  rumen.ZombieJob (ZombieJob.java:sanitizeLoggedTask(318))
- Task task_200904211745_0004_r_000043 has nulll TaskStatus
    [junit] 2010-11-24 11:25:01,329 WARN  rumen.ZombieJob (ZombieJob.java:sanitizeLoggedTask(318))
- Task task_200904211745_0004_r_000044 has nulll TaskStatus
    [junit] 2010-11-24 11:25:01,329 WARN  rumen.ZombieJob (ZombieJob.java:sanitizeLoggedTask(318))
- Task task_200904211745_0004_r_000045 has nulll TaskStatus
    [junit] 2010-11-24 11:25:01,330 WARN  rumen.ZombieJob (ZombieJob.java:sanitizeLoggedTask(318))
- Task task_200904211745_0004_r_000046 has nulll TaskStatus
    [junit] generated failed map runtime distribution
    [junit] 100000: 18592--18592
    [junit]    0.1:18592
    [junit]    0.5:18592
    [junit]    0.9:18592
    [junit] Tests run: 5, Failures: 0, Errors: 0, Time elapsed: 2.87 sec
    [junit] Running org.apache.hadoop.util.TestReflectionUtils
    [junit] Tests run: 1, Failures: 0, Errors: 0, Time elapsed: 0.345 sec
    [junit] Running org.apache.hadoop.util.TestRunJar
    [junit] Creating file/grid/0/hudson/hudson-slave/workspace/Hadoop-Mapreduce-22-branch/trunk/build/test/data/out
    [junit] Tests run: 1, Failures: 0, Errors: 0, Time elapsed: 0.325 sec

checkfailure:
    [touch] Creating /grid/0/hudson/hudson-slave/workspace/Hadoop-Mapreduce-22-branch/trunk/build/test/testsfailed

run-test-mapred-all-withtestcaseonly:

run-test-mapred:

BUILD FAILED
/grid/0/hudson/hudson-slave/workspace/Hadoop-Mapreduce-22-branch/trunk/build.xml:809: Tests
failed!

Total time: 245 minutes 8 seconds
[FINDBUGS] Skipping publisher since build result is FAILURE
Publishing Javadoc
Archiving artifacts
Recording test results
Recording fingerprints
Publishing Clover coverage report...
No Clover report will be published due to a Build Failure
Email was triggered for: Failure
Sending email for trigger: Failure



###################################################################################
############################## FAILED TESTS (if any) ##############################
3 tests failed.
FAILED:  org.apache.hadoop.mapred.TestControlledMapReduceJob.testControlledMapReduceJob

Error Message:
Timeout occurred. Please note the time in the report does not reflect the time until the timeout.

Stack Trace:
junit.framework.AssertionFailedError: Timeout occurred. Please note the time in the report
does not reflect the time until the timeout.


FAILED:  org.apache.hadoop.mapreduce.TestLocalRunner.testMultiMaps

Error Message:
Timeout occurred. Please note the time in the report does not reflect the time until the timeout.

Stack Trace:
junit.framework.AssertionFailedError: Timeout occurred. Please note the time in the report
does not reflect the time until the timeout.


FAILED:  <init>.org.apache.hadoop.mapreduce.security.TestUmbilicalProtocolWithJobToken

Error Message:
null

Stack Trace:
java.lang.ExceptionInInitializerError
	at org.apache.hadoop.security.UserGroupInformation.initialize(UserGroupInformation.java:219)
	at org.apache.hadoop.security.UserGroupInformation.setConfiguration(UserGroupInformation.java:262)
	at org.apache.hadoop.mapreduce.security.TestUmbilicalProtocolWithJobToken.<clinit>(TestUmbilicalProtocolWithJobToken.java:63)
	at java.lang.Class.forName0(Native Method)
	at java.lang.Class.forName(Class.java:169)
Caused by: java.lang.IllegalArgumentException: Can't get Kerberos configuration
	at org.apache.hadoop.security.KerberosName.<clinit>(KerberosName.java:89)
Caused by: KrbException: Could not load configuration file /etc/krb5.conf (No such file or
directory)
	at sun.security.krb5.Config.<init>(Config.java:147)
	at sun.security.krb5.Config.getInstance(Config.java:79)
	at org.apache.hadoop.security.KerberosName.<clinit>(KerberosName.java:85)
Caused by: java.io.FileNotFoundException: /etc/krb5.conf (No such file or directory)
	at java.io.FileInputStream.open(Native Method)
	at java.io.FileInputStream.<init>(FileInputStream.java:106)
	at java.io.FileInputStream.<init>(FileInputStream.java:66)
	at sun.security.krb5.Config$1.run(Config.java:539)
	at java.security.AccessController.doPrivileged(Native Method)
	at sun.security.krb5.Config.loadConfigFile(Config.java:535)
	at sun.security.krb5.Config.<init>(Config.java:144)




Mime
View raw message