hadoop-hive-dev mailing list archives

Site index · List index
Message view « Date » · « Thread »
Top « Date » · « Thread »
From Apache Hudson Server <hud...@hudson.zones.apache.org>
Subject Build failed in Hudson: Hive-trunk-h0.19 #499
Date Mon, 19 Jul 2010 17:26:12 GMT
See <http://hudson.zones.apache.org/hudson/job/Hive-trunk-h0.19/499/>

------------------------------------------
[...truncated 6147 lines...]
    [junit] diff -a -I file: -I /tmp/ -I invalidscheme: -I lastUpdateTime -I lastAccessTime
-I owner -I transient_lastDdlTime -I java.lang.RuntimeException -I at org -I at sun -I at
java -I at junit -I Caused by: -I [.][.][.] [0-9]* more <http://hudson.zones.apache.org/hudson/job/Hive-trunk-h0.19/ws/hive/build/ql/test/logs/clientpositive/input39.q.out>
<http://hudson.zones.apache.org/hudson/job/Hive-trunk-h0.19/ws/hive/ql/src/test/results/clientpositive/input39.q.out>
    [junit] Done query: input39.q
    [junit] Begin query: input3_limit.q
    [junit] diff -a -I file: -I /tmp/ -I invalidscheme: -I lastUpdateTime -I lastAccessTime
-I owner -I transient_lastDdlTime -I java.lang.RuntimeException -I at org -I at sun -I at
java -I at junit -I Caused by: -I [.][.][.] [0-9]* more <http://hudson.zones.apache.org/hudson/job/Hive-trunk-h0.19/ws/hive/build/ql/test/logs/clientpositive/input3_limit.q.out>
<http://hudson.zones.apache.org/hudson/job/Hive-trunk-h0.19/ws/hive/ql/src/test/results/clientpositive/input3_limit.q.out>
    [junit] Done query: input3_limit.q
    [junit] Begin query: input4.q
    [junit] diff -a -I file: -I /tmp/ -I invalidscheme: -I lastUpdateTime -I lastAccessTime
-I owner -I transient_lastDdlTime -I java.lang.RuntimeException -I at org -I at sun -I at
java -I at junit -I Caused by: -I [.][.][.] [0-9]* more <http://hudson.zones.apache.org/hudson/job/Hive-trunk-h0.19/ws/hive/build/ql/test/logs/clientpositive/input4.q.out>
<http://hudson.zones.apache.org/hudson/job/Hive-trunk-h0.19/ws/hive/ql/src/test/results/clientpositive/input4.q.out>
    [junit] Done query: input4.q
    [junit] Begin query: input40.q
    [junit] diff -a -I file: -I /tmp/ -I invalidscheme: -I lastUpdateTime -I lastAccessTime
-I owner -I transient_lastDdlTime -I java.lang.RuntimeException -I at org -I at sun -I at
java -I at junit -I Caused by: -I [.][.][.] [0-9]* more <http://hudson.zones.apache.org/hudson/job/Hive-trunk-h0.19/ws/hive/build/ql/test/logs/clientpositive/input40.q.out>
<http://hudson.zones.apache.org/hudson/job/Hive-trunk-h0.19/ws/hive/ql/src/test/results/clientpositive/input40.q.out>
    [junit] Done query: input40.q
    [junit] Begin query: input41.q
    [junit] diff -a -I file: -I /tmp/ -I invalidscheme: -I lastUpdateTime -I lastAccessTime
-I owner -I transient_lastDdlTime -I java.lang.RuntimeException -I at org -I at sun -I at
java -I at junit -I Caused by: -I [.][.][.] [0-9]* more <http://hudson.zones.apache.org/hudson/job/Hive-trunk-h0.19/ws/hive/build/ql/test/logs/clientpositive/input41.q.out>
<http://hudson.zones.apache.org/hudson/job/Hive-trunk-h0.19/ws/hive/ql/src/test/results/clientpositive/input41.q.out>
    [junit] Done query: input41.q
    [junit] Begin query: input42.q
    [junit] diff -a -I file: -I /tmp/ -I invalidscheme: -I lastUpdateTime -I lastAccessTime
-I owner -I transient_lastDdlTime -I java.lang.RuntimeException -I at org -I at sun -I at
java -I at junit -I Caused by: -I [.][.][.] [0-9]* more <http://hudson.zones.apache.org/hudson/job/Hive-trunk-h0.19/ws/hive/build/ql/test/logs/clientpositive/input42.q.out>
<http://hudson.zones.apache.org/hudson/job/Hive-trunk-h0.19/ws/hive/ql/src/test/results/clientpositive/input42.q.out>
    [junit] Done query: input42.q
    [junit] Begin query: input4_cb_delim.q
    [junit] diff -a -I file: -I /tmp/ -I invalidscheme: -I lastUpdateTime -I lastAccessTime
-I owner -I transient_lastDdlTime -I java.lang.RuntimeException -I at org -I at sun -I at
java -I at junit -I Caused by: -I [.][.][.] [0-9]* more <http://hudson.zones.apache.org/hudson/job/Hive-trunk-h0.19/ws/hive/build/ql/test/logs/clientpositive/input4_cb_delim.q.out>
<http://hudson.zones.apache.org/hudson/job/Hive-trunk-h0.19/ws/hive/ql/src/test/results/clientpositive/input4_cb_delim.q.out>
    [junit] Done query: input4_cb_delim.q
    [junit] Begin query: input4_limit.q
    [junit] diff -a -I file: -I /tmp/ -I invalidscheme: -I lastUpdateTime -I lastAccessTime
-I owner -I transient_lastDdlTime -I java.lang.RuntimeException -I at org -I at sun -I at
java -I at junit -I Caused by: -I [.][.][.] [0-9]* more <http://hudson.zones.apache.org/hudson/job/Hive-trunk-h0.19/ws/hive/build/ql/test/logs/clientpositive/input4_limit.q.out>
<http://hudson.zones.apache.org/hudson/job/Hive-trunk-h0.19/ws/hive/ql/src/test/results/clientpositive/input4_limit.q.out>
    [junit] Done query: input4_limit.q
    [junit] Begin query: input5.q
    [junit] diff -a -I file: -I /tmp/ -I invalidscheme: -I lastUpdateTime -I lastAccessTime
-I owner -I transient_lastDdlTime -I java.lang.RuntimeException -I at org -I at sun -I at
java -I at junit -I Caused by: -I [.][.][.] [0-9]* more <http://hudson.zones.apache.org/hudson/job/Hive-trunk-h0.19/ws/hive/build/ql/test/logs/clientpositive/input5.q.out>
<http://hudson.zones.apache.org/hudson/job/Hive-trunk-h0.19/ws/hive/ql/src/test/results/clientpositive/input5.q.out>
    [junit] Done query: input5.q
    [junit] Begin query: input6.q
    [junit] diff -a -I file: -I /tmp/ -I invalidscheme: -I lastUpdateTime -I lastAccessTime
-I owner -I transient_lastDdlTime -I java.lang.RuntimeException -I at org -I at sun -I at
java -I at junit -I Caused by: -I [.][.][.] [0-9]* more <http://hudson.zones.apache.org/hudson/job/Hive-trunk-h0.19/ws/hive/build/ql/test/logs/clientpositive/input6.q.out>
<http://hudson.zones.apache.org/hudson/job/Hive-trunk-h0.19/ws/hive/ql/src/test/results/clientpositive/input6.q.out>
    [junit] Done query: input6.q
    [junit] Begin query: input7.q
    [junit] diff -a -I file: -I /tmp/ -I invalidscheme: -I lastUpdateTime -I lastAccessTime
-I owner -I transient_lastDdlTime -I java.lang.RuntimeException -I at org -I at sun -I at
java -I at junit -I Caused by: -I [.][.][.] [0-9]* more <http://hudson.zones.apache.org/hudson/job/Hive-trunk-h0.19/ws/hive/build/ql/test/logs/clientpositive/input7.q.out>
<http://hudson.zones.apache.org/hudson/job/Hive-trunk-h0.19/ws/hive/ql/src/test/results/clientpositive/input7.q.out>
    [junit] Done query: input7.q
    [junit] Begin query: input8.q
    [junit] diff -a -I file: -I /tmp/ -I invalidscheme: -I lastUpdateTime -I lastAccessTime
-I owner -I transient_lastDdlTime -I java.lang.RuntimeException -I at org -I at sun -I at
java -I at junit -I Caused by: -I [.][.][.] [0-9]* more <http://hudson.zones.apache.org/hudson/job/Hive-trunk-h0.19/ws/hive/build/ql/test/logs/clientpositive/input8.q.out>
<http://hudson.zones.apache.org/hudson/job/Hive-trunk-h0.19/ws/hive/ql/src/test/results/clientpositive/input8.q.out>
    [junit] Done query: input8.q
    [junit] Begin query: input9.q
    [junit] diff -a -I file: -I /tmp/ -I invalidscheme: -I lastUpdateTime -I lastAccessTime
-I owner -I transient_lastDdlTime -I java.lang.RuntimeException -I at org -I at sun -I at
java -I at junit -I Caused by: -I [.][.][.] [0-9]* more <http://hudson.zones.apache.org/hudson/job/Hive-trunk-h0.19/ws/hive/build/ql/test/logs/clientpositive/input9.q.out>
<http://hudson.zones.apache.org/hudson/job/Hive-trunk-h0.19/ws/hive/ql/src/test/results/clientpositive/input9.q.out>
    [junit] Done query: input9.q
    [junit] Begin query: input_columnarserde.q
    [junit] diff -a -I file: -I /tmp/ -I invalidscheme: -I lastUpdateTime -I lastAccessTime
-I owner -I transient_lastDdlTime -I java.lang.RuntimeException -I at org -I at sun -I at
java -I at junit -I Caused by: -I [.][.][.] [0-9]* more <http://hudson.zones.apache.org/hudson/job/Hive-trunk-h0.19/ws/hive/build/ql/test/logs/clientpositive/input_columnarserde.q.out>
<http://hudson.zones.apache.org/hudson/job/Hive-trunk-h0.19/ws/hive/ql/src/test/results/clientpositive/input_columnarserde.q.out>
    [junit] Done query: input_columnarserde.q
    [junit] Begin query: input_dfs.q
    [junit] diff -a -I file: -I /tmp/ -I invalidscheme: -I lastUpdateTime -I lastAccessTime
-I owner -I transient_lastDdlTime -I java.lang.RuntimeException -I at org -I at sun -I at
java -I at junit -I Caused by: -I [.][.][.] [0-9]* more <http://hudson.zones.apache.org/hudson/job/Hive-trunk-h0.19/ws/hive/build/ql/test/logs/clientpositive/input_dfs.q.out>
<http://hudson.zones.apache.org/hudson/job/Hive-trunk-h0.19/ws/hive/ql/src/test/results/clientpositive/input_dfs.q.out>
    [junit] Done query: input_dfs.q
    [junit] Begin query: input_dynamicserde.q
    [junit] diff -a -I file: -I /tmp/ -I invalidscheme: -I lastUpdateTime -I lastAccessTime
-I owner -I transient_lastDdlTime -I java.lang.RuntimeException -I at org -I at sun -I at
java -I at junit -I Caused by: -I [.][.][.] [0-9]* more <http://hudson.zones.apache.org/hudson/job/Hive-trunk-h0.19/ws/hive/build/ql/test/logs/clientpositive/input_dynamicserde.q.out>
<http://hudson.zones.apache.org/hudson/job/Hive-trunk-h0.19/ws/hive/ql/src/test/results/clientpositive/input_dynamicserde.q.out>
    [junit] Done query: input_dynamicserde.q
    [junit] Begin query: input_lazyserde.q
    [junit] diff -a -I file: -I /tmp/ -I invalidscheme: -I lastUpdateTime -I lastAccessTime
-I owner -I transient_lastDdlTime -I java.lang.RuntimeException -I at org -I at sun -I at
java -I at junit -I Caused by: -I [.][.][.] [0-9]* more <http://hudson.zones.apache.org/hudson/job/Hive-trunk-h0.19/ws/hive/build/ql/test/logs/clientpositive/input_lazyserde.q.out>
<http://hudson.zones.apache.org/hudson/job/Hive-trunk-h0.19/ws/hive/ql/src/test/results/clientpositive/input_lazyserde.q.out>
    [junit] Done query: input_lazyserde.q
    [junit] Begin query: input_limit.q
    [junit] diff -a -I file: -I /tmp/ -I invalidscheme: -I lastUpdateTime -I lastAccessTime
-I owner -I transient_lastDdlTime -I java.lang.RuntimeException -I at org -I at sun -I at
java -I at junit -I Caused by: -I [.][.][.] [0-9]* more <http://hudson.zones.apache.org/hudson/job/Hive-trunk-h0.19/ws/hive/build/ql/test/logs/clientpositive/input_limit.q.out>
<http://hudson.zones.apache.org/hudson/job/Hive-trunk-h0.19/ws/hive/ql/src/test/results/clientpositive/input_limit.q.out>
    [junit] Done query: input_limit.q
    [junit] Begin query: input_part0.q
    [junit] diff -a -I file: -I /tmp/ -I invalidscheme: -I lastUpdateTime -I lastAccessTime
-I owner -I transient_lastDdlTime -I java.lang.RuntimeException -I at org -I at sun -I at
java -I at junit -I Caused by: -I [.][.][.] [0-9]* more <http://hudson.zones.apache.org/hudson/job/Hive-trunk-h0.19/ws/hive/build/ql/test/logs/clientpositive/input_part0.q.out>
<http://hudson.zones.apache.org/hudson/job/Hive-trunk-h0.19/ws/hive/ql/src/test/results/clientpositive/input_part0.q.out>
    [junit] Done query: input_part0.q
    [junit] Begin query: input_part1.q
    [junit] diff -a -I file: -I /tmp/ -I invalidscheme: -I lastUpdateTime -I lastAccessTime
-I owner -I transient_lastDdlTime -I java.lang.RuntimeException -I at org -I at sun -I at
java -I at junit -I Caused by: -I [.][.][.] [0-9]* more <http://hudson.zones.apache.org/hudson/job/Hive-trunk-h0.19/ws/hive/build/ql/test/logs/clientpositive/input_part1.q.out>
<http://hudson.zones.apache.org/hudson/job/Hive-trunk-h0.19/ws/hive/ql/src/test/results/clientpositive/input_part1.q.out>
    [junit] Done query: input_part1.q
    [junit] Begin query: input_part10.q
    [junit] diff -a -I file: -I /tmp/ -I invalidscheme: -I lastUpdateTime -I lastAccessTime
-I owner -I transient_lastDdlTime -I java.lang.RuntimeException -I at org -I at sun -I at
java -I at junit -I Caused by: -I [.][.][.] [0-9]* more <http://hudson.zones.apache.org/hudson/job/Hive-trunk-h0.19/ws/hive/build/ql/test/logs/clientpositive/input_part10.q.out>
<http://hudson.zones.apache.org/hudson/job/Hive-trunk-h0.19/ws/hive/ql/src/test/results/clientpositive/input_part10.q.out>
    [junit] Done query: input_part10.q
    [junit] Begin query: input_part2.q
    [junit] diff -a -I file: -I /tmp/ -I invalidscheme: -I lastUpdateTime -I lastAccessTime
-I owner -I transient_lastDdlTime -I java.lang.RuntimeException -I at org -I at sun -I at
java -I at junit -I Caused by: -I [.][.][.] [0-9]* more <http://hudson.zones.apache.org/hudson/job/Hive-trunk-h0.19/ws/hive/build/ql/test/logs/clientpositive/input_part2.q.out>
<http://hudson.zones.apache.org/hudson/job/Hive-trunk-h0.19/ws/hive/ql/src/test/results/clientpositive/input_part2.q.out>
    [junit] Done query: input_part2.q
    [junit] Begin query: input_part3.q
    [junit] diff -a -I file: -I /tmp/ -I invalidscheme: -I lastUpdateTime -I lastAccessTime
-I owner -I transient_lastDdlTime -I java.lang.RuntimeException -I at org -I at sun -I at
java -I at junit -I Caused by: -I [.][.][.] [0-9]* more <http://hudson.zones.apache.org/hudson/job/Hive-trunk-h0.19/ws/hive/build/ql/test/logs/clientpositive/input_part3.q.out>
<http://hudson.zones.apache.org/hudson/job/Hive-trunk-h0.19/ws/hive/ql/src/test/results/clientpositive/input_part3.q.out>
    [junit] Done query: input_part3.q
    [junit] Begin query: input_part4.q
    [junit] diff -a -I file: -I /tmp/ -I invalidscheme: -I lastUpdateTime -I lastAccessTime
-I owner -I transient_lastDdlTime -I java.lang.RuntimeException -I at org -I at sun -I at
java -I at junit -I Caused by: -I [.][.][.] [0-9]* more <http://hudson.zones.apache.org/hudson/job/Hive-trunk-h0.19/ws/hive/build/ql/test/logs/clientpositive/input_part4.q.out>
<http://hudson.zones.apache.org/hudson/job/Hive-trunk-h0.19/ws/hive/ql/src/test/results/clientpositive/input_part4.q.out>
    [junit] Done query: input_part4.q
    [junit] Begin query: input_part5.q
    [junit] diff -a -I file: -I /tmp/ -I invalidscheme: -I lastUpdateTime -I lastAccessTime
-I owner -I transient_lastDdlTime -I java.lang.RuntimeException -I at org -I at sun -I at
java -I at junit -I Caused by: -I [.][.][.] [0-9]* more <http://hudson.zones.apache.org/hudson/job/Hive-trunk-h0.19/ws/hive/build/ql/test/logs/clientpositive/input_part5.q.out>
<http://hudson.zones.apache.org/hudson/job/Hive-trunk-h0.19/ws/hive/ql/src/test/results/clientpositive/input_part5.q.out>
    [junit] Done query: input_part5.q
    [junit] Begin query: input_part6.q
    [junit] diff -a -I file: -I /tmp/ -I invalidscheme: -I lastUpdateTime -I lastAccessTime
-I owner -I transient_lastDdlTime -I java.lang.RuntimeException -I at org -I at sun -I at
java -I at junit -I Caused by: -I [.][.][.] [0-9]* more <http://hudson.zones.apache.org/hudson/job/Hive-trunk-h0.19/ws/hive/build/ql/test/logs/clientpositive/input_part6.q.out>
<http://hudson.zones.apache.org/hudson/job/Hive-trunk-h0.19/ws/hive/ql/src/test/results/clientpositive/input_part6.q.out>
    [junit] Done query: input_part6.q
    [junit] Begin query: input_part7.q
    [junit] diff -a -I file: -I /tmp/ -I invalidscheme: -I lastUpdateTime -I lastAccessTime
-I owner -I transient_lastDdlTime -I java.lang.RuntimeException -I at org -I at sun -I at
java -I at junit -I Caused by: -I [.][.][.] [0-9]* more <http://hudson.zones.apache.org/hudson/job/Hive-trunk-h0.19/ws/hive/build/ql/test/logs/clientpositive/input_part7.q.out>
<http://hudson.zones.apache.org/hudson/job/Hive-trunk-h0.19/ws/hive/ql/src/test/results/clientpositive/input_part7.q.out>
    [junit] Done query: input_part7.q
    [junit] Begin query: input_part8.q
    [junit] diff -a -I file: -I /tmp/ -I invalidscheme: -I lastUpdateTime -I lastAccessTime
-I owner -I transient_lastDdlTime -I java.lang.RuntimeException -I at org -I at sun -I at
java -I at junit -I Caused by: -I [.][.][.] [0-9]* more <http://hudson.zones.apache.org/hudson/job/Hive-trunk-h0.19/ws/hive/build/ql/test/logs/clientpositive/input_part8.q.out>
<http://hudson.zones.apache.org/hudson/job/Hive-trunk-h0.19/ws/hive/ql/src/test/results/clientpositive/input_part8.q.out>
    [junit] Done query: input_part8.q
    [junit] Begin query: input_part9.q
    [junit] diff -a -I file: -I /tmp/ -I invalidscheme: -I lastUpdateTime -I lastAccessTime
-I owner -I transient_lastDdlTime -I java.lang.RuntimeException -I at org -I at sun -I at
java -I at junit -I Caused by: -I [.][.][.] [0-9]* more <http://hudson.zones.apache.org/hudson/job/Hive-trunk-h0.19/ws/hive/build/ql/test/logs/clientpositive/input_part9.q.out>
<http://hudson.zones.apache.org/hudson/job/Hive-trunk-h0.19/ws/hive/ql/src/test/results/clientpositive/input_part9.q.out>
    [junit] Done query: input_part9.q
    [junit] Begin query: input_testsequencefile.q
    [junit] diff -a -I file: -I /tmp/ -I invalidscheme: -I lastUpdateTime -I lastAccessTime
-I owner -I transient_lastDdlTime -I java.lang.RuntimeException -I at org -I at sun -I at
java -I at junit -I Caused by: -I [.][.][.] [0-9]* more <http://hudson.zones.apache.org/hudson/job/Hive-trunk-h0.19/ws/hive/build/ql/test/logs/clientpositive/input_testsequencefile.q.out>
<http://hudson.zones.apache.org/hudson/job/Hive-trunk-h0.19/ws/hive/ql/src/test/results/clientpositive/input_testsequencefile.q.out>
    [junit] Done query: input_testsequencefile.q
    [junit] Begin query: input_testxpath.q
    [junit] diff -a -I file: -I /tmp/ -I invalidscheme: -I lastUpdateTime -I lastAccessTime
-I owner -I transient_lastDdlTime -I java.lang.RuntimeException -I at org -I at sun -I at
java -I at junit -I Caused by: -I [.][.][.] [0-9]* more <http://hudson.zones.apache.org/hudson/job/Hive-trunk-h0.19/ws/hive/build/ql/test/logs/clientpositive/input_testxpath.q.out>
<http://hudson.zones.apache.org/hudson/job/Hive-trunk-h0.19/ws/hive/ql/src/test/results/clientpositive/input_testxpath.q.out>
    [junit] Done query: input_testxpath.q
    [junit] Begin query: input_testxpath2.q
    [junit] diff -a -I file: -I /tmp/ -I invalidscheme: -I lastUpdateTime -I lastAccessTime
-I owner -I transient_lastDdlTime -I java.lang.RuntimeException -I at org -I at sun -I at
java -I at junit -I Caused by: -I [.][.][.] [0-9]* more <http://hudson.zones.apache.org/hudson/job/Hive-trunk-h0.19/ws/hive/build/ql/test/logs/clientpositive/input_testxpath2.q.out>
<http://hudson.zones.apache.org/hudson/job/Hive-trunk-h0.19/ws/hive/ql/src/test/results/clientpositive/input_testxpath2.q.out>
    [junit] Done query: input_testxpath2.q
    [junit] Begin query: input_testxpath3.q
    [junit] diff -a -I file: -I /tmp/ -I invalidscheme: -I lastUpdateTime -I lastAccessTime
-I owner -I transient_lastDdlTime -I java.lang.RuntimeException -I at org -I at sun -I at
java -I at junit -I Caused by: -I [.][.][.] [0-9]* more <http://hudson.zones.apache.org/hudson/job/Hive-trunk-h0.19/ws/hive/build/ql/test/logs/clientpositive/input_testxpath3.q.out>
<http://hudson.zones.apache.org/hudson/job/Hive-trunk-h0.19/ws/hive/ql/src/test/results/clientpositive/input_testxpath3.q.out>
    [junit] Done query: input_testxpath3.q
    [junit] Begin query: input_testxpath4.q
    [junit] diff -a -I file: -I /tmp/ -I invalidscheme: -I lastUpdateTime -I lastAccessTime
-I owner -I transient_lastDdlTime -I java.lang.RuntimeException -I at org -I at sun -I at
java -I at junit -I Caused by: -I [.][.][.] [0-9]* more <http://hudson.zones.apache.org/hudson/job/Hive-trunk-h0.19/ws/hive/build/ql/test/logs/clientpositive/input_testxpath4.q.out>
<http://hudson.zones.apache.org/hudson/job/Hive-trunk-h0.19/ws/hive/ql/src/test/results/clientpositive/input_testxpath4.q.out>
    [junit] Done query: input_testxpath4.q
    [junit] Begin query: inputddl1.q
    [junit] diff -a -I file: -I /tmp/ -I invalidscheme: -I lastUpdateTime -I lastAccessTime
-I owner -I transient_lastDdlTime -I java.lang.RuntimeException -I at org -I at sun -I at
java -I at junit -I Caused by: -I [.][.][.] [0-9]* more <http://hudson.zones.apache.org/hudson/job/Hive-trunk-h0.19/ws/hive/build/ql/test/logs/clientpositive/inputddl1.q.out>
<http://hudson.zones.apache.org/hudson/job/Hive-trunk-h0.19/ws/hive/ql/src/test/results/clientpositive/inputddl1.q.out>
    [junit] Done query: inputddl1.q
    [junit] Begin query: inputddl2.q
    [junit] diff -a -I file: -I /tmp/ -I invalidscheme: -I lastUpdateTime -I lastAccessTime
-I owner -I transient_lastDdlTime -I java.lang.RuntimeException -I at org -I at sun -I at
java -I at junit -I Caused by: -I [.][.][.] [0-9]* more <http://hudson.zones.apache.org/hudson/job/Hive-trunk-h0.19/ws/hive/build/ql/test/logs/clientpositive/inputddl2.q.out>
<http://hudson.zones.apache.org/hudson/job/Hive-trunk-h0.19/ws/hive/ql/src/test/results/clientpositive/inputddl2.q.out>
    [junit] Done query: inputddl2.q
    [junit] Begin query: inputddl3.q
    [junit] diff -a -I file: -I /tmp/ -I invalidscheme: -I lastUpdateTime -I lastAccessTime
-I owner -I transient_lastDdlTime -I java.lang.RuntimeException -I at org -I at sun -I at
java -I at junit -I Caused by: -I [.][.][.] [0-9]* more <http://hudson.zones.apache.org/hudson/job/Hive-trunk-h0.19/ws/hive/build/ql/test/logs/clientpositive/inputddl3.q.out>
<http://hudson.zones.apache.org/hudson/job/Hive-trunk-h0.19/ws/hive/ql/src/test/results/clientpositive/inputddl3.q.out>
    [junit] Done query: inputddl3.q
    [junit] Begin query: inputddl4.q
    [junit] diff -a -I file: -I /tmp/ -I invalidscheme: -I lastUpdateTime -I lastAccessTime
-I owner -I transient_lastDdlTime -I java.lang.RuntimeException -I at org -I at sun -I at
java -I at junit -I Caused by: -I [.][.][.] [0-9]* more <http://hudson.zones.apache.org/hudson/job/Hive-trunk-h0.19/ws/hive/build/ql/test/logs/clientpositive/inputddl4.q.out>
<http://hudson.zones.apache.org/hudson/job/Hive-trunk-h0.19/ws/hive/ql/src/test/results/clientpositive/inputddl4.q.out>
    [junit] Done query: inputddl4.q
    [junit] Begin query: inputddl5.q
    [junit] diff -a -I file: -I /tmp/ -I invalidscheme: -I lastUpdateTime -I lastAccessTime
-I owner -I transient_lastDdlTime -I java.lang.RuntimeException -I at org -I at sun -I at
java -I at junit -I Caused by: -I [.][.][.] [0-9]* more <http://hudson.zones.apache.org/hudson/job/Hive-trunk-h0.19/ws/hive/build/ql/test/logs/clientpositive/inputddl5.q.out>
<http://hudson.zones.apache.org/hudson/job/Hive-trunk-h0.19/ws/hive/ql/src/test/results/clientpositive/inputddl5.q.out>
    [junit] Done query: inputddl5.q
    [junit] Begin query: inputddl6.q
    [junit] diff -a -I file: -I /tmp/ -I invalidscheme: -I lastUpdateTime -I lastAccessTime
-I owner -I transient_lastDdlTime -I java.lang.RuntimeException -I at org -I at sun -I at
java -I at junit -I Caused by: -I [.][.][.] [0-9]* more <http://hudson.zones.apache.org/hudson/job/Hive-trunk-h0.19/ws/hive/build/ql/test/logs/clientpositive/inputddl6.q.out>
<http://hudson.zones.apache.org/hudson/job/Hive-trunk-h0.19/ws/hive/ql/src/test/results/clientpositive/inputddl6.q.out>
    [junit] Done query: inputddl6.q
    [junit] Begin query: inputddl7.q
    [junit] diff -a -I file: -I /tmp/ -I invalidscheme: -I lastUpdateTime -I lastAccessTime
-I owner -I transient_lastDdlTime -I java.lang.RuntimeException -I at org -I at sun -I at
java -I at junit -I Caused by: -I [.][.][.] [0-9]* more <http://hudson.zones.apache.org/hudson/job/Hive-trunk-h0.19/ws/hive/build/ql/test/logs/clientpositive/inputddl7.q.out>
<http://hudson.zones.apache.org/hudson/job/Hive-trunk-h0.19/ws/hive/ql/src/test/results/clientpositive/inputddl7.q.out>
    [junit] Done query: inputddl7.q
    [junit] Begin query: inputddl8.q
    [junit] diff -a -I file: -I /tmp/ -I invalidscheme: -I lastUpdateTime -I lastAccessTime
-I owner -I transient_lastDdlTime -I java.lang.RuntimeException -I at org -I at sun -I at
java -I at junit -I Caused by: -I [.][.][.] [0-9]* more <http://hudson.zones.apache.org/hudson/job/Hive-trunk-h0.19/ws/hive/build/ql/test/logs/clientpositive/inputddl8.q.out>
<http://hudson.zones.apache.org/hudson/job/Hive-trunk-h0.19/ws/hive/ql/src/test/results/clientpositive/inputddl8.q.out>
    [junit] Done query: inputddl8.q
    [junit] Begin query: insert1.q
    [junit] diff -a -I file: -I /tmp/ -I invalidscheme: -I lastUpdateTime -I lastAccessTime
-I owner -I transient_lastDdlTime -I java.lang.RuntimeException -I at org -I at sun -I at
java -I at junit -I Caused by: -I [.][.][.] [0-9]* more <http://hudson.zones.apache.org/hudson/job/Hive-trunk-h0.19/ws/hive/build/ql/test/logs/clientpositive/insert1.q.out>
<http://hudson.zones.apache.org/hudson/job/Hive-trunk-h0.19/ws/hive/ql/src/test/results/clientpositive/insert1.q.out>
    [junit] Done query: insert1.q
    [junit] Begin query: insertexternal1.q
    [junit] diff -a -I file: -I /tmp/ -I invalidscheme: -I lastUpdateTime -I lastAccessTime
-I owner -I transient_lastDdlTime -I java.lang.RuntimeException -I at org -I at sun -I at
java -I at junit -I Caused by: -I [.][.][.] [0-9]* more <http://hudson.zones.apache.org/hudson/job/Hive-trunk-h0.19/ws/hive/build/ql/test/logs/clientpositive/insertexternal1.q.out>
<http://hudson.zones.apache.org/hudson/job/Hive-trunk-h0.19/ws/hive/ql/src/test/results/clientpositive/insertexternal1.q.out>
    [junit] Done query: insertexternal1.q
    [junit] Begin query: join0.q
    [junit] diff -a -I file: -I /tmp/ -I invalidscheme: -I lastUpdateTime -I lastAccessTime
-I owner -I transient_lastDdlTime -I java.lang.RuntimeException -I at org -I at sun -I at
java -I at junit -I Caused by: -I [.][.][.] [0-9]* more <http://hudson.zones.apache.org/hudson/job/Hive-trunk-h0.19/ws/hive/build/ql/test/logs/clientpositive/join0.q.out>
<http://hudson.zones.apache.org/hudson/job/Hive-trunk-h0.19/ws/hive/ql/src/test/results/clientpositive/join0.q.out>
    [junit] Done query: join0.q
    [junit] Begin query: join1.q
    [junit] diff -a -I file: -I /tmp/ -I invalidscheme: -I lastUpdateTime -I lastAccessTime
-I owner -I transient_lastDdlTime -I java.lang.RuntimeException -I at org -I at sun -I at
java -I at junit -I Caused by: -I [.][.][.] [0-9]* more <http://hudson.zones.apache.org/hudson/job/Hive-trunk-h0.19/ws/hive/build/ql/test/logs/clientpositive/join1.q.out>
<http://hudson.zones.apache.org/hudson/job/Hive-trunk-h0.19/ws/hive/ql/src/test/results/clientpositive/join1.q.out>
    [junit] Done query: join1.q
    [junit] Begin query: join10.q
    [junit] diff -a -I file: -I /tmp/ -I invalidscheme: -I lastUpdateTime -I lastAccessTime
-I owner -I transient_lastDdlTime -I java.lang.RuntimeException -I at org -I at sun -I at
java -I at junit -I Caused by: -I [.][.][.] [0-9]* more <http://hudson.zones.apache.org/hudson/job/Hive-trunk-h0.19/ws/hive/build/ql/test/logs/clientpositive/join10.q.out>
<http://hudson.zones.apache.org/hudson/job/Hive-trunk-h0.19/ws/hive/ql/src/test/results/clientpositive/join10.q.out>
    [junit] Done query: join10.q
    [junit] Begin query: join11.q
    [junit] diff -a -I file: -I /tmp/ -I invalidscheme: -I lastUpdateTime -I lastAccessTime
-I owner -I transient_lastDdlTime -I java.lang.RuntimeException -I at org -I at sun -I at
java -I at junit -I Caused by: -I [.][.][.] [0-9]* more <http://hudson.zones.apache.org/hudson/job/Hive-trunk-h0.19/ws/hive/build/ql/test/logs/clientpositive/join11.q.out>
<http://hudson.zones.apache.org/hudson/job/Hive-trunk-h0.19/ws/hive/ql/src/test/results/clientpositive/join11.q.out>
    [junit] Done query: join11.q
    [junit] Begin query: join12.q
    [junit] diff -a -I file: -I /tmp/ -I invalidscheme: -I lastUpdateTime -I lastAccessTime
-I owner -I transient_lastDdlTime -I java.lang.RuntimeException -I at org -I at sun -I at
java -I at junit -I Caused by: -I [.][.][.] [0-9]* more <http://hudson.zones.apache.org/hudson/job/Hive-trunk-h0.19/ws/hive/build/ql/test/logs/clientpositive/join12.q.out>
<http://hudson.zones.apache.org/hudson/job/Hive-trunk-h0.19/ws/hive/ql/src/test/results/clientpositive/join12.q.out>
    [junit] Done query: join12.q
    [junit] Begin query: join13.q
    [junit] diff -a -I file: -I /tmp/ -I invalidscheme: -I lastUpdateTime -I lastAccessTime
-I owner -I transient_lastDdlTime -I java.lang.RuntimeException -I at org -I at sun -I at
java -I at junit -I Caused by: -I [.][.][.] [0-9]* more <http://hudson.zones.apache.org/hudson/job/Hive-trunk-h0.19/ws/hive/build/ql/test/logs/clientpositive/join13.q.out>
<http://hudson.zones.apache.org/hudson/job/Hive-trunk-h0.19/ws/hive/ql/src/test/results/clientpositive/join13.q.out>
    [junit] Done query: join13.q
    [junit] Begin query: join14.q
    [junit] diff -a -I file: -I /tmp/ -I invalidscheme: -I lastUpdateTime -I lastAccessTime
-I owner -I transient_lastDdlTime -I java.lang.RuntimeException -I at org -I at sun -I at
java -I at junit -I Caused by: -I [.][.][.] [0-9]* more <http://hudson.zones.apache.org/hudson/job/Hive-trunk-h0.19/ws/hive/build/ql/test/logs/clientpositive/join14.q.out>
<http://hudson.zones.apache.org/hudson/job/Hive-trunk-h0.19/ws/hive/ql/src/test/results/clientpositive/join14.q.out>
    [junit] Done query: join14.q
    [junit] Begin query: join15.q
    [junit] diff -a -I file: -I /tmp/ -I invalidscheme: -I lastUpdateTime -I lastAccessTime
-I owner -I transient_lastDdlTime -I java.lang.RuntimeException -I at org -I at sun -I at
java -I at junit -I Caused by: -I [.][.][.] [0-9]* more <http://hudson.zones.apache.org/hudson/job/Hive-trunk-h0.19/ws/hive/build/ql/test/logs/clientpositive/join15.q.out>
<http://hudson.zones.apache.org/hudson/job/Hive-trunk-h0.19/ws/hive/ql/src/test/results/clientpositive/join15.q.out>
    [junit] Done query: join15.q
    [junit] Begin query: join16.q
    [junit] diff -a -I file: -I /tmp/ -I invalidscheme: -I lastUpdateTime -I lastAccessTime
-I owner -I transient_lastDdlTime -I java.lang.RuntimeException -I at org -I at sun -I at
java -I at junit -I Caused by: -I [.][.][.] [0-9]* more <http://hudson.zones.apache.org/hudson/job/Hive-trunk-h0.19/ws/hive/build/ql/test/logs/clientpositive/join16.q.out>
<http://hudson.zones.apache.org/hudson/job/Hive-trunk-h0.19/ws/hive/ql/src/test/results/clientpositive/join16.q.out>
    [junit] Done query: join16.q
    [junit] Begin query: join17.q
    [junit] diff -a -I file: -I /tmp/ -I invalidscheme: -I lastUpdateTime -I lastAccessTime
-I owner -I transient_lastDdlTime -I java.lang.RuntimeException -I at org -I at sun -I at
java -I at junit -I Caused by: -I [.][.][.] [0-9]* more <http://hudson.zones.apache.org/hudson/job/Hive-trunk-h0.19/ws/hive/build/ql/test/logs/clientpositive/join17.q.out>
<http://hudson.zones.apache.org/hudson/job/Hive-trunk-h0.19/ws/hive/ql/src/test/results/clientpositive/join17.q.out>
    [junit] Done query: join17.q
    [junit] Begin query: join18.q
    [junit] diff -a -I file: -I /tmp/ -I invalidscheme: -I lastUpdateTime -I lastAccessTime
-I owner -I transient_lastDdlTime -I java.lang.RuntimeException -I at org -I at sun -I at
java -I at junit -I Caused by: -I [.][.][.] [0-9]* more <http://hudson.zones.apache.org/hudson/job/Hive-trunk-h0.19/ws/hive/build/ql/test/logs/clientpositive/join18.q.out>
<http://hudson.zones.apache.org/hudson/job/Hive-trunk-h0.19/ws/hive/ql/src/test/results/clientpositive/join18.q.out>
    [junit] Done query: join18.q
    [junit] Begin query: join19.q
    [junit] diff -a -I file: -I /tmp/ -I invalidscheme: -I lastUpdateTime -I lastAccessTime
-I owner -I transient_lastDdlTime -I java.lang.RuntimeException -I at org -I at sun -I at
java -I at junit -I Caused by: -I [.][.][.] [0-9]* more <http://hudson.zones.apache.org/hudson/job/Hive-trunk-h0.19/ws/hive/build/ql/test/logs/clientpositive/join19.q.out>
<http://hudson.zones.apache.org/hudson/job/Hive-trunk-h0.19/ws/hive/ql/src/test/results/clientpositive/join19.q.out>
    [junit] Done query: join19.q
    [junit] Begin query: join2.q
    [junit] diff -a -I file: -I /tmp/ -I invalidscheme: -I lastUpdateTime -I lastAccessTime
-I owner -I transient_lastDdlTime -I java.lang.RuntimeException -I at org -I at sun -I at
java -I at junit -I Caused by: -I [.][.][.] [0-9]* more <http://hudson.zones.apache.org/hudson/job/Hive-trunk-h0.19/ws/hive/build/ql/test/logs/clientpositive/join2.q.out>
<http://hudson.zones.apache.org/hudson/job/Hive-trunk-h0.19/ws/hive/ql/src/test/results/clientpositive/join2.q.out>
    [junit] Done query: join2.q
    [junit] Begin query: join20.q
    [junit] diff -a -I file: -I /tmp/ -I invalidscheme: -I lastUpdateTime -I lastAccessTime
-I owner -I transient_lastDdlTime -I java.lang.RuntimeException -I at org -I at sun -I at
java -I at junit -I Caused by: -I [.][.][.] [0-9]* more <http://hudson.zones.apache.org/hudson/job/Hive-trunk-h0.19/ws/hive/build/ql/test/logs/clientpositive/join20.q.out>
<http://hudson.zones.apache.org/hudson/job/Hive-trunk-h0.19/ws/hive/ql/src/test/results/clientpositive/join20.q.out>
    [junit] Done query: join20.q
    [junit] Begin query: join21.q
    [junit] diff -a -I file: -I /tmp/ -I invalidscheme: -I lastUpdateTime -I lastAccessTime
-I owner -I transient_lastDdlTime -I java.lang.RuntimeException -I at org -I at sun -I at
java -I at junit -I Caused by: -I [.][.][.] [0-9]* more <http://hudson.zones.apache.org/hudson/job/Hive-trunk-h0.19/ws/hive/build/ql/test/logs/clientpositive/join21.q.out>
<http://hudson.zones.apache.org/hudson/job/Hive-trunk-h0.19/ws/hive/ql/src/test/results/clientpositive/join21.q.out>
    [junit] Done query: join21.q
    [junit] Begin query: join22.q
    [junit] diff -a -I file: -I /tmp/ -I invalidscheme: -I lastUpdateTime -I lastAccessTime
-I owner -I transient_lastDdlTime -I java.lang.RuntimeException -I at org -I at sun -I at
java -I at junit -I Caused by: -I [.][.][.] [0-9]* more <http://hudson.zones.apache.org/hudson/job/Hive-trunk-h0.19/ws/hive/build/ql/test/logs/clientpositive/join22.q.out>
<http://hudson.zones.apache.org/hudson/job/Hive-trunk-h0.19/ws/hive/ql/src/test/results/clientpositive/join22.q.out>
    [junit] Done query: join22.q
    [junit] Begin query: join23.q
    [junit] diff -a -I file: -I /tmp/ -I invalidscheme: -I lastUpdateTime -I lastAccessTime
-I owner -I transient_lastDdlTime -I java.lang.RuntimeException -I at org -I at sun -I at
java -I at junit -I Caused by: -I [.][.][.] [0-9]* more <http://hudson.zones.apache.org/hudson/job/Hive-trunk-h0.19/ws/hive/build/ql/test/logs/clientpositive/join23.q.out>
<http://hudson.zones.apache.org/hudson/job/Hive-trunk-h0.19/ws/hive/ql/src/test/results/clientpositive/join23.q.out>
    [junit] Done query: join23.q
    [junit] Begin query: join24.q
    [junit] diff -a -I file: -I /tmp/ -I invalidscheme: -I lastUpdateTime -I lastAccessTime
-I owner -I transient_lastDdlTime -I java.lang.RuntimeException -I at org -I at sun -I at
java -I at junit -I Caused by: -I [.][.][.] [0-9]* more <http://hudson.zones.apache.org/hudson/job/Hive-trunk-h0.19/ws/hive/build/ql/test/logs/clientpositive/join24.q.out>
<http://hudson.zones.apache.org/hudson/job/Hive-trunk-h0.19/ws/hive/ql/src/test/results/clientpositive/join24.q.out>
    [junit] Done query: join24.q
    [junit] Begin query: join25.q
    [junit] diff -a -I file: -I /tmp/ -I invalidscheme: -I lastUpdateTime -I lastAccessTime
-I owner -I transient_lastDdlTime -I java.lang.RuntimeException -I at org -I at sun -I at
java -I at junit -I Caused by: -I [.][.][.] [0-9]* more <http://hudson.zones.apache.org/hudson/job/Hive-trunk-h0.19/ws/hive/build/ql/test/logs/clientpositive/join25.q.out>
<http://hudson.zones.apache.org/hudson/job/Hive-trunk-h0.19/ws/hive/ql/src/test/results/clientpositive/join25.q.out>
    [junit] Done query: join25.q
    [junit] Begin query: join26.q
    [junit] diff -a -I file: -I /tmp/ -I invalidscheme: -I lastUpdateTime -I lastAccessTime
-I owner -I transient_lastDdlTime -I java.lang.RuntimeException -I at org -I at sun -I at
java -I at junit -I Caused by: -I [.][.][.] [0-9]* more <http://hudson.zones.apache.org/hudson/job/Hive-trunk-h0.19/ws/hive/build/ql/test/logs/clientpositive/join26.q.out>
<http://hudson.zones.apache.org/hudson/job/Hive-trunk-h0.19/ws/hive/ql/src/test/results/clientpositive/join26.q.out>
    [junit] Done query: join26.q
    [junit] Begin query: join27.q
    [junit] diff -a -I file: -I /tmp/ -I invalidscheme: -I lastUpdateTime -I lastAccessTime
-I owner -I transient_lastDdlTime -I java.lang.RuntimeException -I at org -I at sun -I at
java -I at junit -I Caused by: -I [.][.][.] [0-9]* more <http://hudson.zones.apache.org/hudson/job/Hive-trunk-h0.19/ws/hive/build/ql/test/logs/clientpositive/join27.q.out>
<http://hudson.zones.apache.org/hudson/job/Hive-trunk-h0.19/ws/hive/ql/src/test/results/clientpositive/join27.q.out>
    [junit] Done query: join27.q
    [junit] Begin query: join28.q
    [junit] diff -a -I file: -I /tmp/ -I invalidscheme: -I lastUpdateTime -I lastAccessTime
-I owner -I transient_lastDdlTime -I java.lang.RuntimeException -I at org -I at sun -I at
java -I at junit -I Caused by: -I [.][.][.] [0-9]* more <http://hudson.zones.apache.org/hudson/job/Hive-trunk-h0.19/ws/hive/build/ql/test/logs/clientpositive/join28.q.out>
<http://hudson.zones.apache.org/hudson/job/Hive-trunk-h0.19/ws/hive/ql/src/test/results/clientpositive/join28.q.out>
    [junit] Done query: join28.q
    [junit] Begin query: join29.q
    [junit] diff -a -I file: -I /tmp/ -I invalidscheme: -I lastUpdateTime -I lastAccessTime
-I owner -I transient_lastDdlTime -I java.lang.RuntimeException -I at org -I at sun -I at
java -I at junit -I Caused by: -I [.][.][.] [0-9]* more <http://hudson.zones.apache.org/hudson/job/Hive-trunk-h0.19/ws/hive/build/ql/test/logs/clientpositive/join29.q.out>
<http://hudson.zones.apache.org/hudson/job/Hive-trunk-h0.19/ws/hive/ql/src/test/results/clientpositive/join29.q.out>
    [junit] Done query: join29.q
    [junit] Begin query: join3.q
    [junit] diff -a -I file: -I /tmp/ -I invalidscheme: -I lastUpdateTime -I lastAccessTime
-I owner -I transient_lastDdlTime -I java.lang.RuntimeException -I at org -I at sun -I at
java -I at junit -I Caused by: -I [.][.][.] [0-9]* more <http://hudson.zones.apache.org/hudson/job/Hive-trunk-h0.19/ws/hive/build/ql/test/logs/clientpositive/join3.q.out>
<http://hudson.zones.apache.org/hudson/job/Hive-trunk-h0.19/ws/hive/ql/src/test/results/clientpositive/join3.q.out>
    [junit] Done query: join3.q
    [junit] Begin query: join30.q
    [junit] diff -a -I file: -I /tmp/ -I invalidscheme: -I lastUpdateTime -I lastAccessTime
-I owner -I transient_lastDdlTime -I java.lang.RuntimeException -I at org -I at sun -I at
java -I at junit -I Caused by: -I [.][.][.] [0-9]* more <http://hudson.zones.apache.org/hudson/job/Hive-trunk-h0.19/ws/hive/build/ql/test/logs/clientpositive/join30.q.out>
<http://hudson.zones.apache.org/hudson/job/Hive-trunk-h0.19/ws/hive/ql/src/test/results/clientpositive/join30.q.out>
    [junit] Done query: join30.q
    [junit] Begin query: join31.q
FATAL: command execution failed.
hudson.util.IOException2: Failed to join the process
	at hudson.Proc$RemoteProc.join(Proc.java:355)
	at hudson.Launcher$ProcStarter.join(Launcher.java:280)
	at hudson.tasks.Ant.perform(Ant.java:212)
	at hudson.tasks.BuildStepMonitor$1.perform(BuildStepMonitor.java:19)
	at hudson.model.AbstractBuild$AbstractRunner.perform(AbstractBuild.java:601)
	at hudson.model.Build$RunnerImpl.build(Build.java:174)
	at hudson.model.Build$RunnerImpl.doRun(Build.java:138)
	at hudson.model.AbstractBuild$AbstractRunner.run(AbstractBuild.java:416)
	at hudson.model.Run.run(Run.java:1257)
	at hudson.model.FreeStyleBuild.run(FreeStyleBuild.java:46)
	at hudson.model.ResourceController.execute(ResourceController.java:88)
	at hudson.model.Executor.run(Executor.java:127)
Caused by: java.util.concurrent.ExecutionException: hudson.remoting.RequestAbortedException:
java.io.IOException: Unexpected termination of the channel
	at hudson.remoting.Request$1.get(Request.java:218)
	at hudson.remoting.Request$1.get(Request.java:172)
	at hudson.remoting.FutureAdapter.get(FutureAdapter.java:55)
	at hudson.Proc$RemoteProc.join(Proc.java:347)
	... 11 more
Caused by: hudson.remoting.RequestAbortedException: java.io.IOException: Unexpected termination
of the channel
	at hudson.remoting.Request.abort(Request.java:257)
	at hudson.remoting.Channel.terminate(Channel.java:602)
	at hudson.remoting.Channel$ReaderThread.run(Channel.java:893)
Caused by: java.io.IOException: Unexpected termination of the channel
	at hudson.remoting.Channel$ReaderThread.run(Channel.java:875)
Caused by: java.io.EOFException
	at java.io.ObjectInputStream$BlockDataInputStream.peekByte(ObjectInputStream.java:2554)
	at java.io.ObjectInputStream.readObject0(ObjectInputStream.java:1297)
	at java.io.ObjectInputStream.readObject(ObjectInputStream.java:351)
	at hudson.remoting.Channel$ReaderThread.run(Channel.java:869)
FATAL: channel is already closed
hudson.remoting.ChannelClosedException: channel is already closed
	at hudson.remoting.Channel.send(Channel.java:412)
	at hudson.remoting.Request.call(Request.java:105)
	at hudson.remoting.Channel.call(Channel.java:555)
	at hudson.Launcher$RemoteLauncher.kill(Launcher.java:744)
	at hudson.model.AbstractBuild$AbstractRunner.run(AbstractBuild.java:421)
	at hudson.model.Run.run(Run.java:1257)
	at hudson.model.FreeStyleBuild.run(FreeStyleBuild.java:46)
	at hudson.model.ResourceController.execute(ResourceController.java:88)
	at hudson.model.Executor.run(Executor.java:127)


Mime
View raw message