hadoop-hive-dev mailing list archives

Site index · List index
Message view « Date » · « Thread »
Top « Date » · « Thread »
From Apache Hudson Server <hud...@hudson.zones.apache.org>
Subject Build failed in Hudson: Hive-trunk-h0.20 #311
Date Thu, 01 Jul 2010 19:09:48 GMT
See <http://hudson.zones.apache.org/hudson/job/Hive-trunk-h0.20/311/changes>

Changes:

[jvs] HIVE-1135. Use Anakia for version controlled documentation
(Edward Capriolo via jvs)

------------------------------------------
[...truncated 6815 lines...]
    [junit] Done query: rcfile_union.q
    [junit] Begin query: reduce_deduplicate.q
    [junit] diff -a -I file: -I /tmp/ -I invalidscheme: -I lastUpdateTime -I lastAccessTime
-I owner -I transient_lastDdlTime -I java.lang.RuntimeException -I at org -I at sun -I at
java -I at junit -I Caused by: -I [.][.][.] [0-9]* more <http://hudson.zones.apache.org/hudson/job/Hive-trunk-h0.20/ws/hive/build/ql/test/logs/clientpositive/reduce_deduplicate.q.out>
<http://hudson.zones.apache.org/hudson/job/Hive-trunk-h0.20/ws/hive/ql/src/test/results/clientpositive/reduce_deduplicate.q.out>
    [junit] Done query: reduce_deduplicate.q
    [junit] Begin query: regex_col.q
    [junit] diff -a -I file: -I /tmp/ -I invalidscheme: -I lastUpdateTime -I lastAccessTime
-I owner -I transient_lastDdlTime -I java.lang.RuntimeException -I at org -I at sun -I at
java -I at junit -I Caused by: -I [.][.][.] [0-9]* more <http://hudson.zones.apache.org/hudson/job/Hive-trunk-h0.20/ws/hive/build/ql/test/logs/clientpositive/regex_col.q.out>
<http://hudson.zones.apache.org/hudson/job/Hive-trunk-h0.20/ws/hive/ql/src/test/results/clientpositive/regex_col.q.out>
    [junit] Done query: regex_col.q
    [junit] Begin query: regexp_extract.q
    [junit] diff -a -I file: -I /tmp/ -I invalidscheme: -I lastUpdateTime -I lastAccessTime
-I owner -I transient_lastDdlTime -I java.lang.RuntimeException -I at org -I at sun -I at
java -I at junit -I Caused by: -I [.][.][.] [0-9]* more <http://hudson.zones.apache.org/hudson/job/Hive-trunk-h0.20/ws/hive/build/ql/test/logs/clientpositive/regexp_extract.q.out>
<http://hudson.zones.apache.org/hudson/job/Hive-trunk-h0.20/ws/hive/ql/src/test/results/clientpositive/regexp_extract.q.out>
    [junit] Done query: regexp_extract.q
    [junit] Begin query: rename_column.q
    [junit] diff -a -I file: -I /tmp/ -I invalidscheme: -I lastUpdateTime -I lastAccessTime
-I owner -I transient_lastDdlTime -I java.lang.RuntimeException -I at org -I at sun -I at
java -I at junit -I Caused by: -I [.][.][.] [0-9]* more <http://hudson.zones.apache.org/hudson/job/Hive-trunk-h0.20/ws/hive/build/ql/test/logs/clientpositive/rename_column.q.out>
<http://hudson.zones.apache.org/hudson/job/Hive-trunk-h0.20/ws/hive/ql/src/test/results/clientpositive/rename_column.q.out>
    [junit] Done query: rename_column.q
    [junit] Begin query: repair.q
    [junit] diff -a -I file: -I /tmp/ -I invalidscheme: -I lastUpdateTime -I lastAccessTime
-I owner -I transient_lastDdlTime -I java.lang.RuntimeException -I at org -I at sun -I at
java -I at junit -I Caused by: -I [.][.][.] [0-9]* more <http://hudson.zones.apache.org/hudson/job/Hive-trunk-h0.20/ws/hive/build/ql/test/logs/clientpositive/repair.q.out>
<http://hudson.zones.apache.org/hudson/job/Hive-trunk-h0.20/ws/hive/ql/src/test/results/clientpositive/repair.q.out>
    [junit] Done query: repair.q
    [junit] Begin query: router_join_ppr.q
    [junit] diff -a -I file: -I /tmp/ -I invalidscheme: -I lastUpdateTime -I lastAccessTime
-I owner -I transient_lastDdlTime -I java.lang.RuntimeException -I at org -I at sun -I at
java -I at junit -I Caused by: -I [.][.][.] [0-9]* more <http://hudson.zones.apache.org/hudson/job/Hive-trunk-h0.20/ws/hive/build/ql/test/logs/clientpositive/router_join_ppr.q.out>
<http://hudson.zones.apache.org/hudson/job/Hive-trunk-h0.20/ws/hive/ql/src/test/results/clientpositive/router_join_ppr.q.out>
    [junit] Done query: router_join_ppr.q
    [junit] Begin query: sample1.q
    [junit] diff -a -I file: -I /tmp/ -I invalidscheme: -I lastUpdateTime -I lastAccessTime
-I owner -I transient_lastDdlTime -I java.lang.RuntimeException -I at org -I at sun -I at
java -I at junit -I Caused by: -I [.][.][.] [0-9]* more <http://hudson.zones.apache.org/hudson/job/Hive-trunk-h0.20/ws/hive/build/ql/test/logs/clientpositive/sample1.q.out>
<http://hudson.zones.apache.org/hudson/job/Hive-trunk-h0.20/ws/hive/ql/src/test/results/clientpositive/sample1.q.out>
    [junit] Done query: sample1.q
    [junit] Begin query: sample10.q
    [junit] diff -a -I file: -I /tmp/ -I invalidscheme: -I lastUpdateTime -I lastAccessTime
-I owner -I transient_lastDdlTime -I java.lang.RuntimeException -I at org -I at sun -I at
java -I at junit -I Caused by: -I [.][.][.] [0-9]* more <http://hudson.zones.apache.org/hudson/job/Hive-trunk-h0.20/ws/hive/build/ql/test/logs/clientpositive/sample10.q.out>
<http://hudson.zones.apache.org/hudson/job/Hive-trunk-h0.20/ws/hive/ql/src/test/results/clientpositive/sample10.q.out>
    [junit] Done query: sample10.q
    [junit] Begin query: sample2.q
    [junit] diff -a -I file: -I /tmp/ -I invalidscheme: -I lastUpdateTime -I lastAccessTime
-I owner -I transient_lastDdlTime -I java.lang.RuntimeException -I at org -I at sun -I at
java -I at junit -I Caused by: -I [.][.][.] [0-9]* more <http://hudson.zones.apache.org/hudson/job/Hive-trunk-h0.20/ws/hive/build/ql/test/logs/clientpositive/sample2.q.out>
<http://hudson.zones.apache.org/hudson/job/Hive-trunk-h0.20/ws/hive/ql/src/test/results/clientpositive/sample2.q.out>
    [junit] Done query: sample2.q
    [junit] Begin query: sample3.q
    [junit] diff -a -I file: -I /tmp/ -I invalidscheme: -I lastUpdateTime -I lastAccessTime
-I owner -I transient_lastDdlTime -I java.lang.RuntimeException -I at org -I at sun -I at
java -I at junit -I Caused by: -I [.][.][.] [0-9]* more <http://hudson.zones.apache.org/hudson/job/Hive-trunk-h0.20/ws/hive/build/ql/test/logs/clientpositive/sample3.q.out>
<http://hudson.zones.apache.org/hudson/job/Hive-trunk-h0.20/ws/hive/ql/src/test/results/clientpositive/sample3.q.out>
    [junit] Done query: sample3.q
    [junit] Begin query: sample4.q
    [junit] diff -a -I file: -I /tmp/ -I invalidscheme: -I lastUpdateTime -I lastAccessTime
-I owner -I transient_lastDdlTime -I java.lang.RuntimeException -I at org -I at sun -I at
java -I at junit -I Caused by: -I [.][.][.] [0-9]* more <http://hudson.zones.apache.org/hudson/job/Hive-trunk-h0.20/ws/hive/build/ql/test/logs/clientpositive/sample4.q.out>
<http://hudson.zones.apache.org/hudson/job/Hive-trunk-h0.20/ws/hive/ql/src/test/results/clientpositive/sample4.q.out>
    [junit] Done query: sample4.q
    [junit] Begin query: sample5.q
    [junit] diff -a -I file: -I /tmp/ -I invalidscheme: -I lastUpdateTime -I lastAccessTime
-I owner -I transient_lastDdlTime -I java.lang.RuntimeException -I at org -I at sun -I at
java -I at junit -I Caused by: -I [.][.][.] [0-9]* more <http://hudson.zones.apache.org/hudson/job/Hive-trunk-h0.20/ws/hive/build/ql/test/logs/clientpositive/sample5.q.out>
<http://hudson.zones.apache.org/hudson/job/Hive-trunk-h0.20/ws/hive/ql/src/test/results/clientpositive/sample5.q.out>
    [junit] Done query: sample5.q
    [junit] Begin query: sample6.q
    [junit] diff -a -I file: -I /tmp/ -I invalidscheme: -I lastUpdateTime -I lastAccessTime
-I owner -I transient_lastDdlTime -I java.lang.RuntimeException -I at org -I at sun -I at
java -I at junit -I Caused by: -I [.][.][.] [0-9]* more <http://hudson.zones.apache.org/hudson/job/Hive-trunk-h0.20/ws/hive/build/ql/test/logs/clientpositive/sample6.q.out>
<http://hudson.zones.apache.org/hudson/job/Hive-trunk-h0.20/ws/hive/ql/src/test/results/clientpositive/sample6.q.out>
    [junit] Done query: sample6.q
    [junit] Begin query: sample7.q
    [junit] diff -a -I file: -I /tmp/ -I invalidscheme: -I lastUpdateTime -I lastAccessTime
-I owner -I transient_lastDdlTime -I java.lang.RuntimeException -I at org -I at sun -I at
java -I at junit -I Caused by: -I [.][.][.] [0-9]* more <http://hudson.zones.apache.org/hudson/job/Hive-trunk-h0.20/ws/hive/build/ql/test/logs/clientpositive/sample7.q.out>
<http://hudson.zones.apache.org/hudson/job/Hive-trunk-h0.20/ws/hive/ql/src/test/results/clientpositive/sample7.q.out>
    [junit] Done query: sample7.q
    [junit] Begin query: sample8.q
    [junit] diff -a -I file: -I /tmp/ -I invalidscheme: -I lastUpdateTime -I lastAccessTime
-I owner -I transient_lastDdlTime -I java.lang.RuntimeException -I at org -I at sun -I at
java -I at junit -I Caused by: -I [.][.][.] [0-9]* more <http://hudson.zones.apache.org/hudson/job/Hive-trunk-h0.20/ws/hive/build/ql/test/logs/clientpositive/sample8.q.out>
<http://hudson.zones.apache.org/hudson/job/Hive-trunk-h0.20/ws/hive/ql/src/test/results/clientpositive/sample8.q.out>
    [junit] Done query: sample8.q
    [junit] Begin query: sample9.q
    [junit] diff -a -I file: -I /tmp/ -I invalidscheme: -I lastUpdateTime -I lastAccessTime
-I owner -I transient_lastDdlTime -I java.lang.RuntimeException -I at org -I at sun -I at
java -I at junit -I Caused by: -I [.][.][.] [0-9]* more <http://hudson.zones.apache.org/hudson/job/Hive-trunk-h0.20/ws/hive/build/ql/test/logs/clientpositive/sample9.q.out>
<http://hudson.zones.apache.org/hudson/job/Hive-trunk-h0.20/ws/hive/ql/src/test/results/clientpositive/sample9.q.out>
    [junit] Done query: sample9.q
    [junit] Begin query: script_env_var1.q
    [junit] diff -a -I file: -I /tmp/ -I invalidscheme: -I lastUpdateTime -I lastAccessTime
-I owner -I transient_lastDdlTime -I java.lang.RuntimeException -I at org -I at sun -I at
java -I at junit -I Caused by: -I [.][.][.] [0-9]* more <http://hudson.zones.apache.org/hudson/job/Hive-trunk-h0.20/ws/hive/build/ql/test/logs/clientpositive/script_env_var1.q.out>
<http://hudson.zones.apache.org/hudson/job/Hive-trunk-h0.20/ws/hive/ql/src/test/results/clientpositive/script_env_var1.q.out>
    [junit] Done query: script_env_var1.q
    [junit] Begin query: script_env_var2.q
    [junit] diff -a -I file: -I /tmp/ -I invalidscheme: -I lastUpdateTime -I lastAccessTime
-I owner -I transient_lastDdlTime -I java.lang.RuntimeException -I at org -I at sun -I at
java -I at junit -I Caused by: -I [.][.][.] [0-9]* more <http://hudson.zones.apache.org/hudson/job/Hive-trunk-h0.20/ws/hive/build/ql/test/logs/clientpositive/script_env_var2.q.out>
<http://hudson.zones.apache.org/hudson/job/Hive-trunk-h0.20/ws/hive/ql/src/test/results/clientpositive/script_env_var2.q.out>
    [junit] Done query: script_env_var2.q
    [junit] Begin query: script_pipe.q
    [junit] diff -a -I file: -I /tmp/ -I invalidscheme: -I lastUpdateTime -I lastAccessTime
-I owner -I transient_lastDdlTime -I java.lang.RuntimeException -I at org -I at sun -I at
java -I at junit -I Caused by: -I [.][.][.] [0-9]* more <http://hudson.zones.apache.org/hudson/job/Hive-trunk-h0.20/ws/hive/build/ql/test/logs/clientpositive/script_pipe.q.out>
<http://hudson.zones.apache.org/hudson/job/Hive-trunk-h0.20/ws/hive/ql/src/test/results/clientpositive/script_pipe.q.out>
    [junit] Done query: script_pipe.q
    [junit] Begin query: scriptfile1.q
    [junit] diff -a -I file: -I /tmp/ -I invalidscheme: -I lastUpdateTime -I lastAccessTime
-I owner -I transient_lastDdlTime -I java.lang.RuntimeException -I at org -I at sun -I at
java -I at junit -I Caused by: -I [.][.][.] [0-9]* more <http://hudson.zones.apache.org/hudson/job/Hive-trunk-h0.20/ws/hive/build/ql/test/logs/clientpositive/scriptfile1.q.out>
<http://hudson.zones.apache.org/hudson/job/Hive-trunk-h0.20/ws/hive/ql/src/test/results/clientpositive/scriptfile1.q.out>
    [junit] Done query: scriptfile1.q
    [junit] Begin query: select_as_omitted.q
    [junit] diff -a -I file: -I /tmp/ -I invalidscheme: -I lastUpdateTime -I lastAccessTime
-I owner -I transient_lastDdlTime -I java.lang.RuntimeException -I at org -I at sun -I at
java -I at junit -I Caused by: -I [.][.][.] [0-9]* more <http://hudson.zones.apache.org/hudson/job/Hive-trunk-h0.20/ws/hive/build/ql/test/logs/clientpositive/select_as_omitted.q.out>
<http://hudson.zones.apache.org/hudson/job/Hive-trunk-h0.20/ws/hive/ql/src/test/results/clientpositive/select_as_omitted.q.out>
    [junit] Done query: select_as_omitted.q
    [junit] Begin query: select_transform_hint.q
    [junit] diff -a -I file: -I /tmp/ -I invalidscheme: -I lastUpdateTime -I lastAccessTime
-I owner -I transient_lastDdlTime -I java.lang.RuntimeException -I at org -I at sun -I at
java -I at junit -I Caused by: -I [.][.][.] [0-9]* more <http://hudson.zones.apache.org/hudson/job/Hive-trunk-h0.20/ws/hive/build/ql/test/logs/clientpositive/select_transform_hint.q.out>
<http://hudson.zones.apache.org/hudson/job/Hive-trunk-h0.20/ws/hive/ql/src/test/results/clientpositive/select_transform_hint.q.out>
    [junit] Done query: select_transform_hint.q
    [junit] Begin query: semijoin.q
    [junit] diff -a -I file: -I /tmp/ -I invalidscheme: -I lastUpdateTime -I lastAccessTime
-I owner -I transient_lastDdlTime -I java.lang.RuntimeException -I at org -I at sun -I at
java -I at junit -I Caused by: -I [.][.][.] [0-9]* more <http://hudson.zones.apache.org/hudson/job/Hive-trunk-h0.20/ws/hive/build/ql/test/logs/clientpositive/semijoin.q.out>
<http://hudson.zones.apache.org/hudson/job/Hive-trunk-h0.20/ws/hive/ql/src/test/results/clientpositive/semijoin.q.out>
    [junit] Done query: semijoin.q
    [junit] Begin query: show_describe_func_quotes.q
    [junit] diff -a -I file: -I /tmp/ -I invalidscheme: -I lastUpdateTime -I lastAccessTime
-I owner -I transient_lastDdlTime -I java.lang.RuntimeException -I at org -I at sun -I at
java -I at junit -I Caused by: -I [.][.][.] [0-9]* more <http://hudson.zones.apache.org/hudson/job/Hive-trunk-h0.20/ws/hive/build/ql/test/logs/clientpositive/show_describe_func_quotes.q.out>
<http://hudson.zones.apache.org/hudson/job/Hive-trunk-h0.20/ws/hive/ql/src/test/results/clientpositive/show_describe_func_quotes.q.out>
    [junit] Done query: show_describe_func_quotes.q
    [junit] Begin query: show_functions.q
    [junit] diff -a -I file: -I /tmp/ -I invalidscheme: -I lastUpdateTime -I lastAccessTime
-I owner -I transient_lastDdlTime -I java.lang.RuntimeException -I at org -I at sun -I at
java -I at junit -I Caused by: -I [.][.][.] [0-9]* more <http://hudson.zones.apache.org/hudson/job/Hive-trunk-h0.20/ws/hive/build/ql/test/logs/clientpositive/show_functions.q.out>
<http://hudson.zones.apache.org/hudson/job/Hive-trunk-h0.20/ws/hive/ql/src/test/results/clientpositive/show_functions.q.out>
    [junit] Done query: show_functions.q
    [junit] Begin query: show_partitions.q
    [junit] diff -a -I file: -I /tmp/ -I invalidscheme: -I lastUpdateTime -I lastAccessTime
-I owner -I transient_lastDdlTime -I java.lang.RuntimeException -I at org -I at sun -I at
java -I at junit -I Caused by: -I [.][.][.] [0-9]* more <http://hudson.zones.apache.org/hudson/job/Hive-trunk-h0.20/ws/hive/build/ql/test/logs/clientpositive/show_partitions.q.out>
<http://hudson.zones.apache.org/hudson/job/Hive-trunk-h0.20/ws/hive/ql/src/test/results/clientpositive/show_partitions.q.out>
    [junit] Done query: show_partitions.q
    [junit] Begin query: show_tables.q
    [junit] diff -a -I file: -I /tmp/ -I invalidscheme: -I lastUpdateTime -I lastAccessTime
-I owner -I transient_lastDdlTime -I java.lang.RuntimeException -I at org -I at sun -I at
java -I at junit -I Caused by: -I [.][.][.] [0-9]* more <http://hudson.zones.apache.org/hudson/job/Hive-trunk-h0.20/ws/hive/build/ql/test/logs/clientpositive/show_tables.q.out>
<http://hudson.zones.apache.org/hudson/job/Hive-trunk-h0.20/ws/hive/ql/src/test/results/clientpositive/show_tables.q.out>
    [junit] Done query: show_tables.q
    [junit] Begin query: show_tablestatus.q
    [junit] diff -a -I file: -I /tmp/ -I invalidscheme: -I lastUpdateTime -I lastAccessTime
-I owner -I transient_lastDdlTime -I java.lang.RuntimeException -I at org -I at sun -I at
java -I at junit -I Caused by: -I [.][.][.] [0-9]* more <http://hudson.zones.apache.org/hudson/job/Hive-trunk-h0.20/ws/hive/build/ql/test/logs/clientpositive/show_tablestatus.q.out>
<http://hudson.zones.apache.org/hudson/job/Hive-trunk-h0.20/ws/hive/ql/src/test/results/clientpositive/show_tablestatus.q.out>
    [junit] Done query: show_tablestatus.q
    [junit] Begin query: showparts.q
    [junit] diff -a -I file: -I /tmp/ -I invalidscheme: -I lastUpdateTime -I lastAccessTime
-I owner -I transient_lastDdlTime -I java.lang.RuntimeException -I at org -I at sun -I at
java -I at junit -I Caused by: -I [.][.][.] [0-9]* more <http://hudson.zones.apache.org/hudson/job/Hive-trunk-h0.20/ws/hive/build/ql/test/logs/clientpositive/showparts.q.out>
<http://hudson.zones.apache.org/hudson/job/Hive-trunk-h0.20/ws/hive/ql/src/test/results/clientpositive/showparts.q.out>
    [junit] Done query: showparts.q
    [junit] Begin query: skewjoin.q
    [junit] diff -a -I file: -I /tmp/ -I invalidscheme: -I lastUpdateTime -I lastAccessTime
-I owner -I transient_lastDdlTime -I java.lang.RuntimeException -I at org -I at sun -I at
java -I at junit -I Caused by: -I [.][.][.] [0-9]* more <http://hudson.zones.apache.org/hudson/job/Hive-trunk-h0.20/ws/hive/build/ql/test/logs/clientpositive/skewjoin.q.out>
<http://hudson.zones.apache.org/hudson/job/Hive-trunk-h0.20/ws/hive/ql/src/test/results/clientpositive/skewjoin.q.out>
    [junit] Done query: skewjoin.q
    [junit] Begin query: smb_mapjoin_1.q
    [junit] diff -a -I file: -I /tmp/ -I invalidscheme: -I lastUpdateTime -I lastAccessTime
-I owner -I transient_lastDdlTime -I java.lang.RuntimeException -I at org -I at sun -I at
java -I at junit -I Caused by: -I [.][.][.] [0-9]* more <http://hudson.zones.apache.org/hudson/job/Hive-trunk-h0.20/ws/hive/build/ql/test/logs/clientpositive/smb_mapjoin_1.q.out>
<http://hudson.zones.apache.org/hudson/job/Hive-trunk-h0.20/ws/hive/ql/src/test/results/clientpositive/smb_mapjoin_1.q.out>
    [junit] Done query: smb_mapjoin_1.q
    [junit] Begin query: smb_mapjoin_2.q
    [junit] diff -a -I file: -I /tmp/ -I invalidscheme: -I lastUpdateTime -I lastAccessTime
-I owner -I transient_lastDdlTime -I java.lang.RuntimeException -I at org -I at sun -I at
java -I at junit -I Caused by: -I [.][.][.] [0-9]* more <http://hudson.zones.apache.org/hudson/job/Hive-trunk-h0.20/ws/hive/build/ql/test/logs/clientpositive/smb_mapjoin_2.q.out>
<http://hudson.zones.apache.org/hudson/job/Hive-trunk-h0.20/ws/hive/ql/src/test/results/clientpositive/smb_mapjoin_2.q.out>
    [junit] Done query: smb_mapjoin_2.q
    [junit] Begin query: smb_mapjoin_3.q
    [junit] diff -a -I file: -I /tmp/ -I invalidscheme: -I lastUpdateTime -I lastAccessTime
-I owner -I transient_lastDdlTime -I java.lang.RuntimeException -I at org -I at sun -I at
java -I at junit -I Caused by: -I [.][.][.] [0-9]* more <http://hudson.zones.apache.org/hudson/job/Hive-trunk-h0.20/ws/hive/build/ql/test/logs/clientpositive/smb_mapjoin_3.q.out>
<http://hudson.zones.apache.org/hudson/job/Hive-trunk-h0.20/ws/hive/ql/src/test/results/clientpositive/smb_mapjoin_3.q.out>
    [junit] Done query: smb_mapjoin_3.q
    [junit] Begin query: smb_mapjoin_4.q
    [junit] diff -a -I file: -I /tmp/ -I invalidscheme: -I lastUpdateTime -I lastAccessTime
-I owner -I transient_lastDdlTime -I java.lang.RuntimeException -I at org -I at sun -I at
java -I at junit -I Caused by: -I [.][.][.] [0-9]* more <http://hudson.zones.apache.org/hudson/job/Hive-trunk-h0.20/ws/hive/build/ql/test/logs/clientpositive/smb_mapjoin_4.q.out>
<http://hudson.zones.apache.org/hudson/job/Hive-trunk-h0.20/ws/hive/ql/src/test/results/clientpositive/smb_mapjoin_4.q.out>
    [junit] Done query: smb_mapjoin_4.q
    [junit] Begin query: smb_mapjoin_5.q
    [junit] diff -a -I file: -I /tmp/ -I invalidscheme: -I lastUpdateTime -I lastAccessTime
-I owner -I transient_lastDdlTime -I java.lang.RuntimeException -I at org -I at sun -I at
java -I at junit -I Caused by: -I [.][.][.] [0-9]* more <http://hudson.zones.apache.org/hudson/job/Hive-trunk-h0.20/ws/hive/build/ql/test/logs/clientpositive/smb_mapjoin_5.q.out>
<http://hudson.zones.apache.org/hudson/job/Hive-trunk-h0.20/ws/hive/ql/src/test/results/clientpositive/smb_mapjoin_5.q.out>
    [junit] Done query: smb_mapjoin_5.q
    [junit] Begin query: smb_mapjoin_6.q
    [junit] diff -a -I file: -I /tmp/ -I invalidscheme: -I lastUpdateTime -I lastAccessTime
-I owner -I transient_lastDdlTime -I java.lang.RuntimeException -I at org -I at sun -I at
java -I at junit -I Caused by: -I [.][.][.] [0-9]* more <http://hudson.zones.apache.org/hudson/job/Hive-trunk-h0.20/ws/hive/build/ql/test/logs/clientpositive/smb_mapjoin_6.q.out>
<http://hudson.zones.apache.org/hudson/job/Hive-trunk-h0.20/ws/hive/ql/src/test/results/clientpositive/smb_mapjoin_6.q.out>
    [junit] Done query: smb_mapjoin_6.q
    [junit] Begin query: smb_mapjoin_7.q
    [junit] diff -a -I file: -I /tmp/ -I invalidscheme: -I lastUpdateTime -I lastAccessTime
-I owner -I transient_lastDdlTime -I java.lang.RuntimeException -I at org -I at sun -I at
java -I at junit -I Caused by: -I [.][.][.] [0-9]* more <http://hudson.zones.apache.org/hudson/job/Hive-trunk-h0.20/ws/hive/build/ql/test/logs/clientpositive/smb_mapjoin_7.q.out>
<http://hudson.zones.apache.org/hudson/job/Hive-trunk-h0.20/ws/hive/ql/src/test/results/clientpositive/smb_mapjoin_7.q.out>
    [junit] Done query: smb_mapjoin_7.q
    [junit] Begin query: smb_mapjoin_8.q
    [junit] diff -a -I file: -I /tmp/ -I invalidscheme: -I lastUpdateTime -I lastAccessTime
-I owner -I transient_lastDdlTime -I java.lang.RuntimeException -I at org -I at sun -I at
java -I at junit -I Caused by: -I [.][.][.] [0-9]* more <http://hudson.zones.apache.org/hudson/job/Hive-trunk-h0.20/ws/hive/build/ql/test/logs/clientpositive/smb_mapjoin_8.q.out>
<http://hudson.zones.apache.org/hudson/job/Hive-trunk-h0.20/ws/hive/ql/src/test/results/clientpositive/smb_mapjoin_8.q.out>
    [junit] Done query: smb_mapjoin_8.q
    [junit] Begin query: sort.q
    [junit] diff -a -I file: -I /tmp/ -I invalidscheme: -I lastUpdateTime -I lastAccessTime
-I owner -I transient_lastDdlTime -I java.lang.RuntimeException -I at org -I at sun -I at
java -I at junit -I Caused by: -I [.][.][.] [0-9]* more <http://hudson.zones.apache.org/hudson/job/Hive-trunk-h0.20/ws/hive/build/ql/test/logs/clientpositive/sort.q.out>
<http://hudson.zones.apache.org/hudson/job/Hive-trunk-h0.20/ws/hive/ql/src/test/results/clientpositive/sort.q.out>
    [junit] Done query: sort.q
    [junit] Begin query: subq.q
    [junit] diff -a -I file: -I /tmp/ -I invalidscheme: -I lastUpdateTime -I lastAccessTime
-I owner -I transient_lastDdlTime -I java.lang.RuntimeException -I at org -I at sun -I at
java -I at junit -I Caused by: -I [.][.][.] [0-9]* more <http://hudson.zones.apache.org/hudson/job/Hive-trunk-h0.20/ws/hive/build/ql/test/logs/clientpositive/subq.q.out>
<http://hudson.zones.apache.org/hudson/job/Hive-trunk-h0.20/ws/hive/ql/src/test/results/clientpositive/subq.q.out>
    [junit] Done query: subq.q
    [junit] Begin query: subq2.q
    [junit] diff -a -I file: -I /tmp/ -I invalidscheme: -I lastUpdateTime -I lastAccessTime
-I owner -I transient_lastDdlTime -I java.lang.RuntimeException -I at org -I at sun -I at
java -I at junit -I Caused by: -I [.][.][.] [0-9]* more <http://hudson.zones.apache.org/hudson/job/Hive-trunk-h0.20/ws/hive/build/ql/test/logs/clientpositive/subq2.q.out>
<http://hudson.zones.apache.org/hudson/job/Hive-trunk-h0.20/ws/hive/ql/src/test/results/clientpositive/subq2.q.out>
    [junit] Done query: subq2.q
    [junit] Begin query: symlink_text_input_format.q
    [junit] diff -a -I file: -I /tmp/ -I invalidscheme: -I lastUpdateTime -I lastAccessTime
-I owner -I transient_lastDdlTime -I java.lang.RuntimeException -I at org -I at sun -I at
java -I at junit -I Caused by: -I [.][.][.] [0-9]* more <http://hudson.zones.apache.org/hudson/job/Hive-trunk-h0.20/ws/hive/build/ql/test/logs/clientpositive/symlink_text_input_format.q.out>
<http://hudson.zones.apache.org/hudson/job/Hive-trunk-h0.20/ws/hive/ql/src/test/results/clientpositive/symlink_text_input_format.q.out>
    [junit] Done query: symlink_text_input_format.q
    [junit] Begin query: tablename_with_select.q
    [junit] diff -a -I file: -I /tmp/ -I invalidscheme: -I lastUpdateTime -I lastAccessTime
-I owner -I transient_lastDdlTime -I java.lang.RuntimeException -I at org -I at sun -I at
java -I at junit -I Caused by: -I [.][.][.] [0-9]* more <http://hudson.zones.apache.org/hudson/job/Hive-trunk-h0.20/ws/hive/build/ql/test/logs/clientpositive/tablename_with_select.q.out>
<http://hudson.zones.apache.org/hudson/job/Hive-trunk-h0.20/ws/hive/ql/src/test/results/clientpositive/tablename_with_select.q.out>
    [junit] Done query: tablename_with_select.q
    [junit] Begin query: touch.q
    [junit] diff -a -I file: -I /tmp/ -I invalidscheme: -I lastUpdateTime -I lastAccessTime
-I owner -I transient_lastDdlTime -I java.lang.RuntimeException -I at org -I at sun -I at
java -I at junit -I Caused by: -I [.][.][.] [0-9]* more <http://hudson.zones.apache.org/hudson/job/Hive-trunk-h0.20/ws/hive/build/ql/test/logs/clientpositive/touch.q.out>
<http://hudson.zones.apache.org/hudson/job/Hive-trunk-h0.20/ws/hive/ql/src/test/results/clientpositive/touch.q.out>
    [junit] Done query: touch.q
    [junit] Begin query: transform1.q
    [junit] diff -a -I file: -I /tmp/ -I invalidscheme: -I lastUpdateTime -I lastAccessTime
-I owner -I transient_lastDdlTime -I java.lang.RuntimeException -I at org -I at sun -I at
java -I at junit -I Caused by: -I [.][.][.] [0-9]* more <http://hudson.zones.apache.org/hudson/job/Hive-trunk-h0.20/ws/hive/build/ql/test/logs/clientpositive/transform1.q.out>
<http://hudson.zones.apache.org/hudson/job/Hive-trunk-h0.20/ws/hive/ql/src/test/results/clientpositive/transform1.q.out>
    [junit] Done query: transform1.q
    [junit] Begin query: transform2.q
    [junit] diff -a -I file: -I /tmp/ -I invalidscheme: -I lastUpdateTime -I lastAccessTime
-I owner -I transient_lastDdlTime -I java.lang.RuntimeException -I at org -I at sun -I at
java -I at junit -I Caused by: -I [.][.][.] [0-9]* more <http://hudson.zones.apache.org/hudson/job/Hive-trunk-h0.20/ws/hive/build/ql/test/logs/clientpositive/transform2.q.out>
<http://hudson.zones.apache.org/hudson/job/Hive-trunk-h0.20/ws/hive/ql/src/test/results/clientpositive/transform2.q.out>
    [junit] Done query: transform2.q
    [junit] Begin query: transform_ppr1.q
    [junit] diff -a -I file: -I /tmp/ -I invalidscheme: -I lastUpdateTime -I lastAccessTime
-I owner -I transient_lastDdlTime -I java.lang.RuntimeException -I at org -I at sun -I at
java -I at junit -I Caused by: -I [.][.][.] [0-9]* more <http://hudson.zones.apache.org/hudson/job/Hive-trunk-h0.20/ws/hive/build/ql/test/logs/clientpositive/transform_ppr1.q.out>
<http://hudson.zones.apache.org/hudson/job/Hive-trunk-h0.20/ws/hive/ql/src/test/results/clientpositive/transform_ppr1.q.out>
    [junit] Done query: transform_ppr1.q
    [junit] Begin query: transform_ppr2.q
    [junit] diff -a -I file: -I /tmp/ -I invalidscheme: -I lastUpdateTime -I lastAccessTime
-I owner -I transient_lastDdlTime -I java.lang.RuntimeException -I at org -I at sun -I at
java -I at junit -I Caused by: -I [.][.][.] [0-9]* more <http://hudson.zones.apache.org/hudson/job/Hive-trunk-h0.20/ws/hive/build/ql/test/logs/clientpositive/transform_ppr2.q.out>
<http://hudson.zones.apache.org/hudson/job/Hive-trunk-h0.20/ws/hive/ql/src/test/results/clientpositive/transform_ppr2.q.out>
    [junit] Done query: transform_ppr2.q
    [junit] Begin query: type_cast_1.q
    [junit] diff -a -I file: -I /tmp/ -I invalidscheme: -I lastUpdateTime -I lastAccessTime
-I owner -I transient_lastDdlTime -I java.lang.RuntimeException -I at org -I at sun -I at
java -I at junit -I Caused by: -I [.][.][.] [0-9]* more <http://hudson.zones.apache.org/hudson/job/Hive-trunk-h0.20/ws/hive/build/ql/test/logs/clientpositive/type_cast_1.q.out>
<http://hudson.zones.apache.org/hudson/job/Hive-trunk-h0.20/ws/hive/ql/src/test/results/clientpositive/type_cast_1.q.out>
    [junit] Done query: type_cast_1.q
    [junit] Begin query: udaf_avg.q
    [junit] diff -a -I file: -I /tmp/ -I invalidscheme: -I lastUpdateTime -I lastAccessTime
-I owner -I transient_lastDdlTime -I java.lang.RuntimeException -I at org -I at sun -I at
java -I at junit -I Caused by: -I [.][.][.] [0-9]* more <http://hudson.zones.apache.org/hudson/job/Hive-trunk-h0.20/ws/hive/build/ql/test/logs/clientpositive/udaf_avg.q.out>
<http://hudson.zones.apache.org/hudson/job/Hive-trunk-h0.20/ws/hive/ql/src/test/results/clientpositive/udaf_avg.q.out>
    [junit] Done query: udaf_avg.q
    [junit] Begin query: udaf_count.q
    [junit] diff -a -I file: -I /tmp/ -I invalidscheme: -I lastUpdateTime -I lastAccessTime
-I owner -I transient_lastDdlTime -I java.lang.RuntimeException -I at org -I at sun -I at
java -I at junit -I Caused by: -I [.][.][.] [0-9]* more <http://hudson.zones.apache.org/hudson/job/Hive-trunk-h0.20/ws/hive/build/ql/test/logs/clientpositive/udaf_count.q.out>
<http://hudson.zones.apache.org/hudson/job/Hive-trunk-h0.20/ws/hive/ql/src/test/results/clientpositive/udaf_count.q.out>
    [junit] Done query: udaf_count.q
    [junit] Begin query: udaf_histogram_numeric.q
    [junit] diff -a -I file: -I /tmp/ -I invalidscheme: -I lastUpdateTime -I lastAccessTime
-I owner -I transient_lastDdlTime -I java.lang.RuntimeException -I at org -I at sun -I at
java -I at junit -I Caused by: -I [.][.][.] [0-9]* more <http://hudson.zones.apache.org/hudson/job/Hive-trunk-h0.20/ws/hive/build/ql/test/logs/clientpositive/udaf_histogram_numeric.q.out>
<http://hudson.zones.apache.org/hudson/job/Hive-trunk-h0.20/ws/hive/ql/src/test/results/clientpositive/udaf_histogram_numeric.q.out>
    [junit] Done query: udaf_histogram_numeric.q
    [junit] Begin query: udaf_max.q
    [junit] diff -a -I file: -I /tmp/ -I invalidscheme: -I lastUpdateTime -I lastAccessTime
-I owner -I transient_lastDdlTime -I java.lang.RuntimeException -I at org -I at sun -I at
java -I at junit -I Caused by: -I [.][.][.] [0-9]* more <http://hudson.zones.apache.org/hudson/job/Hive-trunk-h0.20/ws/hive/build/ql/test/logs/clientpositive/udaf_max.q.out>
<http://hudson.zones.apache.org/hudson/job/Hive-trunk-h0.20/ws/hive/ql/src/test/results/clientpositive/udaf_max.q.out>
    [junit] Done query: udaf_max.q
    [junit] Begin query: udaf_min.q
    [junit] diff -a -I file: -I /tmp/ -I invalidscheme: -I lastUpdateTime -I lastAccessTime
-I owner -I transient_lastDdlTime -I java.lang.RuntimeException -I at org -I at sun -I at
java -I at junit -I Caused by: -I [.][.][.] [0-9]* more <http://hudson.zones.apache.org/hudson/job/Hive-trunk-h0.20/ws/hive/build/ql/test/logs/clientpositive/udaf_min.q.out>
<http://hudson.zones.apache.org/hudson/job/Hive-trunk-h0.20/ws/hive/ql/src/test/results/clientpositive/udaf_min.q.out>
    [junit] Done query: udaf_min.q
    [junit] Begin query: udaf_number_format.q
    [junit] diff -a -I file: -I /tmp/ -I invalidscheme: -I lastUpdateTime -I lastAccessTime
-I owner -I transient_lastDdlTime -I java.lang.RuntimeException -I at org -I at sun -I at
java -I at junit -I Caused by: -I [.][.][.] [0-9]* more <http://hudson.zones.apache.org/hudson/job/Hive-trunk-h0.20/ws/hive/build/ql/test/logs/clientpositive/udaf_number_format.q.out>
<http://hudson.zones.apache.org/hudson/job/Hive-trunk-h0.20/ws/hive/ql/src/test/results/clientpositive/udaf_number_format.q.out>
    [junit] Done query: udaf_number_format.q
    [junit] Begin query: udaf_percentile_approx.q
    [junit] diff -a -I file: -I /tmp/ -I invalidscheme: -I lastUpdateTime -I lastAccessTime
-I owner -I transient_lastDdlTime -I java.lang.RuntimeException -I at org -I at sun -I at
java -I at junit -I Caused by: -I [.][.][.] [0-9]* more <http://hudson.zones.apache.org/hudson/job/Hive-trunk-h0.20/ws/hive/build/ql/test/logs/clientpositive/udaf_percentile_approx.q.out>
<http://hudson.zones.apache.org/hudson/job/Hive-trunk-h0.20/ws/hive/ql/src/test/results/clientpositive/udaf_percentile_approx.q.out>
    [junit] Done query: udaf_percentile_approx.q
    [junit] Begin query: udaf_std.q
    [junit] diff -a -I file: -I /tmp/ -I invalidscheme: -I lastUpdateTime -I lastAccessTime
-I owner -I transient_lastDdlTime -I java.lang.RuntimeException -I at org -I at sun -I at
java -I at junit -I Caused by: -I [.][.][.] [0-9]* more <http://hudson.zones.apache.org/hudson/job/Hive-trunk-h0.20/ws/hive/build/ql/test/logs/clientpositive/udaf_std.q.out>
<http://hudson.zones.apache.org/hudson/job/Hive-trunk-h0.20/ws/hive/ql/src/test/results/clientpositive/udaf_std.q.out>
    [junit] Done query: udaf_std.q
    [junit] Begin query: udaf_stddev_samp.q
    [junit] diff -a -I file: -I /tmp/ -I invalidscheme: -I lastUpdateTime -I lastAccessTime
-I owner -I transient_lastDdlTime -I java.lang.RuntimeException -I at org -I at sun -I at
java -I at junit -I Caused by: -I [.][.][.] [0-9]* more <http://hudson.zones.apache.org/hudson/job/Hive-trunk-h0.20/ws/hive/build/ql/test/logs/clientpositive/udaf_stddev_samp.q.out>
<http://hudson.zones.apache.org/hudson/job/Hive-trunk-h0.20/ws/hive/ql/src/test/results/clientpositive/udaf_stddev_samp.q.out>
    [junit] Done query: udaf_stddev_samp.q
    [junit] Begin query: udaf_sum.q
    [junit] diff -a -I file: -I /tmp/ -I invalidscheme: -I lastUpdateTime -I lastAccessTime
-I owner -I transient_lastDdlTime -I java.lang.RuntimeException -I at org -I at sun -I at
java -I at junit -I Caused by: -I [.][.][.] [0-9]* more <http://hudson.zones.apache.org/hudson/job/Hive-trunk-h0.20/ws/hive/build/ql/test/logs/clientpositive/udaf_sum.q.out>
<http://hudson.zones.apache.org/hudson/job/Hive-trunk-h0.20/ws/hive/ql/src/test/results/clientpositive/udaf_sum.q.out>
    [junit] Done query: udaf_sum.q
    [junit] Begin query: udaf_var_samp.q
    [junit] diff -a -I file: -I /tmp/ -I invalidscheme: -I lastUpdateTime -I lastAccessTime
-I owner -I transient_lastDdlTime -I java.lang.RuntimeException -I at org -I at sun -I at
java -I at junit -I Caused by: -I [.][.][.] [0-9]* more <http://hudson.zones.apache.org/hudson/job/Hive-trunk-h0.20/ws/hive/build/ql/test/logs/clientpositive/udaf_var_samp.q.out>
<http://hudson.zones.apache.org/hudson/job/Hive-trunk-h0.20/ws/hive/ql/src/test/results/clientpositive/udaf_var_samp.q.out>
    [junit] Done query: udaf_var_samp.q
    [junit] Begin query: udaf_variance.q
    [junit] diff -a -I file: -I /tmp/ -I invalidscheme: -I lastUpdateTime -I lastAccessTime
-I owner -I transient_lastDdlTime -I java.lang.RuntimeException -I at org -I at sun -I at
java -I at junit -I Caused by: -I [.][.][.] [0-9]* more <http://hudson.zones.apache.org/hudson/job/Hive-trunk-h0.20/ws/hive/build/ql/test/logs/clientpositive/udaf_variance.q.out>
<http://hudson.zones.apache.org/hudson/job/Hive-trunk-h0.20/ws/hive/ql/src/test/results/clientpositive/udaf_variance.q.out>
    [junit] Done query: udaf_variance.q
    [junit] Begin query: udf1.q
    [junit] diff -a -I file: -I /tmp/ -I invalidscheme: -I lastUpdateTime -I lastAccessTime
-I owner -I transient_lastDdlTime -I java.lang.RuntimeException -I at org -I at sun -I at
java -I at junit -I Caused by: -I [.][.][.] [0-9]* more <http://hudson.zones.apache.org/hudson/job/Hive-trunk-h0.20/ws/hive/build/ql/test/logs/clientpositive/udf1.q.out>
<http://hudson.zones.apache.org/hudson/job/Hive-trunk-h0.20/ws/hive/ql/src/test/results/clientpositive/udf1.q.out>
    [junit] Done query: udf1.q
    [junit] Begin query: udf2.q
    [junit] diff -a -I file: -I /tmp/ -I invalidscheme: -I lastUpdateTime -I lastAccessTime
-I owner -I transient_lastDdlTime -I java.lang.RuntimeException -I at org -I at sun -I at
java -I at junit -I Caused by: -I [.][.][.] [0-9]* more <http://hudson.zones.apache.org/hudson/job/Hive-trunk-h0.20/ws/hive/build/ql/test/logs/clientpositive/udf2.q.out>
<http://hudson.zones.apache.org/hudson/job/Hive-trunk-h0.20/ws/hive/ql/src/test/results/clientpositive/udf2.q.out>
    [junit] Done query: udf2.q
    [junit] Begin query: udf3.q
    [junit] diff -a -I file: -I /tmp/ -I invalidscheme: -I lastUpdateTime -I lastAccessTime
-I owner -I transient_lastDdlTime -I java.lang.RuntimeException -I at org -I at sun -I at
java -I at junit -I Caused by: -I [.][.][.] [0-9]* more <http://hudson.zones.apache.org/hudson/job/Hive-trunk-h0.20/ws/hive/build/ql/test/logs/clientpositive/udf3.q.out>
<http://hudson.zones.apache.org/hudson/job/Hive-trunk-h0.20/ws/hive/ql/src/test/results/clientpositive/udf3.q.out>
    [junit] Done query: udf3.q
    [junit] Begin query: udf4.q
    [junit] diff -a -I file: -I /tmp/ -I invalidscheme: -I lastUpdateTime -I lastAccessTime
-I owner -I transient_lastDdlTime -I java.lang.RuntimeException -I at org -I at sun -I at
java -I at junit -I Caused by: -I [.][.][.] [0-9]* more <http://hudson.zones.apache.org/hudson/job/Hive-trunk-h0.20/ws/hive/build/ql/test/logs/clientpositive/udf4.q.out>
<http://hudson.zones.apache.org/hudson/job/Hive-trunk-h0.20/ws/hive/ql/src/test/results/clientpositive/udf4.q.out>
    [junit] Done query: udf4.q
    [junit] Begin query: udf5.q
    [junit] diff -a -I file: -I /tmp/ -I invalidscheme: -I lastUpdateTime -I lastAccessTime
-I owner -I transient_lastDdlTime -I java.lang.RuntimeException -I at org -I at sun -I at
java -I at junit -I Caused by: -I [.][.][.] [0-9]* more <http://hudson.zones.apache.org/hudson/job/Hive-trunk-h0.20/ws/hive/build/ql/test/logs/clientpositive/udf5.q.out>
<http://hudson.zones.apache.org/hudson/job/Hive-trunk-h0.20/ws/hive/ql/src/test/results/clientpositive/udf5.q.out>
    [junit] Done query: udf5.q
    [junit] Begin query: udf6.q
    [junit] diff -a -I file: -I /tmp/ -I invalidscheme: -I lastUpdateTime -I lastAccessTime
-I owner -I transient_lastDdlTime -I java.lang.RuntimeException -I at org -I at sun -I at
java -I at junit -I Caused by: -I [.][.][.] [0-9]* more <http://hudson.zones.apache.org/hudson/job/Hive-trunk-h0.20/ws/hive/build/ql/test/logs/clientpositive/udf6.q.out>
<http://hudson.zones.apache.org/hudson/job/Hive-trunk-h0.20/ws/hive/ql/src/test/results/clientpositive/udf6.q.out>
    [junit] Done query: udf6.q
    [junit] Begin query: udf7.q
    [junit] diff -a -I file: -I /tmp/ -I invalidscheme: -I lastUpdateTime -I lastAccessTime
-I owner -I transient_lastDdlTime -I java.lang.RuntimeException -I at org -I at sun -I at
java -I at junit -I Caused by: -I [.][.][.] [0-9]* more <http://hudson.zones.apache.org/hudson/job/Hive-trunk-h0.20/ws/hive/build/ql/test/logs/clientpositive/udf7.q.out>
<http://hudson.zones.apache.org/hudson/job/Hive-trunk-h0.20/ws/hive/ql/src/test/results/clientpositive/udf7.q.out>
    [junit] Done query: udf7.q
    [junit] Begin query: udf8.q
    [junit] diff -a -I file: -I /tmp/ -I invalidscheme: -I lastUpdateTime -I lastAccessTime
-I owner -I transient_lastDdlTime -I java.lang.RuntimeException -I at org -I at sun -I at
java -I at junit -I Caused by: -I [.][.][.] [0-9]* more <http://hudson.zones.apache.org/hudson/job/Hive-trunk-h0.20/ws/hive/build/ql/test/logs/clientpositive/udf8.q.out>
<http://hudson.zones.apache.org/hudson/job/Hive-trunk-h0.20/ws/hive/ql/src/test/results/clientpositive/udf8.q.out>
    [junit] Done query: udf8.q
    [junit] Begin query: udf9.q
FATAL: command execution failed.
hudson.util.IOException2: Failed to join the process
	at hudson.Proc$RemoteProc.join(Proc.java:312)
	at hudson.Launcher$ProcStarter.join(Launcher.java:275)
	at hudson.tasks.Ant.perform(Ant.java:212)
	at hudson.tasks.BuildStepMonitor$1.perform(BuildStepMonitor.java:19)
	at hudson.model.AbstractBuild$AbstractRunner.perform(AbstractBuild.java:582)
	at hudson.model.Build$RunnerImpl.build(Build.java:165)
	at hudson.model.Build$RunnerImpl.doRun(Build.java:132)
	at hudson.model.AbstractBuild$AbstractRunner.run(AbstractBuild.java:416)
	at hudson.model.Run.run(Run.java:1243)
	at hudson.model.FreeStyleBuild.run(FreeStyleBuild.java:46)
	at hudson.model.ResourceController.execute(ResourceController.java:88)
	at hudson.model.Executor.run(Executor.java:122)
Caused by: java.util.concurrent.ExecutionException: hudson.remoting.RequestAbortedException:
java.io.EOFException
	at hudson.remoting.Request$1.get(Request.java:218)
	at hudson.remoting.Request$1.get(Request.java:172)
	at hudson.remoting.FutureAdapter.get(FutureAdapter.java:55)
	at hudson.Proc$RemoteProc.join(Proc.java:304)
	... 11 more
Caused by: hudson.remoting.RequestAbortedException: java.io.EOFException
	at hudson.remoting.Request.abort(Request.java:257)
	at hudson.remoting.Channel.terminate(Channel.java:598)
	at hudson.remoting.Channel$ReaderThread.run(Channel.java:876)
Caused by: java.io.EOFException
	at java.io.ObjectInputStream$BlockDataInputStream.peekByte(ObjectInputStream.java:2554)
	at java.io.ObjectInputStream.readObject0(ObjectInputStream.java:1297)
	at java.io.ObjectInputStream.readObject(ObjectInputStream.java:351)
	at hudson.remoting.Channel$ReaderThread.run(Channel.java:856)
FATAL: channel is already closed
hudson.remoting.ChannelClosedException: channel is already closed
	at hudson.remoting.Channel.send(Channel.java:412)
	at hudson.remoting.Request.call(Request.java:105)
	at hudson.remoting.Channel.call(Channel.java:551)
	at hudson.Launcher$RemoteLauncher.kill(Launcher.java:735)
	at hudson.model.AbstractBuild$AbstractRunner.run(AbstractBuild.java:421)
	at hudson.model.Run.run(Run.java:1243)
	at hudson.model.FreeStyleBuild.run(FreeStyleBuild.java:46)
	at hudson.model.ResourceController.execute(ResourceController.java:88)
	at hudson.model.Executor.run(Executor.java:122)


Mime
View raw message