hadoop-hive-dev mailing list archives

Site index · List index
Message view « Date » · « Thread »
Top « Date » · « Thread »
From Apache Hudson Server <hud...@hudson.zones.apache.org>
Subject Build failed in Hudson: Hive-trunk-h0.17 #473
Date Fri, 18 Jun 2010 15:09:35 GMT
See <http://hudson.zones.apache.org/hudson/job/Hive-trunk-h0.17/473/changes>

Changes:

[nzhang] HIVE-1383. Allow HBase WAL to be disabled (John Sichi via Ning Zhang)

------------------------------------------
[...truncated 4130 lines...]
    [junit] Done query: transform_ppr1.q
    [junit] Begin query: transform_ppr2.q
    [junit] diff -a -I file: -I /tmp/ -I invalidscheme: -I lastUpdateTime -I lastAccessTime
-I owner -I transient_lastDdlTime -I java.lang.RuntimeException -I at org -I at sun -I at
java -I at junit -I Caused by: -I [.][.][.] [0-9]* more <http://hudson.zones.apache.org/hudson/job/Hive-trunk-h0.17/ws/hive/build/ql/test/logs/clientpositive/transform_ppr2.q.out>
<http://hudson.zones.apache.org/hudson/job/Hive-trunk-h0.17/ws/hive/ql/src/test/results/clientpositive/transform_ppr2.q.out>
    [junit] Done query: transform_ppr2.q
    [junit] Begin query: type_cast_1.q
    [junit] diff -a -I file: -I /tmp/ -I invalidscheme: -I lastUpdateTime -I lastAccessTime
-I owner -I transient_lastDdlTime -I java.lang.RuntimeException -I at org -I at sun -I at
java -I at junit -I Caused by: -I [.][.][.] [0-9]* more <http://hudson.zones.apache.org/hudson/job/Hive-trunk-h0.17/ws/hive/build/ql/test/logs/clientpositive/type_cast_1.q.out>
<http://hudson.zones.apache.org/hudson/job/Hive-trunk-h0.17/ws/hive/ql/src/test/results/clientpositive/type_cast_1.q.out>
    [junit] Done query: type_cast_1.q
    [junit] Begin query: udaf_avg.q
    [junit] diff -a -I file: -I /tmp/ -I invalidscheme: -I lastUpdateTime -I lastAccessTime
-I owner -I transient_lastDdlTime -I java.lang.RuntimeException -I at org -I at sun -I at
java -I at junit -I Caused by: -I [.][.][.] [0-9]* more <http://hudson.zones.apache.org/hudson/job/Hive-trunk-h0.17/ws/hive/build/ql/test/logs/clientpositive/udaf_avg.q.out>
<http://hudson.zones.apache.org/hudson/job/Hive-trunk-h0.17/ws/hive/ql/src/test/results/clientpositive/udaf_avg.q.out>
    [junit] Done query: udaf_avg.q
    [junit] Begin query: udaf_count.q
    [junit] diff -a -I file: -I /tmp/ -I invalidscheme: -I lastUpdateTime -I lastAccessTime
-I owner -I transient_lastDdlTime -I java.lang.RuntimeException -I at org -I at sun -I at
java -I at junit -I Caused by: -I [.][.][.] [0-9]* more <http://hudson.zones.apache.org/hudson/job/Hive-trunk-h0.17/ws/hive/build/ql/test/logs/clientpositive/udaf_count.q.out>
<http://hudson.zones.apache.org/hudson/job/Hive-trunk-h0.17/ws/hive/ql/src/test/results/clientpositive/udaf_count.q.out>
    [junit] Done query: udaf_count.q
    [junit] Begin query: udaf_histogram_numeric.q
    [junit] diff -a -I file: -I /tmp/ -I invalidscheme: -I lastUpdateTime -I lastAccessTime
-I owner -I transient_lastDdlTime -I java.lang.RuntimeException -I at org -I at sun -I at
java -I at junit -I Caused by: -I [.][.][.] [0-9]* more <http://hudson.zones.apache.org/hudson/job/Hive-trunk-h0.17/ws/hive/build/ql/test/logs/clientpositive/udaf_histogram_numeric.q.out>
<http://hudson.zones.apache.org/hudson/job/Hive-trunk-h0.17/ws/hive/ql/src/test/results/clientpositive/udaf_histogram_numeric.q.out>
    [junit] Done query: udaf_histogram_numeric.q
    [junit] Begin query: udaf_max.q
    [junit] diff -a -I file: -I /tmp/ -I invalidscheme: -I lastUpdateTime -I lastAccessTime
-I owner -I transient_lastDdlTime -I java.lang.RuntimeException -I at org -I at sun -I at
java -I at junit -I Caused by: -I [.][.][.] [0-9]* more <http://hudson.zones.apache.org/hudson/job/Hive-trunk-h0.17/ws/hive/build/ql/test/logs/clientpositive/udaf_max.q.out>
<http://hudson.zones.apache.org/hudson/job/Hive-trunk-h0.17/ws/hive/ql/src/test/results/clientpositive/udaf_max.q.out>
    [junit] Done query: udaf_max.q
    [junit] Begin query: udaf_min.q
    [junit] diff -a -I file: -I /tmp/ -I invalidscheme: -I lastUpdateTime -I lastAccessTime
-I owner -I transient_lastDdlTime -I java.lang.RuntimeException -I at org -I at sun -I at
java -I at junit -I Caused by: -I [.][.][.] [0-9]* more <http://hudson.zones.apache.org/hudson/job/Hive-trunk-h0.17/ws/hive/build/ql/test/logs/clientpositive/udaf_min.q.out>
<http://hudson.zones.apache.org/hudson/job/Hive-trunk-h0.17/ws/hive/ql/src/test/results/clientpositive/udaf_min.q.out>
    [junit] Done query: udaf_min.q
    [junit] Begin query: udaf_number_format.q
    [junit] diff -a -I file: -I /tmp/ -I invalidscheme: -I lastUpdateTime -I lastAccessTime
-I owner -I transient_lastDdlTime -I java.lang.RuntimeException -I at org -I at sun -I at
java -I at junit -I Caused by: -I [.][.][.] [0-9]* more <http://hudson.zones.apache.org/hudson/job/Hive-trunk-h0.17/ws/hive/build/ql/test/logs/clientpositive/udaf_number_format.q.out>
<http://hudson.zones.apache.org/hudson/job/Hive-trunk-h0.17/ws/hive/ql/src/test/results/clientpositive/udaf_number_format.q.out>
    [junit] Done query: udaf_number_format.q
    [junit] Begin query: udaf_std.q
    [junit] diff -a -I file: -I /tmp/ -I invalidscheme: -I lastUpdateTime -I lastAccessTime
-I owner -I transient_lastDdlTime -I java.lang.RuntimeException -I at org -I at sun -I at
java -I at junit -I Caused by: -I [.][.][.] [0-9]* more <http://hudson.zones.apache.org/hudson/job/Hive-trunk-h0.17/ws/hive/build/ql/test/logs/clientpositive/udaf_std.q.out>
<http://hudson.zones.apache.org/hudson/job/Hive-trunk-h0.17/ws/hive/ql/src/test/results/clientpositive/udaf_std.q.out>
    [junit] Done query: udaf_std.q
    [junit] Begin query: udaf_stddev_samp.q
    [junit] diff -a -I file: -I /tmp/ -I invalidscheme: -I lastUpdateTime -I lastAccessTime
-I owner -I transient_lastDdlTime -I java.lang.RuntimeException -I at org -I at sun -I at
java -I at junit -I Caused by: -I [.][.][.] [0-9]* more <http://hudson.zones.apache.org/hudson/job/Hive-trunk-h0.17/ws/hive/build/ql/test/logs/clientpositive/udaf_stddev_samp.q.out>
<http://hudson.zones.apache.org/hudson/job/Hive-trunk-h0.17/ws/hive/ql/src/test/results/clientpositive/udaf_stddev_samp.q.out>
    [junit] Done query: udaf_stddev_samp.q
    [junit] Begin query: udaf_sum.q
    [junit] diff -a -I file: -I /tmp/ -I invalidscheme: -I lastUpdateTime -I lastAccessTime
-I owner -I transient_lastDdlTime -I java.lang.RuntimeException -I at org -I at sun -I at
java -I at junit -I Caused by: -I [.][.][.] [0-9]* more <http://hudson.zones.apache.org/hudson/job/Hive-trunk-h0.17/ws/hive/build/ql/test/logs/clientpositive/udaf_sum.q.out>
<http://hudson.zones.apache.org/hudson/job/Hive-trunk-h0.17/ws/hive/ql/src/test/results/clientpositive/udaf_sum.q.out>
    [junit] Done query: udaf_sum.q
    [junit] Begin query: udaf_var_samp.q
    [junit] diff -a -I file: -I /tmp/ -I invalidscheme: -I lastUpdateTime -I lastAccessTime
-I owner -I transient_lastDdlTime -I java.lang.RuntimeException -I at org -I at sun -I at
java -I at junit -I Caused by: -I [.][.][.] [0-9]* more <http://hudson.zones.apache.org/hudson/job/Hive-trunk-h0.17/ws/hive/build/ql/test/logs/clientpositive/udaf_var_samp.q.out>
<http://hudson.zones.apache.org/hudson/job/Hive-trunk-h0.17/ws/hive/ql/src/test/results/clientpositive/udaf_var_samp.q.out>
    [junit] Done query: udaf_var_samp.q
    [junit] Begin query: udaf_variance.q
    [junit] diff -a -I file: -I /tmp/ -I invalidscheme: -I lastUpdateTime -I lastAccessTime
-I owner -I transient_lastDdlTime -I java.lang.RuntimeException -I at org -I at sun -I at
java -I at junit -I Caused by: -I [.][.][.] [0-9]* more <http://hudson.zones.apache.org/hudson/job/Hive-trunk-h0.17/ws/hive/build/ql/test/logs/clientpositive/udaf_variance.q.out>
<http://hudson.zones.apache.org/hudson/job/Hive-trunk-h0.17/ws/hive/ql/src/test/results/clientpositive/udaf_variance.q.out>
    [junit] Done query: udaf_variance.q
    [junit] Begin query: udf1.q
    [junit] diff -a -I file: -I /tmp/ -I invalidscheme: -I lastUpdateTime -I lastAccessTime
-I owner -I transient_lastDdlTime -I java.lang.RuntimeException -I at org -I at sun -I at
java -I at junit -I Caused by: -I [.][.][.] [0-9]* more <http://hudson.zones.apache.org/hudson/job/Hive-trunk-h0.17/ws/hive/build/ql/test/logs/clientpositive/udf1.q.out>
<http://hudson.zones.apache.org/hudson/job/Hive-trunk-h0.17/ws/hive/ql/src/test/results/clientpositive/udf1.q.out>
    [junit] Done query: udf1.q
    [junit] Begin query: udf2.q
    [junit] diff -a -I file: -I /tmp/ -I invalidscheme: -I lastUpdateTime -I lastAccessTime
-I owner -I transient_lastDdlTime -I java.lang.RuntimeException -I at org -I at sun -I at
java -I at junit -I Caused by: -I [.][.][.] [0-9]* more <http://hudson.zones.apache.org/hudson/job/Hive-trunk-h0.17/ws/hive/build/ql/test/logs/clientpositive/udf2.q.out>
<http://hudson.zones.apache.org/hudson/job/Hive-trunk-h0.17/ws/hive/ql/src/test/results/clientpositive/udf2.q.out>
    [junit] Done query: udf2.q
    [junit] Begin query: udf3.q
    [junit] diff -a -I file: -I /tmp/ -I invalidscheme: -I lastUpdateTime -I lastAccessTime
-I owner -I transient_lastDdlTime -I java.lang.RuntimeException -I at org -I at sun -I at
java -I at junit -I Caused by: -I [.][.][.] [0-9]* more <http://hudson.zones.apache.org/hudson/job/Hive-trunk-h0.17/ws/hive/build/ql/test/logs/clientpositive/udf3.q.out>
<http://hudson.zones.apache.org/hudson/job/Hive-trunk-h0.17/ws/hive/ql/src/test/results/clientpositive/udf3.q.out>
    [junit] Done query: udf3.q
    [junit] Begin query: udf4.q
    [junit] diff -a -I file: -I /tmp/ -I invalidscheme: -I lastUpdateTime -I lastAccessTime
-I owner -I transient_lastDdlTime -I java.lang.RuntimeException -I at org -I at sun -I at
java -I at junit -I Caused by: -I [.][.][.] [0-9]* more <http://hudson.zones.apache.org/hudson/job/Hive-trunk-h0.17/ws/hive/build/ql/test/logs/clientpositive/udf4.q.out>
<http://hudson.zones.apache.org/hudson/job/Hive-trunk-h0.17/ws/hive/ql/src/test/results/clientpositive/udf4.q.out>
    [junit] Done query: udf4.q
    [junit] Begin query: udf5.q
    [junit] diff -a -I file: -I /tmp/ -I invalidscheme: -I lastUpdateTime -I lastAccessTime
-I owner -I transient_lastDdlTime -I java.lang.RuntimeException -I at org -I at sun -I at
java -I at junit -I Caused by: -I [.][.][.] [0-9]* more <http://hudson.zones.apache.org/hudson/job/Hive-trunk-h0.17/ws/hive/build/ql/test/logs/clientpositive/udf5.q.out>
<http://hudson.zones.apache.org/hudson/job/Hive-trunk-h0.17/ws/hive/ql/src/test/results/clientpositive/udf5.q.out>
    [junit] Done query: udf5.q
    [junit] Begin query: udf6.q
    [junit] diff -a -I file: -I /tmp/ -I invalidscheme: -I lastUpdateTime -I lastAccessTime
-I owner -I transient_lastDdlTime -I java.lang.RuntimeException -I at org -I at sun -I at
java -I at junit -I Caused by: -I [.][.][.] [0-9]* more <http://hudson.zones.apache.org/hudson/job/Hive-trunk-h0.17/ws/hive/build/ql/test/logs/clientpositive/udf6.q.out>
<http://hudson.zones.apache.org/hudson/job/Hive-trunk-h0.17/ws/hive/ql/src/test/results/clientpositive/udf6.q.out>
    [junit] Done query: udf6.q
    [junit] Begin query: udf7.q
    [junit] diff -a -I file: -I /tmp/ -I invalidscheme: -I lastUpdateTime -I lastAccessTime
-I owner -I transient_lastDdlTime -I java.lang.RuntimeException -I at org -I at sun -I at
java -I at junit -I Caused by: -I [.][.][.] [0-9]* more <http://hudson.zones.apache.org/hudson/job/Hive-trunk-h0.17/ws/hive/build/ql/test/logs/clientpositive/udf7.q.out>
<http://hudson.zones.apache.org/hudson/job/Hive-trunk-h0.17/ws/hive/ql/src/test/results/clientpositive/udf7.q.out>
    [junit] Done query: udf7.q
    [junit] Begin query: udf8.q
    [junit] diff -a -I file: -I /tmp/ -I invalidscheme: -I lastUpdateTime -I lastAccessTime
-I owner -I transient_lastDdlTime -I java.lang.RuntimeException -I at org -I at sun -I at
java -I at junit -I Caused by: -I [.][.][.] [0-9]* more <http://hudson.zones.apache.org/hudson/job/Hive-trunk-h0.17/ws/hive/build/ql/test/logs/clientpositive/udf8.q.out>
<http://hudson.zones.apache.org/hudson/job/Hive-trunk-h0.17/ws/hive/ql/src/test/results/clientpositive/udf8.q.out>
    [junit] Done query: udf8.q
    [junit] Begin query: udf9.q
    [junit] diff -a -I file: -I /tmp/ -I invalidscheme: -I lastUpdateTime -I lastAccessTime
-I owner -I transient_lastDdlTime -I java.lang.RuntimeException -I at org -I at sun -I at
java -I at junit -I Caused by: -I [.][.][.] [0-9]* more <http://hudson.zones.apache.org/hudson/job/Hive-trunk-h0.17/ws/hive/build/ql/test/logs/clientpositive/udf9.q.out>
<http://hudson.zones.apache.org/hudson/job/Hive-trunk-h0.17/ws/hive/ql/src/test/results/clientpositive/udf9.q.out>
    [junit] Done query: udf9.q
    [junit] Begin query: udf_10_trims.q
    [junit] diff -a -I file: -I /tmp/ -I invalidscheme: -I lastUpdateTime -I lastAccessTime
-I owner -I transient_lastDdlTime -I java.lang.RuntimeException -I at org -I at sun -I at
java -I at junit -I Caused by: -I [.][.][.] [0-9]* more <http://hudson.zones.apache.org/hudson/job/Hive-trunk-h0.17/ws/hive/build/ql/test/logs/clientpositive/udf_10_trims.q.out>
<http://hudson.zones.apache.org/hudson/job/Hive-trunk-h0.17/ws/hive/ql/src/test/results/clientpositive/udf_10_trims.q.out>
    [junit] Done query: udf_10_trims.q
    [junit] Begin query: udf_E.q
    [junit] diff -a -I file: -I /tmp/ -I invalidscheme: -I lastUpdateTime -I lastAccessTime
-I owner -I transient_lastDdlTime -I java.lang.RuntimeException -I at org -I at sun -I at
java -I at junit -I Caused by: -I [.][.][.] [0-9]* more <http://hudson.zones.apache.org/hudson/job/Hive-trunk-h0.17/ws/hive/build/ql/test/logs/clientpositive/udf_E.q.out>
<http://hudson.zones.apache.org/hudson/job/Hive-trunk-h0.17/ws/hive/ql/src/test/results/clientpositive/udf_E.q.out>
    [junit] Done query: udf_E.q
    [junit] Begin query: udf_PI.q
    [junit] diff -a -I file: -I /tmp/ -I invalidscheme: -I lastUpdateTime -I lastAccessTime
-I owner -I transient_lastDdlTime -I java.lang.RuntimeException -I at org -I at sun -I at
java -I at junit -I Caused by: -I [.][.][.] [0-9]* more <http://hudson.zones.apache.org/hudson/job/Hive-trunk-h0.17/ws/hive/build/ql/test/logs/clientpositive/udf_PI.q.out>
<http://hudson.zones.apache.org/hudson/job/Hive-trunk-h0.17/ws/hive/ql/src/test/results/clientpositive/udf_PI.q.out>
    [junit] Done query: udf_PI.q
    [junit] Begin query: udf_abs.q
    [junit] diff -a -I file: -I /tmp/ -I invalidscheme: -I lastUpdateTime -I lastAccessTime
-I owner -I transient_lastDdlTime -I java.lang.RuntimeException -I at org -I at sun -I at
java -I at junit -I Caused by: -I [.][.][.] [0-9]* more <http://hudson.zones.apache.org/hudson/job/Hive-trunk-h0.17/ws/hive/build/ql/test/logs/clientpositive/udf_abs.q.out>
<http://hudson.zones.apache.org/hudson/job/Hive-trunk-h0.17/ws/hive/ql/src/test/results/clientpositive/udf_abs.q.out>
    [junit] Done query: udf_abs.q
    [junit] Begin query: udf_acos.q
    [junit] diff -a -I file: -I /tmp/ -I invalidscheme: -I lastUpdateTime -I lastAccessTime
-I owner -I transient_lastDdlTime -I java.lang.RuntimeException -I at org -I at sun -I at
java -I at junit -I Caused by: -I [.][.][.] [0-9]* more <http://hudson.zones.apache.org/hudson/job/Hive-trunk-h0.17/ws/hive/build/ql/test/logs/clientpositive/udf_acos.q.out>
<http://hudson.zones.apache.org/hudson/job/Hive-trunk-h0.17/ws/hive/ql/src/test/results/clientpositive/udf_acos.q.out>
    [junit] Done query: udf_acos.q
    [junit] Begin query: udf_add.q
    [junit] diff -a -I file: -I /tmp/ -I invalidscheme: -I lastUpdateTime -I lastAccessTime
-I owner -I transient_lastDdlTime -I java.lang.RuntimeException -I at org -I at sun -I at
java -I at junit -I Caused by: -I [.][.][.] [0-9]* more <http://hudson.zones.apache.org/hudson/job/Hive-trunk-h0.17/ws/hive/build/ql/test/logs/clientpositive/udf_add.q.out>
<http://hudson.zones.apache.org/hudson/job/Hive-trunk-h0.17/ws/hive/ql/src/test/results/clientpositive/udf_add.q.out>
    [junit] Done query: udf_add.q
    [junit] Begin query: udf_array.q
    [junit] diff -a -I file: -I /tmp/ -I invalidscheme: -I lastUpdateTime -I lastAccessTime
-I owner -I transient_lastDdlTime -I java.lang.RuntimeException -I at org -I at sun -I at
java -I at junit -I Caused by: -I [.][.][.] [0-9]* more <http://hudson.zones.apache.org/hudson/job/Hive-trunk-h0.17/ws/hive/build/ql/test/logs/clientpositive/udf_array.q.out>
<http://hudson.zones.apache.org/hudson/job/Hive-trunk-h0.17/ws/hive/ql/src/test/results/clientpositive/udf_array.q.out>
    [junit] Done query: udf_array.q
    [junit] Begin query: udf_array_contains.q
    [junit] diff -a -I file: -I /tmp/ -I invalidscheme: -I lastUpdateTime -I lastAccessTime
-I owner -I transient_lastDdlTime -I java.lang.RuntimeException -I at org -I at sun -I at
java -I at junit -I Caused by: -I [.][.][.] [0-9]* more <http://hudson.zones.apache.org/hudson/job/Hive-trunk-h0.17/ws/hive/build/ql/test/logs/clientpositive/udf_array_contains.q.out>
<http://hudson.zones.apache.org/hudson/job/Hive-trunk-h0.17/ws/hive/ql/src/test/results/clientpositive/udf_array_contains.q.out>
    [junit] Done query: udf_array_contains.q
    [junit] Begin query: udf_ascii.q
    [junit] diff -a -I file: -I /tmp/ -I invalidscheme: -I lastUpdateTime -I lastAccessTime
-I owner -I transient_lastDdlTime -I java.lang.RuntimeException -I at org -I at sun -I at
java -I at junit -I Caused by: -I [.][.][.] [0-9]* more <http://hudson.zones.apache.org/hudson/job/Hive-trunk-h0.17/ws/hive/build/ql/test/logs/clientpositive/udf_ascii.q.out>
<http://hudson.zones.apache.org/hudson/job/Hive-trunk-h0.17/ws/hive/ql/src/test/results/clientpositive/udf_ascii.q.out>
    [junit] Done query: udf_ascii.q
    [junit] Begin query: udf_asin.q
    [junit] diff -a -I file: -I /tmp/ -I invalidscheme: -I lastUpdateTime -I lastAccessTime
-I owner -I transient_lastDdlTime -I java.lang.RuntimeException -I at org -I at sun -I at
java -I at junit -I Caused by: -I [.][.][.] [0-9]* more <http://hudson.zones.apache.org/hudson/job/Hive-trunk-h0.17/ws/hive/build/ql/test/logs/clientpositive/udf_asin.q.out>
<http://hudson.zones.apache.org/hudson/job/Hive-trunk-h0.17/ws/hive/ql/src/test/results/clientpositive/udf_asin.q.out>
    [junit] Done query: udf_asin.q
    [junit] Begin query: udf_atan.q
    [junit] diff -a -I file: -I /tmp/ -I invalidscheme: -I lastUpdateTime -I lastAccessTime
-I owner -I transient_lastDdlTime -I java.lang.RuntimeException -I at org -I at sun -I at
java -I at junit -I Caused by: -I [.][.][.] [0-9]* more <http://hudson.zones.apache.org/hudson/job/Hive-trunk-h0.17/ws/hive/build/ql/test/logs/clientpositive/udf_atan.q.out>
<http://hudson.zones.apache.org/hudson/job/Hive-trunk-h0.17/ws/hive/ql/src/test/results/clientpositive/udf_atan.q.out>
    [junit] Done query: udf_atan.q
    [junit] Begin query: udf_avg.q
    [junit] diff -a -I file: -I /tmp/ -I invalidscheme: -I lastUpdateTime -I lastAccessTime
-I owner -I transient_lastDdlTime -I java.lang.RuntimeException -I at org -I at sun -I at
java -I at junit -I Caused by: -I [.][.][.] [0-9]* more <http://hudson.zones.apache.org/hudson/job/Hive-trunk-h0.17/ws/hive/build/ql/test/logs/clientpositive/udf_avg.q.out>
<http://hudson.zones.apache.org/hudson/job/Hive-trunk-h0.17/ws/hive/ql/src/test/results/clientpositive/udf_avg.q.out>
    [junit] Done query: udf_avg.q
    [junit] Begin query: udf_bigint.q
    [junit] diff -a -I file: -I /tmp/ -I invalidscheme: -I lastUpdateTime -I lastAccessTime
-I owner -I transient_lastDdlTime -I java.lang.RuntimeException -I at org -I at sun -I at
java -I at junit -I Caused by: -I [.][.][.] [0-9]* more <http://hudson.zones.apache.org/hudson/job/Hive-trunk-h0.17/ws/hive/build/ql/test/logs/clientpositive/udf_bigint.q.out>
<http://hudson.zones.apache.org/hudson/job/Hive-trunk-h0.17/ws/hive/ql/src/test/results/clientpositive/udf_bigint.q.out>
    [junit] Done query: udf_bigint.q
    [junit] Begin query: udf_bin.q
    [junit] diff -a -I file: -I /tmp/ -I invalidscheme: -I lastUpdateTime -I lastAccessTime
-I owner -I transient_lastDdlTime -I java.lang.RuntimeException -I at org -I at sun -I at
java -I at junit -I Caused by: -I [.][.][.] [0-9]* more <http://hudson.zones.apache.org/hudson/job/Hive-trunk-h0.17/ws/hive/build/ql/test/logs/clientpositive/udf_bin.q.out>
<http://hudson.zones.apache.org/hudson/job/Hive-trunk-h0.17/ws/hive/ql/src/test/results/clientpositive/udf_bin.q.out>
    [junit] Done query: udf_bin.q
    [junit] Begin query: udf_bitwise_and.q
    [junit] diff -a -I file: -I /tmp/ -I invalidscheme: -I lastUpdateTime -I lastAccessTime
-I owner -I transient_lastDdlTime -I java.lang.RuntimeException -I at org -I at sun -I at
java -I at junit -I Caused by: -I [.][.][.] [0-9]* more <http://hudson.zones.apache.org/hudson/job/Hive-trunk-h0.17/ws/hive/build/ql/test/logs/clientpositive/udf_bitwise_and.q.out>
<http://hudson.zones.apache.org/hudson/job/Hive-trunk-h0.17/ws/hive/ql/src/test/results/clientpositive/udf_bitwise_and.q.out>
    [junit] Done query: udf_bitwise_and.q
    [junit] Begin query: udf_bitwise_not.q
    [junit] diff -a -I file: -I /tmp/ -I invalidscheme: -I lastUpdateTime -I lastAccessTime
-I owner -I transient_lastDdlTime -I java.lang.RuntimeException -I at org -I at sun -I at
java -I at junit -I Caused by: -I [.][.][.] [0-9]* more <http://hudson.zones.apache.org/hudson/job/Hive-trunk-h0.17/ws/hive/build/ql/test/logs/clientpositive/udf_bitwise_not.q.out>
<http://hudson.zones.apache.org/hudson/job/Hive-trunk-h0.17/ws/hive/ql/src/test/results/clientpositive/udf_bitwise_not.q.out>
    [junit] Done query: udf_bitwise_not.q
    [junit] Begin query: udf_bitwise_or.q
    [junit] diff -a -I file: -I /tmp/ -I invalidscheme: -I lastUpdateTime -I lastAccessTime
-I owner -I transient_lastDdlTime -I java.lang.RuntimeException -I at org -I at sun -I at
java -I at junit -I Caused by: -I [.][.][.] [0-9]* more <http://hudson.zones.apache.org/hudson/job/Hive-trunk-h0.17/ws/hive/build/ql/test/logs/clientpositive/udf_bitwise_or.q.out>
<http://hudson.zones.apache.org/hudson/job/Hive-trunk-h0.17/ws/hive/ql/src/test/results/clientpositive/udf_bitwise_or.q.out>
    [junit] Done query: udf_bitwise_or.q
    [junit] Begin query: udf_bitwise_xor.q
    [junit] diff -a -I file: -I /tmp/ -I invalidscheme: -I lastUpdateTime -I lastAccessTime
-I owner -I transient_lastDdlTime -I java.lang.RuntimeException -I at org -I at sun -I at
java -I at junit -I Caused by: -I [.][.][.] [0-9]* more <http://hudson.zones.apache.org/hudson/job/Hive-trunk-h0.17/ws/hive/build/ql/test/logs/clientpositive/udf_bitwise_xor.q.out>
<http://hudson.zones.apache.org/hudson/job/Hive-trunk-h0.17/ws/hive/ql/src/test/results/clientpositive/udf_bitwise_xor.q.out>
    [junit] Done query: udf_bitwise_xor.q
    [junit] Begin query: udf_boolean.q
    [junit] diff -a -I file: -I /tmp/ -I invalidscheme: -I lastUpdateTime -I lastAccessTime
-I owner -I transient_lastDdlTime -I java.lang.RuntimeException -I at org -I at sun -I at
java -I at junit -I Caused by: -I [.][.][.] [0-9]* more <http://hudson.zones.apache.org/hudson/job/Hive-trunk-h0.17/ws/hive/build/ql/test/logs/clientpositive/udf_boolean.q.out>
<http://hudson.zones.apache.org/hudson/job/Hive-trunk-h0.17/ws/hive/ql/src/test/results/clientpositive/udf_boolean.q.out>
    [junit] Done query: udf_boolean.q
    [junit] Begin query: udf_case.q
    [junit] diff -a -I file: -I /tmp/ -I invalidscheme: -I lastUpdateTime -I lastAccessTime
-I owner -I transient_lastDdlTime -I java.lang.RuntimeException -I at org -I at sun -I at
java -I at junit -I Caused by: -I [.][.][.] [0-9]* more <http://hudson.zones.apache.org/hudson/job/Hive-trunk-h0.17/ws/hive/build/ql/test/logs/clientpositive/udf_case.q.out>
<http://hudson.zones.apache.org/hudson/job/Hive-trunk-h0.17/ws/hive/ql/src/test/results/clientpositive/udf_case.q.out>
    [junit] Done query: udf_case.q
    [junit] Begin query: udf_case_column_pruning.q
    [junit] diff -a -I file: -I /tmp/ -I invalidscheme: -I lastUpdateTime -I lastAccessTime
-I owner -I transient_lastDdlTime -I java.lang.RuntimeException -I at org -I at sun -I at
java -I at junit -I Caused by: -I [.][.][.] [0-9]* more <http://hudson.zones.apache.org/hudson/job/Hive-trunk-h0.17/ws/hive/build/ql/test/logs/clientpositive/udf_case_column_pruning.q.out>
<http://hudson.zones.apache.org/hudson/job/Hive-trunk-h0.17/ws/hive/ql/src/test/results/clientpositive/udf_case_column_pruning.q.out>
    [junit] Done query: udf_case_column_pruning.q
    [junit] Begin query: udf_case_thrift.q
    [junit] diff -a -I file: -I /tmp/ -I invalidscheme: -I lastUpdateTime -I lastAccessTime
-I owner -I transient_lastDdlTime -I java.lang.RuntimeException -I at org -I at sun -I at
java -I at junit -I Caused by: -I [.][.][.] [0-9]* more <http://hudson.zones.apache.org/hudson/job/Hive-trunk-h0.17/ws/hive/build/ql/test/logs/clientpositive/udf_case_thrift.q.out>
<http://hudson.zones.apache.org/hudson/job/Hive-trunk-h0.17/ws/hive/ql/src/test/results/clientpositive/udf_case_thrift.q.out>
    [junit] Done query: udf_case_thrift.q
    [junit] Begin query: udf_ceil.q
    [junit] diff -a -I file: -I /tmp/ -I invalidscheme: -I lastUpdateTime -I lastAccessTime
-I owner -I transient_lastDdlTime -I java.lang.RuntimeException -I at org -I at sun -I at
java -I at junit -I Caused by: -I [.][.][.] [0-9]* more <http://hudson.zones.apache.org/hudson/job/Hive-trunk-h0.17/ws/hive/build/ql/test/logs/clientpositive/udf_ceil.q.out>
<http://hudson.zones.apache.org/hudson/job/Hive-trunk-h0.17/ws/hive/ql/src/test/results/clientpositive/udf_ceil.q.out>
    [junit] Done query: udf_ceil.q
    [junit] Begin query: udf_ceiling.q
    [junit] diff -a -I file: -I /tmp/ -I invalidscheme: -I lastUpdateTime -I lastAccessTime
-I owner -I transient_lastDdlTime -I java.lang.RuntimeException -I at org -I at sun -I at
java -I at junit -I Caused by: -I [.][.][.] [0-9]* more <http://hudson.zones.apache.org/hudson/job/Hive-trunk-h0.17/ws/hive/build/ql/test/logs/clientpositive/udf_ceiling.q.out>
<http://hudson.zones.apache.org/hudson/job/Hive-trunk-h0.17/ws/hive/ql/src/test/results/clientpositive/udf_ceiling.q.out>
    [junit] Done query: udf_ceiling.q
    [junit] Begin query: udf_coalesce.q
    [junit] diff -a -I file: -I /tmp/ -I invalidscheme: -I lastUpdateTime -I lastAccessTime
-I owner -I transient_lastDdlTime -I java.lang.RuntimeException -I at org -I at sun -I at
java -I at junit -I Caused by: -I [.][.][.] [0-9]* more <http://hudson.zones.apache.org/hudson/job/Hive-trunk-h0.17/ws/hive/build/ql/test/logs/clientpositive/udf_coalesce.q.out>
<http://hudson.zones.apache.org/hudson/job/Hive-trunk-h0.17/ws/hive/ql/src/test/results/clientpositive/udf_coalesce.q.out>
    [junit] Done query: udf_coalesce.q
    [junit] Begin query: udf_concat.q
    [junit] diff -a -I file: -I /tmp/ -I invalidscheme: -I lastUpdateTime -I lastAccessTime
-I owner -I transient_lastDdlTime -I java.lang.RuntimeException -I at org -I at sun -I at
java -I at junit -I Caused by: -I [.][.][.] [0-9]* more <http://hudson.zones.apache.org/hudson/job/Hive-trunk-h0.17/ws/hive/build/ql/test/logs/clientpositive/udf_concat.q.out>
<http://hudson.zones.apache.org/hudson/job/Hive-trunk-h0.17/ws/hive/ql/src/test/results/clientpositive/udf_concat.q.out>
    [junit] Done query: udf_concat.q
    [junit] Begin query: udf_concat_insert1.q
    [junit] diff -a -I file: -I /tmp/ -I invalidscheme: -I lastUpdateTime -I lastAccessTime
-I owner -I transient_lastDdlTime -I java.lang.RuntimeException -I at org -I at sun -I at
java -I at junit -I Caused by: -I [.][.][.] [0-9]* more <http://hudson.zones.apache.org/hudson/job/Hive-trunk-h0.17/ws/hive/build/ql/test/logs/clientpositive/udf_concat_insert1.q.out>
<http://hudson.zones.apache.org/hudson/job/Hive-trunk-h0.17/ws/hive/ql/src/test/results/clientpositive/udf_concat_insert1.q.out>
    [junit] Done query: udf_concat_insert1.q
    [junit] Begin query: udf_concat_insert2.q
    [junit] diff -a -I file: -I /tmp/ -I invalidscheme: -I lastUpdateTime -I lastAccessTime
-I owner -I transient_lastDdlTime -I java.lang.RuntimeException -I at org -I at sun -I at
java -I at junit -I Caused by: -I [.][.][.] [0-9]* more <http://hudson.zones.apache.org/hudson/job/Hive-trunk-h0.17/ws/hive/build/ql/test/logs/clientpositive/udf_concat_insert2.q.out>
<http://hudson.zones.apache.org/hudson/job/Hive-trunk-h0.17/ws/hive/ql/src/test/results/clientpositive/udf_concat_insert2.q.out>
    [junit] Done query: udf_concat_insert2.q
    [junit] Begin query: udf_concat_ws.q
    [junit] diff -a -I file: -I /tmp/ -I invalidscheme: -I lastUpdateTime -I lastAccessTime
-I owner -I transient_lastDdlTime -I java.lang.RuntimeException -I at org -I at sun -I at
java -I at junit -I Caused by: -I [.][.][.] [0-9]* more <http://hudson.zones.apache.org/hudson/job/Hive-trunk-h0.17/ws/hive/build/ql/test/logs/clientpositive/udf_concat_ws.q.out>
<http://hudson.zones.apache.org/hudson/job/Hive-trunk-h0.17/ws/hive/ql/src/test/results/clientpositive/udf_concat_ws.q.out>
    [junit] Done query: udf_concat_ws.q
    [junit] Begin query: udf_conv.q
    [junit] diff -a -I file: -I /tmp/ -I invalidscheme: -I lastUpdateTime -I lastAccessTime
-I owner -I transient_lastDdlTime -I java.lang.RuntimeException -I at org -I at sun -I at
java -I at junit -I Caused by: -I [.][.][.] [0-9]* more <http://hudson.zones.apache.org/hudson/job/Hive-trunk-h0.17/ws/hive/build/ql/test/logs/clientpositive/udf_conv.q.out>
<http://hudson.zones.apache.org/hudson/job/Hive-trunk-h0.17/ws/hive/ql/src/test/results/clientpositive/udf_conv.q.out>
    [junit] Done query: udf_conv.q
    [junit] Begin query: udf_cos.q
    [junit] diff -a -I file: -I /tmp/ -I invalidscheme: -I lastUpdateTime -I lastAccessTime
-I owner -I transient_lastDdlTime -I java.lang.RuntimeException -I at org -I at sun -I at
java -I at junit -I Caused by: -I [.][.][.] [0-9]* more <http://hudson.zones.apache.org/hudson/job/Hive-trunk-h0.17/ws/hive/build/ql/test/logs/clientpositive/udf_cos.q.out>
<http://hudson.zones.apache.org/hudson/job/Hive-trunk-h0.17/ws/hive/ql/src/test/results/clientpositive/udf_cos.q.out>
    [junit] Done query: udf_cos.q
    [junit] Begin query: udf_count.q
    [junit] diff -a -I file: -I /tmp/ -I invalidscheme: -I lastUpdateTime -I lastAccessTime
-I owner -I transient_lastDdlTime -I java.lang.RuntimeException -I at org -I at sun -I at
java -I at junit -I Caused by: -I [.][.][.] [0-9]* more <http://hudson.zones.apache.org/hudson/job/Hive-trunk-h0.17/ws/hive/build/ql/test/logs/clientpositive/udf_count.q.out>
<http://hudson.zones.apache.org/hudson/job/Hive-trunk-h0.17/ws/hive/ql/src/test/results/clientpositive/udf_count.q.out>
    [junit] Done query: udf_count.q
    [junit] Begin query: udf_date_add.q
    [junit] diff -a -I file: -I /tmp/ -I invalidscheme: -I lastUpdateTime -I lastAccessTime
-I owner -I transient_lastDdlTime -I java.lang.RuntimeException -I at org -I at sun -I at
java -I at junit -I Caused by: -I [.][.][.] [0-9]* more <http://hudson.zones.apache.org/hudson/job/Hive-trunk-h0.17/ws/hive/build/ql/test/logs/clientpositive/udf_date_add.q.out>
<http://hudson.zones.apache.org/hudson/job/Hive-trunk-h0.17/ws/hive/ql/src/test/results/clientpositive/udf_date_add.q.out>
    [junit] Done query: udf_date_add.q
    [junit] Begin query: udf_date_sub.q
    [junit] diff -a -I file: -I /tmp/ -I invalidscheme: -I lastUpdateTime -I lastAccessTime
-I owner -I transient_lastDdlTime -I java.lang.RuntimeException -I at org -I at sun -I at
java -I at junit -I Caused by: -I [.][.][.] [0-9]* more <http://hudson.zones.apache.org/hudson/job/Hive-trunk-h0.17/ws/hive/build/ql/test/logs/clientpositive/udf_date_sub.q.out>
<http://hudson.zones.apache.org/hudson/job/Hive-trunk-h0.17/ws/hive/ql/src/test/results/clientpositive/udf_date_sub.q.out>
    [junit] Done query: udf_date_sub.q
    [junit] Begin query: udf_datediff.q
    [junit] diff -a -I file: -I /tmp/ -I invalidscheme: -I lastUpdateTime -I lastAccessTime
-I owner -I transient_lastDdlTime -I java.lang.RuntimeException -I at org -I at sun -I at
java -I at junit -I Caused by: -I [.][.][.] [0-9]* more <http://hudson.zones.apache.org/hudson/job/Hive-trunk-h0.17/ws/hive/build/ql/test/logs/clientpositive/udf_datediff.q.out>
<http://hudson.zones.apache.org/hudson/job/Hive-trunk-h0.17/ws/hive/ql/src/test/results/clientpositive/udf_datediff.q.out>
    [junit] Done query: udf_datediff.q
    [junit] Begin query: udf_day.q
    [junit] diff -a -I file: -I /tmp/ -I invalidscheme: -I lastUpdateTime -I lastAccessTime
-I owner -I transient_lastDdlTime -I java.lang.RuntimeException -I at org -I at sun -I at
java -I at junit -I Caused by: -I [.][.][.] [0-9]* more <http://hudson.zones.apache.org/hudson/job/Hive-trunk-h0.17/ws/hive/build/ql/test/logs/clientpositive/udf_day.q.out>
<http://hudson.zones.apache.org/hudson/job/Hive-trunk-h0.17/ws/hive/ql/src/test/results/clientpositive/udf_day.q.out>
    [junit] Done query: udf_day.q
    [junit] Begin query: udf_dayofmonth.q
    [junit] diff -a -I file: -I /tmp/ -I invalidscheme: -I lastUpdateTime -I lastAccessTime
-I owner -I transient_lastDdlTime -I java.lang.RuntimeException -I at org -I at sun -I at
java -I at junit -I Caused by: -I [.][.][.] [0-9]* more <http://hudson.zones.apache.org/hudson/job/Hive-trunk-h0.17/ws/hive/build/ql/test/logs/clientpositive/udf_dayofmonth.q.out>
<http://hudson.zones.apache.org/hudson/job/Hive-trunk-h0.17/ws/hive/ql/src/test/results/clientpositive/udf_dayofmonth.q.out>
    [junit] Done query: udf_dayofmonth.q
    [junit] Begin query: udf_degrees.q
    [junit] diff -a -I file: -I /tmp/ -I invalidscheme: -I lastUpdateTime -I lastAccessTime
-I owner -I transient_lastDdlTime -I java.lang.RuntimeException -I at org -I at sun -I at
java -I at junit -I Caused by: -I [.][.][.] [0-9]* more <http://hudson.zones.apache.org/hudson/job/Hive-trunk-h0.17/ws/hive/build/ql/test/logs/clientpositive/udf_degrees.q.out>
<http://hudson.zones.apache.org/hudson/job/Hive-trunk-h0.17/ws/hive/ql/src/test/results/clientpositive/udf_degrees.q.out>
    [junit] Done query: udf_degrees.q
    [junit] Begin query: udf_div.q
    [junit] diff -a -I file: -I /tmp/ -I invalidscheme: -I lastUpdateTime -I lastAccessTime
-I owner -I transient_lastDdlTime -I java.lang.RuntimeException -I at org -I at sun -I at
java -I at junit -I Caused by: -I [.][.][.] [0-9]* more <http://hudson.zones.apache.org/hudson/job/Hive-trunk-h0.17/ws/hive/build/ql/test/logs/clientpositive/udf_div.q.out>
<http://hudson.zones.apache.org/hudson/job/Hive-trunk-h0.17/ws/hive/ql/src/test/results/clientpositive/udf_div.q.out>
    [junit] Done query: udf_div.q
    [junit] Begin query: udf_divide.q
    [junit] diff -a -I file: -I /tmp/ -I invalidscheme: -I lastUpdateTime -I lastAccessTime
-I owner -I transient_lastDdlTime -I java.lang.RuntimeException -I at org -I at sun -I at
java -I at junit -I Caused by: -I [.][.][.] [0-9]* more <http://hudson.zones.apache.org/hudson/job/Hive-trunk-h0.17/ws/hive/build/ql/test/logs/clientpositive/udf_divide.q.out>
<http://hudson.zones.apache.org/hudson/job/Hive-trunk-h0.17/ws/hive/ql/src/test/results/clientpositive/udf_divide.q.out>
    [junit] Done query: udf_divide.q
    [junit] Begin query: udf_divider.q
    [junit] diff -a -I file: -I /tmp/ -I invalidscheme: -I lastUpdateTime -I lastAccessTime
-I owner -I transient_lastDdlTime -I java.lang.RuntimeException -I at org -I at sun -I at
java -I at junit -I Caused by: -I [.][.][.] [0-9]* more <http://hudson.zones.apache.org/hudson/job/Hive-trunk-h0.17/ws/hive/build/ql/test/logs/clientpositive/udf_divider.q.out>
<http://hudson.zones.apache.org/hudson/job/Hive-trunk-h0.17/ws/hive/ql/src/test/results/clientpositive/udf_divider.q.out>
    [junit] Done query: udf_divider.q
    [junit] Begin query: udf_double.q
    [junit] diff -a -I file: -I /tmp/ -I invalidscheme: -I lastUpdateTime -I lastAccessTime
-I owner -I transient_lastDdlTime -I java.lang.RuntimeException -I at org -I at sun -I at
java -I at junit -I Caused by: -I [.][.][.] [0-9]* more <http://hudson.zones.apache.org/hudson/job/Hive-trunk-h0.17/ws/hive/build/ql/test/logs/clientpositive/udf_double.q.out>
<http://hudson.zones.apache.org/hudson/job/Hive-trunk-h0.17/ws/hive/ql/src/test/results/clientpositive/udf_double.q.out>
    [junit] Done query: udf_double.q
    [junit] Begin query: udf_elt.q
    [junit] diff -a -I file: -I /tmp/ -I invalidscheme: -I lastUpdateTime -I lastAccessTime
-I owner -I transient_lastDdlTime -I java.lang.RuntimeException -I at org -I at sun -I at
java -I at junit -I Caused by: -I [.][.][.] [0-9]* more <http://hudson.zones.apache.org/hudson/job/Hive-trunk-h0.17/ws/hive/build/ql/test/logs/clientpositive/udf_elt.q.out>
<http://hudson.zones.apache.org/hudson/job/Hive-trunk-h0.17/ws/hive/ql/src/test/results/clientpositive/udf_elt.q.out>
    [junit] Done query: udf_elt.q
    [junit] Begin query: udf_equal.q
    [junit] diff -a -I file: -I /tmp/ -I invalidscheme: -I lastUpdateTime -I lastAccessTime
-I owner -I transient_lastDdlTime -I java.lang.RuntimeException -I at org -I at sun -I at
java -I at junit -I Caused by: -I [.][.][.] [0-9]* more <http://hudson.zones.apache.org/hudson/job/Hive-trunk-h0.17/ws/hive/build/ql/test/logs/clientpositive/udf_equal.q.out>
<http://hudson.zones.apache.org/hudson/job/Hive-trunk-h0.17/ws/hive/ql/src/test/results/clientpositive/udf_equal.q.out>
    [junit] Done query: udf_equal.q
    [junit] Begin query: udf_exp.q
    [junit] diff -a -I file: -I /tmp/ -I invalidscheme: -I lastUpdateTime -I lastAccessTime
-I owner -I transient_lastDdlTime -I java.lang.RuntimeException -I at org -I at sun -I at
java -I at junit -I Caused by: -I [.][.][.] [0-9]* more <http://hudson.zones.apache.org/hudson/job/Hive-trunk-h0.17/ws/hive/build/ql/test/logs/clientpositive/udf_exp.q.out>
<http://hudson.zones.apache.org/hudson/job/Hive-trunk-h0.17/ws/hive/ql/src/test/results/clientpositive/udf_exp.q.out>
    [junit] Done query: udf_exp.q
    [junit] Begin query: udf_explode.q
    [junit] diff -a -I file: -I /tmp/ -I invalidscheme: -I lastUpdateTime -I lastAccessTime
-I owner -I transient_lastDdlTime -I java.lang.RuntimeException -I at org -I at sun -I at
java -I at junit -I Caused by: -I [.][.][.] [0-9]* more <http://hudson.zones.apache.org/hudson/job/Hive-trunk-h0.17/ws/hive/build/ql/test/logs/clientpositive/udf_explode.q.out>
<http://hudson.zones.apache.org/hudson/job/Hive-trunk-h0.17/ws/hive/ql/src/test/results/clientpositive/udf_explode.q.out>
    [junit] Done query: udf_explode.q
    [junit] Begin query: udf_field.q
    [junit] diff -a -I file: -I /tmp/ -I invalidscheme: -I lastUpdateTime -I lastAccessTime
-I owner -I transient_lastDdlTime -I java.lang.RuntimeException -I at org -I at sun -I at
java -I at junit -I Caused by: -I [.][.][.] [0-9]* more <http://hudson.zones.apache.org/hudson/job/Hive-trunk-h0.17/ws/hive/build/ql/test/logs/clientpositive/udf_field.q.out>
<http://hudson.zones.apache.org/hudson/job/Hive-trunk-h0.17/ws/hive/ql/src/test/results/clientpositive/udf_field.q.out>
    [junit] Done query: udf_field.q
    [junit] Begin query: udf_find_in_set.q
FATAL: command execution failed.
hudson.util.IOException2: Failed to join the process
	at hudson.Proc$RemoteProc.join(Proc.java:312)
	at hudson.Launcher$ProcStarter.join(Launcher.java:275)
	at hudson.tasks.Ant.perform(Ant.java:212)
	at hudson.tasks.BuildStepMonitor$1.perform(BuildStepMonitor.java:19)
	at hudson.model.AbstractBuild$AbstractRunner.perform(AbstractBuild.java:582)
	at hudson.model.Build$RunnerImpl.build(Build.java:165)
	at hudson.model.Build$RunnerImpl.doRun(Build.java:132)
	at hudson.model.AbstractBuild$AbstractRunner.run(AbstractBuild.java:416)
	at hudson.model.Run.run(Run.java:1243)
	at hudson.model.FreeStyleBuild.run(FreeStyleBuild.java:46)
	at hudson.model.ResourceController.execute(ResourceController.java:88)
	at hudson.model.Executor.run(Executor.java:122)
Caused by: java.util.concurrent.ExecutionException: hudson.remoting.RequestAbortedException:
java.io.EOFException
	at hudson.remoting.Request$1.get(Request.java:218)
	at hudson.remoting.Request$1.get(Request.java:172)
	at hudson.remoting.FutureAdapter.get(FutureAdapter.java:55)
	at hudson.Proc$RemoteProc.join(Proc.java:304)
	... 11 more
Caused by: hudson.remoting.RequestAbortedException: java.io.EOFException
	at hudson.remoting.Request.abort(Request.java:257)
	at hudson.remoting.Channel.terminate(Channel.java:598)
	at hudson.remoting.Channel$ReaderThread.run(Channel.java:876)
Caused by: java.io.EOFException
	at java.io.ObjectInputStream$BlockDataInputStream.peekByte(ObjectInputStream.java:2554)
	at java.io.ObjectInputStream.readObject0(ObjectInputStream.java:1297)
	at java.io.ObjectInputStream.readObject(ObjectInputStream.java:351)
	at hudson.remoting.Channel$ReaderThread.run(Channel.java:856)
FATAL: channel is already closed
hudson.remoting.ChannelClosedException: channel is already closed
	at hudson.remoting.Channel.send(Channel.java:412)
	at hudson.remoting.Request.call(Request.java:105)
	at hudson.remoting.Channel.call(Channel.java:551)
	at hudson.Launcher$RemoteLauncher.kill(Launcher.java:735)
	at hudson.model.AbstractBuild$AbstractRunner.run(AbstractBuild.java:421)
	at hudson.model.Run.run(Run.java:1243)
	at hudson.model.FreeStyleBuild.run(FreeStyleBuild.java:46)
	at hudson.model.ResourceController.execute(ResourceController.java:88)
	at hudson.model.Executor.run(Executor.java:122)


Mime
View raw message