hadoop-hive-dev mailing list archives

Site index · List index
Message view « Date » · « Thread »
Top « Date » · « Thread »
From Apache Hudson Server <hud...@hudson.zones.apache.org>
Subject Build failed in Hudson: Hive-trunk-h0.19 #340
Date Mon, 18 Jan 2010 16:24:17 GMT
See <http://hudson.zones.apache.org/hudson/job/Hive-trunk-h0.19/340/>

------------------------------------------
[...truncated 13337 lines...]
    [junit] >                       input format: org.apache.hadoop.mapred.TextInputFormat
    [junit] >                       output format: org.apache.hadoop.hive.ql.io.HiveIgnoreKeyTextOutputFormat
    [junit] >                       serde: org.apache.hadoop.hive.serde2.lazy.LazySimpleSerDe
    [junit] >                       name: dest1
    [junit] 96,121d116
    [junit] <   Stage: Stage-2
    [junit] <     Map Reduce
    [junit] <       Alias -> Map Operator Tree:
    [junit] <         <http://hudson.zones.apache.org/hudson/job/Hive-trunk-h0.19/ws/hive/build/contrib/scratchdir/1750387303/10002>

    [junit] <             Reduce Output Operator
    [junit] <               sort order: 
    [junit] <               Map-reduce partition columns:
    [junit] <                     expr: rand()
    [junit] <                     type: double
    [junit] <               tag: -1
    [junit] <               value expressions:
    [junit] <                     expr: key
    [junit] <                     type: smallint
    [junit] <                     expr: value
    [junit] <                     type: string
    [junit] <       Reduce Operator Tree:
    [junit] <         Extract
    [junit] <           File Output Operator
    [junit] <             compressed: false
    [junit] <             GlobalTableId: 0
    [junit] <             table:
    [junit] <                 input format: org.apache.hadoop.mapred.TextInputFormat
    [junit] <                 output format: org.apache.hadoop.hive.ql.io.HiveIgnoreKeyTextOutputFormat
    [junit] <                 serde: org.apache.hadoop.hive.serde2.lazy.LazySimpleSerDe
    [junit] <                 name: dest1
    [junit] < 
    [junit] Exception: Client execution results failed with error code = 1
    [junit] junit.framework.AssertionFailedError: Client execution results failed with error
code = 1
    [junit] 	at junit.framework.Assert.fail(Assert.java:47)
    [junit] 	at org.apache.hadoop.hive.cli.TestContribCliDriver.testCliDriver_serde_typedbytes2(TestContribCliDriver.java:406)
    [junit] 	at sun.reflect.NativeMethodAccessorImpl.invoke0(Native Method)
    [junit] 	at sun.reflect.NativeMethodAccessorImpl.invoke(NativeMethodAccessorImpl.java:39)
    [junit] 	at sun.reflect.DelegatingMethodAccessorImpl.invoke(DelegatingMethodAccessorImpl.java:25)
    [junit] 	at java.lang.reflect.Method.invoke(Method.java:597)
    [junit] 	at junit.framework.TestCase.runTest(TestCase.java:154)
    [junit] 	at junit.framework.TestCase.runBare(TestCase.java:127)
    [junit] 	at junit.framework.TestResult$1.protect(TestResult.java:106)
    [junit] 	at junit.framework.TestResult.runProtected(TestResult.java:124)
    [junit] 	at junit.framework.TestResult.run(TestResult.java:109)
    [junit] 	at junit.framework.TestCase.run(TestCase.java:118)
    [junit] 	at junit.framework.TestSuite.runTest(TestSuite.java:208)
    [junit] 	at junit.framework.TestSuite.run(TestSuite.java:203)
    [junit] 	at org.apache.tools.ant.taskdefs.optional.junit.JUnitTestRunner.run(JUnitTestRunner.java:420)
    [junit] 	at org.apache.tools.ant.taskdefs.optional.junit.JUnitTestRunner.launch(JUnitTestRunner.java:911)
    [junit] 	at org.apache.tools.ant.taskdefs.optional.junit.JUnitTestRunner.main(JUnitTestRunner.java:768)
    [junit] Begin query: serde_typedbytes3.q
    [junit] plan = <http://hudson.zones.apache.org/hudson/job/Hive-trunk-h0.19/ws/hive/build/contrib/scratchdir/plan3085783763665963548.xml>
    [junit] diff -a -I file: -I /tmp/ -I invalidscheme: -I lastUpdateTime -I lastAccessTime
-I owner -I transient_lastDdlTime <http://hudson.zones.apache.org/hudson/job/Hive-trunk-h0.19/ws/hive/build/contrib/test/logs/contribclientpositive/serde_typedbytes3.q.out>
<http://hudson.zones.apache.org/hudson/job/Hive-trunk-h0.19/ws/hive/contrib/src/test/results/clientpositive/serde_typedbytes3.q.out>
    [junit] Exception: Client execution results failed with error code = 1
    [junit] junit.framework.AssertionFailedError: Client execution results failed with error
code = 1
    [junit] 37,40c37,38
    [junit] 	at junit.framework.Assert.fail(Assert.java:47)
    [junit] <   Stage-4 depends on stages: Stage-1 , consists of Stage-3, Stage-2
    [junit] 	at org.apache.hadoop.hive.cli.TestContribCliDriver.testCliDriver_serde_typedbytes3(TestContribCliDriver.java:446)
    [junit] <   Stage-3
    [junit] 	at sun.reflect.NativeMethodAccessorImpl.invoke0(Native Method)
    [junit] 	at sun.reflect.NativeMethodAccessorImpl.invoke(NativeMethodAccessorImpl.java:39)
    [junit] <   Stage-0 depends on stages: Stage-3, Stage-2
    [junit] 	at sun.reflect.DelegatingMethodAccessorImpl.invoke(DelegatingMethodAccessorImpl.java:25)
    [junit] 	at java.lang.reflect.Method.invoke(Method.java:597)
    [junit] <   Stage-2
    [junit] 	at junit.framework.TestCase.runTest(TestCase.java:154)
    [junit] 	at junit.framework.TestCase.runBare(TestCase.java:127)
    [junit] 	at junit.framework.TestResult$1.protect(TestResult.java:106)
    [junit] ---
    [junit] >   Stage-4 depends on stages: Stage-1
    [junit] >   Stage-0 depends on stages: Stage-4
    [junit] 79,84c77,105
    [junit] 	at junit.framework.TestResult.runProtected(TestResult.java:124)
    [junit] 	at junit.framework.TestResult.run(TestResult.java:109)
    [junit] 	at junit.framework.TestCase.run(TestCase.java:118)
    [junit] 	at junit.framework.TestSuite.runTest(TestSuite.java:208)
    [junit] 	at junit.framework.TestSuite.run(TestSuite.java:203)
    [junit] < 
    [junit] <   Stage: Stage-3
    [junit] <     Move Operator
    [junit] <       files:
    [junit] <           hdfs directory: true
    [junit] 	at org.apache.tools.ant.taskdefs.optional.junit.JUnitTestRunner.run(JUnitTestRunner.java:420)
    [junit] <           destination: <http://hudson.zones.apache.org/hudson/job/Hive-trunk-h0.19/ws/hive/build/contrib/scratchdir/2126283866/10000>
    [junit] 	at org.apache.tools.ant.taskdefs.optional.junit.JUnitTestRunner.launch(JUnitTestRunner.java:911)
    [junit] 	at org.apache.tools.ant.taskdefs.optional.junit.JUnitTestRunner.main(JUnitTestRunner.java:768)
    [junit] ---
    [junit] >       list of dependent Tasks:
    [junit] >           Move Operator
    [junit] >             files:
    [junit] >                 hdfs directory: true
    [junit] >                 destination: file:/data/users/njain/hive1/hive1/build/ql/tmp/1224635/10000
    [junit] >           Map Reduce
    [junit] >             Alias -> Map Operator Tree:
    [junit] >               file:/data/users/njain/hive1/hive1/build/ql/tmp/4847210/10002

    [junit] >                   Reduce Output Operator
    [junit] >                     sort order: 
    [junit] >                     Map-reduce partition columns:
    [junit] >                           expr: rand()
    [junit] >                           type: double
    [junit] >                     tag: -1
    [junit] >                     value expressions:
    [junit] >                           expr: key
    [junit] >                           type: string
    [junit] >                           expr: value
    [junit] >                           type: string
    [junit] >             Reduce Operator Tree:
    [junit] >               Extract
    [junit] >                 File Output Operator
    [junit] >                   compressed: false
    [junit] >                   GlobalTableId: 0
    [junit] >                   table:
    [junit] >                       input format: org.apache.hadoop.mapred.TextInputFormat
    [junit] >                       output format: org.apache.hadoop.hive.ql.io.HiveIgnoreKeyTextOutputFormat
    [junit] >                       serde: org.apache.hadoop.hive.serde2.lazy.LazySimpleSerDe
    [junit] >                       name: dest1
    [junit] 96,121d116
    [junit] <   Stage: Stage-2
    [junit] <     Map Reduce
    [junit] <       Alias -> Map Operator Tree:
    [junit] <         <http://hudson.zones.apache.org/hudson/job/Hive-trunk-h0.19/ws/hive/build/contrib/scratchdir/974976497/10002>

    [junit] <             Reduce Output Operator
    [junit] <               sort order: 
    [junit] <               Map-reduce partition columns:
    [junit] <                     expr: rand()
    [junit] <                     type: double
    [junit] <               tag: -1
    [junit] <               value expressions:
    [junit] <                     expr: key
    [junit] <                     type: string
    [junit] <                     expr: value
    [junit] <                     type: string
    [junit] <       Reduce Operator Tree:
    [junit] <         Extract
    [junit] <           File Output Operator
    [junit] <             compressed: false
    [junit] <             GlobalTableId: 0
    [junit] <             table:
    [junit] <                 input format: org.apache.hadoop.mapred.TextInputFormat
    [junit] <                 output format: org.apache.hadoop.hive.ql.io.HiveIgnoreKeyTextOutputFormat
    [junit] <                 serde: org.apache.hadoop.hive.serde2.lazy.LazySimpleSerDe
    [junit] <                 name: dest1
    [junit] < 
    [junit] Begin query: serde_typedbytes4.q
    [junit] plan = <http://hudson.zones.apache.org/hudson/job/Hive-trunk-h0.19/ws/hive/build/contrib/scratchdir/plan6231897181722683027.xml>
    [junit] diff -a -I file: -I /tmp/ -I invalidscheme: -I lastUpdateTime -I lastAccessTime
-I owner -I transient_lastDdlTime <http://hudson.zones.apache.org/hudson/job/Hive-trunk-h0.19/ws/hive/build/contrib/test/logs/contribclientpositive/serde_typedbytes4.q.out>
<http://hudson.zones.apache.org/hudson/job/Hive-trunk-h0.19/ws/hive/contrib/src/test/results/clientpositive/serde_typedbytes4.q.out>
    [junit] Done query: serde_typedbytes4.q
    [junit] Begin query: udaf_example_avg.q
    [junit] plan = <http://hudson.zones.apache.org/hudson/job/Hive-trunk-h0.19/ws/hive/build/contrib/scratchdir/plan3314384793979885084.xml>
    [junit] diff -a -I file: -I /tmp/ -I invalidscheme: -I lastUpdateTime -I lastAccessTime
-I owner -I transient_lastDdlTime <http://hudson.zones.apache.org/hudson/job/Hive-trunk-h0.19/ws/hive/build/contrib/test/logs/contribclientpositive/udaf_example_avg.q.out>
<http://hudson.zones.apache.org/hudson/job/Hive-trunk-h0.19/ws/hive/contrib/src/test/results/clientpositive/udaf_example_avg.q.out>
    [junit] Done query: udaf_example_avg.q
    [junit] Begin query: udaf_example_group_concat.q
    [junit] plan = <http://hudson.zones.apache.org/hudson/job/Hive-trunk-h0.19/ws/hive/build/contrib/scratchdir/plan8018322067579200009.xml>
    [junit] diff -a -I file: -I /tmp/ -I invalidscheme: -I lastUpdateTime -I lastAccessTime
-I owner -I transient_lastDdlTime <http://hudson.zones.apache.org/hudson/job/Hive-trunk-h0.19/ws/hive/build/contrib/test/logs/contribclientpositive/udaf_example_group_concat.q.out>
<http://hudson.zones.apache.org/hudson/job/Hive-trunk-h0.19/ws/hive/contrib/src/test/results/clientpositive/udaf_example_group_concat.q.out>
    [junit] Done query: udaf_example_group_concat.q
    [junit] Begin query: udf_example_add.q
    [junit] plan = <http://hudson.zones.apache.org/hudson/job/Hive-trunk-h0.19/ws/hive/build/contrib/scratchdir/plan3927825618451578607.xml>
    [junit] diff -a -I file: -I /tmp/ -I invalidscheme: -I lastUpdateTime -I lastAccessTime
-I owner -I transient_lastDdlTime <http://hudson.zones.apache.org/hudson/job/Hive-trunk-h0.19/ws/hive/build/contrib/test/logs/contribclientpositive/udf_example_add.q.out>
<http://hudson.zones.apache.org/hudson/job/Hive-trunk-h0.19/ws/hive/contrib/src/test/results/clientpositive/udf_example_add.q.out>
    [junit] Done query: udf_example_add.q
    [junit] Begin query: udf_example_arraymapstruct.q
    [junit] plan = <http://hudson.zones.apache.org/hudson/job/Hive-trunk-h0.19/ws/hive/build/contrib/scratchdir/plan8470893326774084391.xml>
    [junit] diff -a -I file: -I /tmp/ -I invalidscheme: -I lastUpdateTime -I lastAccessTime
-I owner -I transient_lastDdlTime <http://hudson.zones.apache.org/hudson/job/Hive-trunk-h0.19/ws/hive/build/contrib/test/logs/contribclientpositive/udf_example_arraymapstruct.q.out>
<http://hudson.zones.apache.org/hudson/job/Hive-trunk-h0.19/ws/hive/contrib/src/test/results/clientpositive/udf_example_arraymapstruct.q.out>
    [junit] Done query: udf_example_arraymapstruct.q
    [junit] Begin query: udf_example_format.q
    [junit] plan = <http://hudson.zones.apache.org/hudson/job/Hive-trunk-h0.19/ws/hive/build/contrib/scratchdir/plan1343449519346351603.xml>
    [junit] diff -a -I file: -I /tmp/ -I invalidscheme: -I lastUpdateTime -I lastAccessTime
-I owner -I transient_lastDdlTime <http://hudson.zones.apache.org/hudson/job/Hive-trunk-h0.19/ws/hive/build/contrib/test/logs/contribclientpositive/udf_example_format.q.out>
<http://hudson.zones.apache.org/hudson/job/Hive-trunk-h0.19/ws/hive/contrib/src/test/results/clientpositive/udf_example_format.q.out>
    [junit] Done query: udf_example_format.q
    [junit] Begin query: udtf_explode2.q
    [junit] plan = <http://hudson.zones.apache.org/hudson/job/Hive-trunk-h0.19/ws/hive/build/contrib/scratchdir/plan3400608640040048167.xml>
    [junit] diff -a -I file: -I /tmp/ -I invalidscheme: -I lastUpdateTime -I lastAccessTime
-I owner -I transient_lastDdlTime <http://hudson.zones.apache.org/hudson/job/Hive-trunk-h0.19/ws/hive/build/contrib/test/logs/contribclientpositive/udtf_explode2.q.out>
<http://hudson.zones.apache.org/hudson/job/Hive-trunk-h0.19/ws/hive/contrib/src/test/results/clientpositive/udtf_explode2.q.out>
    [junit] Done query: udtf_explode2.q
    [junit] Tests run: 16, Failures: 3, Errors: 0, Time elapsed: 79.408 sec
    [junit] Test org.apache.hadoop.hive.cli.TestContribCliDriver FAILED
    [junit] Running org.apache.hadoop.hive.cli.TestContribNegativeCliDriver
    [junit] Begin query: serde_regex.q
    [junit] Loading data to table srcpart partition {ds=2008-04-08, hr=11}
    [junit] POSTHOOK: Output: default@srcpart@ds=2008-04-08/hr=11
    [junit] OK
    [junit] Loading data to table srcpart partition {ds=2008-04-08, hr=12}
    [junit] POSTHOOK: Output: default@srcpart@ds=2008-04-08/hr=12
    [junit] OK
    [junit] Loading data to table srcpart partition {ds=2008-04-09, hr=11}
    [junit] POSTHOOK: Output: default@srcpart@ds=2008-04-09/hr=11
    [junit] OK
    [junit] Loading data to table srcpart partition {ds=2008-04-09, hr=12}
    [junit] POSTHOOK: Output: default@srcpart@ds=2008-04-09/hr=12
    [junit] OK
    [junit] POSTHOOK: Output: default@srcbucket
    [junit] OK
    [junit] Loading data to table srcbucket
    [junit] POSTHOOK: Output: default@srcbucket
    [junit] OK
    [junit] Loading data to table srcbucket
    [junit] POSTHOOK: Output: default@srcbucket
    [junit] OK
    [junit] POSTHOOK: Output: default@srcbucket2
    [junit] OK
    [junit] Loading data to table srcbucket2
    [junit] POSTHOOK: Output: default@srcbucket2
    [junit] OK
    [junit] Loading data to table srcbucket2
    [junit] POSTHOOK: Output: default@srcbucket2
    [junit] OK
    [junit] Loading data to table srcbucket2
    [junit] POSTHOOK: Output: default@srcbucket2
    [junit] OK
    [junit] Loading data to table srcbucket2
    [junit] POSTHOOK: Output: default@srcbucket2
    [junit] OK
    [junit] Loading data to table src
    [junit] POSTHOOK: Output: default@src
    [junit] OK
    [junit] Loading data to table src1
    [junit] POSTHOOK: Output: default@src1
    [junit] OK
    [junit] Loading data to table src_sequencefile
    [junit] POSTHOOK: Output: default@src_sequencefile
    [junit] OK
    [junit] Loading data to table src_thrift
    [junit] POSTHOOK: Output: default@src_thrift
    [junit] OK
    [junit] Loading data to table src_json
    [junit] POSTHOOK: Output: default@src_json
    [junit] OK
    [junit] Found class for org.apache.hadoop.hive.contrib.serde2.RegexSerDe
    [junit] diff -a -I file: -I /tmp/ -I invalidscheme: -I lastUpdateTime -I lastAccessTime
-I owner -I transient_lastDdlTime <http://hudson.zones.apache.org/hudson/job/Hive-trunk-h0.19/ws/hive/build/contrib/test/logs/contribclientnegative/serde_regex.q.out>
<http://hudson.zones.apache.org/hudson/job/Hive-trunk-h0.19/ws/hive/contrib/src/test/results/clientnegative/serde_regex.q.out>
    [junit] Done query: serde_regex.q
    [junit] Begin query: udtf_explode2.q
    [junit] diff -a -I file: -I /tmp/ -I invalidscheme: -I lastUpdateTime -I lastAccessTime
-I owner -I transient_lastDdlTime <http://hudson.zones.apache.org/hudson/job/Hive-trunk-h0.19/ws/hive/build/contrib/test/logs/contribclientnegative/udtf_explode2.q.out>
<http://hudson.zones.apache.org/hudson/job/Hive-trunk-h0.19/ws/hive/contrib/src/test/results/clientnegative/udtf_explode2.q.out>
    [junit] Done query: udtf_explode2.q
    [junit] Tests run: 2, Failures: 0, Errors: 0, Time elapsed: 8.75 sec
    [junit] Running org.apache.hadoop.hive.contrib.mr.TestGenericMR
    [junit] Tests run: 6, Failures: 0, Errors: 0, Time elapsed: 0.072 sec
    [junit] Running org.apache.hadoop.hive.contrib.serde2.TestRegexSerDe
    [junit] Deserialized row: [127.0.0.1, -, -, [26/May/2009:00:00:00 +0000], "GET /someurl/?track=Blabla(Main)
HTTP/1.1", 200, 5864, -, "Mozilla/5.0 (Windows; U; Windows NT 6.0; en-US) AppleWebKit/525.19
(KHTML, like Gecko) Chrome/1.0.154.65 Safari/525.19"]
    [junit] Tests run: 1, Failures: 0, Errors: 0, Time elapsed: 0.224 sec
    [junit] Running org.apache.hadoop.hive.ql.parse.TestContribParse
    [junit] Tests run: 0, Failures: 0, Errors: 0, Time elapsed: 0.04 sec
    [junit] Running org.apache.hadoop.hive.ql.parse.TestContribParseNegative
    [junit] Tests run: 0, Failures: 0, Errors: 0, Time elapsed: 0.041 sec

BUILD FAILED
<http://hudson.zones.apache.org/hudson/job/Hive-trunk-h0.19/ws/hive/build.xml>:151:
The following error occurred while executing this line:
<http://hudson.zones.apache.org/hudson/job/Hive-trunk-h0.19/ws/hive/build.xml>:91: The
following error occurred while executing this line:
<http://hudson.zones.apache.org/hudson/job/Hive-trunk-h0.19/ws/hive/build-common.xml>:327:
Tests failed!

Total time: 67 minutes 20 seconds
Recording test results


Mime
View raw message