hadoop-hive-dev mailing list archives

Site index · List index
Message view « Date » · « Thread »
Top « Date » · « Thread »
From Apache Hudson Server <hud...@hudson.zones.apache.org>
Subject Build failed in Hudson: Hive-trunk-h0.17 #192
Date Tue, 25 Aug 2009 16:25:45 GMT
See http://hudson.zones.apache.org/hudson/job/Hive-trunk-h0.17/192/changes

Changes:

[zshao] HIVE-708. Add TypedBytes SerDe for transform. (Namit Jain via zshao)

[zshao] Moving HIVE-764 to section 0.4.

------------------------------------------
[...truncated 7599 lines...]
    [junit] Loading data to table src1
    [junit] OK
    [junit] Loading data to table src_sequencefile
    [junit] OK
    [junit] Loading data to table src_thrift
    [junit] OK
    [junit] Loading data to table src_json
    [junit] OK
    [junit] diff http://hudson.zones.apache.org/hudson/job/Hive-trunk-h0.17/ws/hive/build/ql/test/logs/negative/wrong_distinct1.q.out
 http://hudson.zones.apache.org/hudson/job/Hive-trunk-h0.17/ws/hive/ql/src/test/results/compiler/errors/wrong_distinct1.q.out

    [junit] Done query: wrong_distinct1.q
    [junit] Begin query: wrong_distinct2.q
    [junit] Loading data to table srcpart partition {ds=2008-04-08, hr=11}
    [junit] OK
    [junit] Loading data to table srcpart partition {ds=2008-04-08, hr=12}
    [junit] OK
    [junit] Loading data to table srcpart partition {ds=2008-04-09, hr=11}
    [junit] OK
    [junit] Loading data to table srcpart partition {ds=2008-04-09, hr=12}
    [junit] OK
    [junit] OK
    [junit] Loading data to table srcbucket
    [junit] OK
    [junit] Loading data to table srcbucket
    [junit] OK
    [junit] Loading data to table src
    [junit] OK
    [junit] Loading data to table src1
    [junit] OK
    [junit] Loading data to table src_sequencefile
    [junit] OK
    [junit] Loading data to table src_thrift
    [junit] OK
    [junit] Loading data to table src_json
    [junit] OK
    [junit] diff http://hudson.zones.apache.org/hudson/job/Hive-trunk-h0.17/ws/hive/build/ql/test/logs/negative/wrong_distinct2.q.out
 http://hudson.zones.apache.org/hudson/job/Hive-trunk-h0.17/ws/hive/ql/src/test/results/compiler/errors/wrong_distinct2.q.out

    [junit] Done query: wrong_distinct2.q
    [junit] Tests run: 33, Failures: 0, Errors: 0, Time elapsed: 31.554 sec
    [junit] Running org.apache.hadoop.hive.ql.tool.TestLineageInfo
    [junit] Tests run: 5, Failures: 0, Errors: 0, Time elapsed: 0.275 sec

test:
     [echo] Nothing to do!

test-conditions:

compile-ant-tasks:

create-dirs:

init:

compile:
     [echo] Compiling: anttasks

deploy-ant-tasks:

create-dirs:

init:

compile:
     [echo] Compiling: anttasks

jar:

test-init:
    [mkdir] Created dir: http://hudson.zones.apache.org/hudson/job/Hive-trunk-h0.17/ws/hive/build/contrib/test/data

    [mkdir] Created dir: http://hudson.zones.apache.org/hudson/job/Hive-trunk-h0.17/ws/hive/build/contrib/test/logs/clientpositive

    [mkdir] Created dir: http://hudson.zones.apache.org/hudson/job/Hive-trunk-h0.17/ws/hive/build/contrib/test/logs/clientnegative

    [mkdir] Created dir: http://hudson.zones.apache.org/hudson/job/Hive-trunk-h0.17/ws/hive/build/contrib/test/logs/positive

    [mkdir] Created dir: http://hudson.zones.apache.org/hudson/job/Hive-trunk-h0.17/ws/hive/build/contrib/test/logs/negative

     [copy] Copying 38 files to http://hudson.zones.apache.org/hudson/job/Hive-trunk-h0.17/ws/hive/build/contrib/test/data

     [copy] Copied 6 empty directories to 2 empty directories under http://hudson.zones.apache.org/hudson/job/Hive-trunk-h0.17/ws/hive/build/contrib/test/data


gen-test:
    [mkdir] Created dir: http://hudson.zones.apache.org/hudson/job/Hive-trunk-h0.17/ws/hive/build/contrib/test/src/org/apache/hadoop/hive/ql/parse

    [mkdir] Created dir: http://hudson.zones.apache.org/hudson/job/Hive-trunk-h0.17/ws/hive/build/contrib/test/src/org/apache/hadoop/hive/cli

    [mkdir] Created dir: http://hudson.zones.apache.org/hudson/job/Hive-trunk-h0.17/ws/hive/build/contrib/test/logs/contribpositive

    [mkdir] Created dir: http://hudson.zones.apache.org/hudson/job/Hive-trunk-h0.17/ws/hive/build/contrib/test/logs/contribnegative

    [mkdir] Created dir: http://hudson.zones.apache.org/hudson/job/Hive-trunk-h0.17/ws/hive/build/contrib/test/logs/contribclientpositive

    [mkdir] Created dir: http://hudson.zones.apache.org/hudson/job/Hive-trunk-h0.17/ws/hive/build/contrib/test/logs/contribclientnegative

 [qtestgen] Template Path:http://hudson.zones.apache.org/hudson/job/Hive-trunk-h0.17/ws/hive/ql/src/test/templates

 [qtestgen] Aug 25, 2009 2:55:18 PM org.apache.velocity.runtime.log.JdkLogChute log
 [qtestgen] INFO: FileResourceLoader : adding path 'http://hudson.zones.apache.org/hudson/job/Hive-trunk-h0.17/ws/hive/ql/src/test/templates'

 [qtestgen] Generated http://hudson.zones.apache.org/hudson/job/Hive-trunk-h0.17/ws/hive/build/contrib/test/src/org/apache/hadoop/hive/ql/parse/TestContribParse.java
 from template TestParse.vm
 [qtestgen] Template Path:http://hudson.zones.apache.org/hudson/job/Hive-trunk-h0.17/ws/hive/ql/src/test/templates

 [qtestgen] Aug 25, 2009 2:55:18 PM org.apache.velocity.runtime.log.JdkLogChute log
 [qtestgen] INFO: FileResourceLoader : adding path 'http://hudson.zones.apache.org/hudson/job/Hive-trunk-h0.17/ws/hive/ql/src/test/templates'

 [qtestgen] Generated http://hudson.zones.apache.org/hudson/job/Hive-trunk-h0.17/ws/hive/build/contrib/test/src/org/apache/hadoop/hive/ql/parse/TestContribParseNegative.java
 from template TestParseNegative.vm
 [qtestgen] Template Path:http://hudson.zones.apache.org/hudson/job/Hive-trunk-h0.17/ws/hive/ql/src/test/templates

 [qtestgen] Aug 25, 2009 2:55:18 PM org.apache.velocity.runtime.log.JdkLogChute log
 [qtestgen] INFO: FileResourceLoader : adding path 'http://hudson.zones.apache.org/hudson/job/Hive-trunk-h0.17/ws/hive/ql/src/test/templates'

 [qtestgen] Generated http://hudson.zones.apache.org/hudson/job/Hive-trunk-h0.17/ws/hive/build/contrib/test/src/org/apache/hadoop/hive/cli/TestContribCliDriver.java
 from template TestCliDriver.vm
 [qtestgen] Template Path:http://hudson.zones.apache.org/hudson/job/Hive-trunk-h0.17/ws/hive/ql/src/test/templates

 [qtestgen] Aug 25, 2009 2:55:18 PM org.apache.velocity.runtime.log.JdkLogChute log
 [qtestgen] INFO: FileResourceLoader : adding path 'http://hudson.zones.apache.org/hudson/job/Hive-trunk-h0.17/ws/hive/ql/src/test/templates'

 [qtestgen] Generated http://hudson.zones.apache.org/hudson/job/Hive-trunk-h0.17/ws/hive/build/contrib/test/src/org/apache/hadoop/hive/cli/TestContribNegativeCliDriver.java
 from template TestNegativeCliDriver.vm

create-dirs:

init:

install-hadoopcore:

install-hadoopcore-default:

download-ivy:

init-ivy:

settings-ivy:

resolve:
:: loading settings :: file = http://hudson.zones.apache.org/hudson/job/Hive-trunk-h0.17/ws/hive/ivy/ivysettings.xml

[ivy:retrieve] :: resolving dependencies :: org.apache.hadoop.hive#contrib;working@minerva.apache.org
[ivy:retrieve] 	confs: [default]
[ivy:retrieve] 	found hadoop#core;0.17.2.1 in hadoop-resolver
[ivy:retrieve] :: resolution report :: resolve 41ms :: artifacts dl 0ms
	---------------------------------------------------------------------
	|                  |            modules            ||   artifacts   |
	|       conf       | number| search|dwnlded|evicted|| number|dwnlded|
	---------------------------------------------------------------------
	|      default     |   1   |   0   |   0   |   0   ||   1   |   0   |
	---------------------------------------------------------------------
[ivy:retrieve] :: retrieving :: org.apache.hadoop.hive#contrib
[ivy:retrieve] 	confs: [default]
[ivy:retrieve] 	0 artifacts copied, 1 already retrieved (0kB/1ms)

install-hadoopcore-internal:

setup:

compile:
     [echo] Compiling: contrib

compile-test:
    [javac] Compiling 1 source file to http://hudson.zones.apache.org/hudson/job/Hive-trunk-h0.17/ws/hive/build/contrib/test/classes

    [javac] Compiling 4 source files to http://hudson.zones.apache.org/hudson/job/Hive-trunk-h0.17/ws/hive/build/contrib/test/classes


jar:
     [echo] Jar: contrib

test-jar:
      [jar] Building MANIFEST-only jar: http://hudson.zones.apache.org/hudson/job/Hive-trunk-h0.17/ws/hive/build/contrib/test/test-udfs.jar


test:
    [junit] Running org.apache.hadoop.hive.cli.TestContribCliDriver
    [junit] Begin query: fileformat_base64.q
    [junit] Loading data to table srcpart partition {ds=2008-04-08, hr=11}
    [junit] OK
    [junit] Loading data to table srcpart partition {ds=2008-04-08, hr=12}
    [junit] OK
    [junit] Loading data to table srcpart partition {ds=2008-04-09, hr=11}
    [junit] OK
    [junit] Loading data to table srcpart partition {ds=2008-04-09, hr=12}
    [junit] OK
    [junit] OK
    [junit] Loading data to table srcbucket
    [junit] OK
    [junit] Loading data to table srcbucket
    [junit] OK
    [junit] Loading data to table src
    [junit] OK
    [junit] Loading data to table src1
    [junit] OK
    [junit] Loading data to table src_sequencefile
    [junit] OK
    [junit] Loading data to table src_thrift
    [junit] OK
    [junit] Loading data to table src_json
    [junit] OK
    [junit] plan = /tmp/plan7925565761235098585.xml
    [junit] plan = /tmp/plan4194413942270355301.xml
    [junit] diff -a -I \(file:\)\|\(/tmp/.*\) http://hudson.zones.apache.org/hudson/job/Hive-trunk-h0.17/ws/hive/build/contrib/test/logs/contribclientpositive/fileformat_base64.q.out
 http://hudson.zones.apache.org/hudson/job/Hive-trunk-h0.17/ws/hive/contrib/src/test/results/clientpositive/fileformat_base64.q.out

    [junit] Done query: fileformat_base64.q
    [junit] Begin query: serde_regex.q
    [junit] Found class for org.apache.hadoop.hive.contrib.serde2.RegexSerDe
    [junit] plan = /tmp/plan8909761863522380980.xml
    [junit] diff -a -I \(file:\)\|\(/tmp/.*\) http://hudson.zones.apache.org/hudson/job/Hive-trunk-h0.17/ws/hive/build/contrib/test/logs/contribclientpositive/serde_regex.q.out
 http://hudson.zones.apache.org/hudson/job/Hive-trunk-h0.17/ws/hive/contrib/src/test/results/clientpositive/serde_regex.q.out

    [junit] Done query: serde_regex.q
    [junit] Begin query: serde_s3.q
    [junit] Found class for org.apache.hadoop.hive.contrib.serde2.s3.S3LogDeserializer
    [junit] diff -a -I \(file:\)\|\(/tmp/.*\) http://hudson.zones.apache.org/hudson/job/Hive-trunk-h0.17/ws/hive/build/contrib/test/logs/contribclientpositive/serde_s3.q.out
 http://hudson.zones.apache.org/hudson/job/Hive-trunk-h0.17/ws/hive/contrib/src/test/results/clientpositive/serde_s3.q.out

    [junit] Done query: serde_s3.q
    [junit] Begin query: serde_typedbytes.q
    [junit] plan = /tmp/plan5142945681940442192.xml
    [junit] java.lang.ClassCastException: org.apache.hadoop.io.BytesWritable cannot be cast
to org.apache.hadoop.io.Text
    [junit] 	at org.apache.hadoop.hive.ql.exec.ScriptOperator.processOp(ScriptOperator.java:276)
    [junit] 	at org.apache.hadoop.hive.ql.exec.Operator.process(Operator.java:365)
    [junit] 	at org.apache.hadoop.hive.ql.exec.Operator.forward(Operator.java:535)
    [junit] 	at org.apache.hadoop.hive.ql.exec.SelectOperator.processOp(SelectOperator.java:80)
    [junit] 	at org.apache.hadoop.hive.ql.exec.Operator.process(Operator.java:365)
    [junit] 	at org.apache.hadoop.hive.ql.exec.Operator.forward(Operator.java:535)
    [junit] 	at org.apache.hadoop.hive.ql.exec.TableScanOperator.processOp(TableScanOperator.java:42)
    [junit] 	at org.apache.hadoop.hive.ql.exec.Operator.process(Operator.java:365)
    [junit] 	at org.apache.hadoop.hive.ql.exec.Operator.forward(Operator.java:535)
    [junit] 	at org.apache.hadoop.hive.ql.exec.MapOperator.process(MapOperator.java:297)
    [junit] 	at org.apache.hadoop.hive.ql.exec.ExecMapper.map(ExecMapper.java:165)
    [junit] 	at org.apache.hadoop.mapred.MapRunner.run(MapRunner.java:47)
    [junit] 	at org.apache.hadoop.mapred.MapTask.run(MapTask.java:219)
    [junit] 	at org.apache.hadoop.mapred.LocalJobRunner$Job.run(LocalJobRunner.java:157)
    [junit] Running org.apache.hadoop.hive.cli.TestContribCliDriver
    [junit] Tests run: 1, Failures: 0, Errors: 1, Time elapsed: 0 sec
    [junit] Test org.apache.hadoop.hive.cli.TestContribCliDriver FAILED (timeout)
    [junit] Running org.apache.hadoop.hive.cli.TestContribNegativeCliDriver
    [junit] Begin query: serde_regex.q
    [junit] Loading data to table srcpart partition {ds=2008-04-08, hr=11}
    [junit] OK
    [junit] Loading data to table srcpart partition {ds=2008-04-08, hr=12}
    [junit] OK
    [junit] Loading data to table srcpart partition {ds=2008-04-09, hr=11}
    [junit] OK
    [junit] Loading data to table srcpart partition {ds=2008-04-09, hr=12}
    [junit] OK
    [junit] OK
    [junit] Loading data to table srcbucket
    [junit] OK
    [junit] Loading data to table srcbucket
    [junit] OK
    [junit] Loading data to table src
    [junit] OK
    [junit] Loading data to table src1
    [junit] OK
    [junit] Loading data to table src_sequencefile
    [junit] OK
    [junit] Loading data to table src_thrift
    [junit] OK
    [junit] Loading data to table src_json
    [junit] OK
    [junit] Found class for org.apache.hadoop.hive.contrib.serde2.RegexSerDe
    [junit] diff -a -I \(file:\)\|\(/tmp/.*\) http://hudson.zones.apache.org/hudson/job/Hive-trunk-h0.17/ws/hive/build/contrib/test/logs/contribclientnegative/serde_regex.q.out
 http://hudson.zones.apache.org/hudson/job/Hive-trunk-h0.17/ws/hive/contrib/src/test/results/clientnegative/serde_regex.q.out

    [junit] Done query: serde_regex.q
    [junit] Tests run: 1, Failures: 0, Errors: 0, Time elapsed: 5.264 sec
    [junit] Running org.apache.hadoop.hive.contrib.serde2.TestRegexSerDe
    [junit] Deserialized row: [127.0.0.1, -, -, [26/May/2009:00:00:00 +0000], "GET /someurl/?track=Blabla(Main)
HTTP/1.1", 200, 5864, -, "Mozilla/5.0 (Windows; U; Windows NT 6.0; en-US) AppleWebKit/525.19
(KHTML, like Gecko) Chrome/1.0.154.65 Safari/525.19"]
    [junit] Tests run: 1, Failures: 0, Errors: 0, Time elapsed: 0.198 sec
    [junit] Running org.apache.hadoop.hive.ql.parse.TestContribParse
    [junit] Tests run: 0, Failures: 0, Errors: 0, Time elapsed: 0.035 sec
    [junit] Running org.apache.hadoop.hive.ql.parse.TestContribParseNegative
    [junit] Tests run: 0, Failures: 0, Errors: 0, Time elapsed: 0.035 sec

BUILD FAILED
http://hudson.zones.apache.org/hudson/job/Hive-trunk-h0.17/ws/hive/build.xml :142: The following
error occurred while executing this line:
http://hudson.zones.apache.org/hudson/job/Hive-trunk-h0.17/ws/hive/build.xml :89: The following
error occurred while executing this line:
http://hudson.zones.apache.org/hudson/job/Hive-trunk-h0.17/ws/hive/build-common.xml :316:
Tests failed!

Total time: 123 minutes 43 seconds
Publishing Javadoc
Recording test results


Mime
View raw message