hadoop-hive-dev mailing list archives

Site index · List index
Message view « Date » · « Thread »
Top « Date » · « Thread »
From mvaradach...@facebook.com (Murli Varadachari)
Subject JIRA_HIVE-487-2.patch_BUILD_FAILED
Date Mon, 01 Jun 2009 11:12:59 GMT

ERROR: Build using PATCH HIVE-487-2.patch FAILED!!
patching file hwi/src/java/org/apache/hadoop/hive/hwi/HWIServer.java
patching file ql/src/java/org/apache/hadoop/hive/ql/exec/ExecDriver.java
patching file ql/src/java/org/apache/hadoop/hive/ql/exec/MapRedTask.java
Buildfile: build.xml

jar:

init:
    [mkdir] Created dir: /usr/local/continuous_builds/HivePatch-JIRA/HivePatch_JIRA/apache_hive/build
    [mkdir] Created dir: /usr/local/continuous_builds/HivePatch-JIRA/HivePatch_JIRA/apache_hive/build/common
    [mkdir] Created dir: /usr/local/continuous_builds/HivePatch-JIRA/HivePatch_JIRA/apache_hive/build/common/classes
    [mkdir] Created dir: /usr/local/continuous_builds/HivePatch-JIRA/HivePatch_JIRA/apache_hive/build/jexl/classes
    [mkdir] Created dir: /usr/local/continuous_builds/HivePatch-JIRA/HivePatch_JIRA/apache_hive/build/hadoopcore
    [mkdir] Created dir: /usr/local/continuous_builds/HivePatch-JIRA/HivePatch_JIRA/apache_hive/build/common/test
    [mkdir] Created dir: /usr/local/continuous_builds/HivePatch-JIRA/HivePatch_JIRA/apache_hive/build/common/test/src
    [mkdir] Created dir: /usr/local/continuous_builds/HivePatch-JIRA/HivePatch_JIRA/apache_hive/build/common/test/classes

install-hadoopcore:

install-hadoopcore-default:

download-ivy:

init-ivy:

settings-ivy:

resolve:
[ivy:retrieve] :: Ivy 2.0.0-rc2 - 20081028224207 :: http://ant.apache.org/ivy/ ::
:: loading settings :: file = /usr/local/continuous_builds/HivePatch-JIRA/HivePatch_JIRA/apache_hive/ivy/ivysettings.xml
[ivy:retrieve] :: resolving dependencies :: org.apache.hadoop.hive#common;working@devbuild002.snc1.facebook.com
[ivy:retrieve] 	confs: [default]
[ivy:retrieve] 	found hadoop#core;0.19.0 in hadoop-resolver
[ivy:retrieve] :: resolution report :: resolve 96ms :: artifacts dl 4ms
	---------------------------------------------------------------------
	|                  |            modules            ||   artifacts   |
	|       conf       | number| search|dwnlded|evicted|| number|dwnlded|
	---------------------------------------------------------------------
	|      default     |   1   |   0   |   0   |   0   ||   1   |   0   |
	---------------------------------------------------------------------
[ivy:retrieve] :: retrieving :: org.apache.hadoop.hive#common
[ivy:retrieve] 	confs: [default]
[ivy:retrieve] 	1 artifacts copied, 0 already retrieved (41275kB/202ms)

install-hadoopcore-internal:
    [untar] Expanding: /usr/local/continuous_builds/HivePatch-JIRA/HivePatch_JIRA/apache_hive/build/hadoopcore/hadoop-0.19.0.tar.gz
into /usr/local/continuous_builds/HivePatch-JIRA/HivePatch_JIRA/apache_hive/build/hadoopcore
    [touch] Creating /usr/local/continuous_builds/HivePatch-JIRA/HivePatch_JIRA/apache_hive/build/hadoopcore/hadoop-0.19.0.installed

compile:
     [echo] Compiling: common
    [javac] Compiling 2 source files to /usr/local/continuous_builds/HivePatch-JIRA/HivePatch_JIRA/apache_hive/build/common/classes

jar:
     [echo] Jar: common
      [jar] Building jar: /usr/local/continuous_builds/HivePatch-JIRA/HivePatch_JIRA/apache_hive/build/common/hive_common.jar

init:
    [mkdir] Created dir: /usr/local/continuous_builds/HivePatch-JIRA/HivePatch_JIRA/apache_hive/build/serde
    [mkdir] Created dir: /usr/local/continuous_builds/HivePatch-JIRA/HivePatch_JIRA/apache_hive/build/serde/classes
    [mkdir] Created dir: /usr/local/continuous_builds/HivePatch-JIRA/HivePatch_JIRA/apache_hive/build/serde/test
    [mkdir] Created dir: /usr/local/continuous_builds/HivePatch-JIRA/HivePatch_JIRA/apache_hive/build/serde/test/src
    [mkdir] Created dir: /usr/local/continuous_builds/HivePatch-JIRA/HivePatch_JIRA/apache_hive/build/serde/test/classes

dynamic-serde:

compile:
     [echo] Compiling: hive
    [javac] Compiling 171 source files to /usr/local/continuous_builds/HivePatch-JIRA/HivePatch_JIRA/apache_hive/build/serde/classes
    [javac] Note: Some input files use or override a deprecated API.
    [javac] Note: Recompile with -Xlint:deprecation for details.
    [javac] Note: Some input files use unchecked or unsafe operations.
    [javac] Note: Recompile with -Xlint:unchecked for details.

jar:
     [echo] Jar: serde
      [jar] Building jar: /usr/local/continuous_builds/HivePatch-JIRA/HivePatch_JIRA/apache_hive/build/serde/hive_serde.jar

init:
    [mkdir] Created dir: /usr/local/continuous_builds/HivePatch-JIRA/HivePatch_JIRA/apache_hive/build/metastore
    [mkdir] Created dir: /usr/local/continuous_builds/HivePatch-JIRA/HivePatch_JIRA/apache_hive/build/metastore/classes
    [mkdir] Created dir: /usr/local/continuous_builds/HivePatch-JIRA/HivePatch_JIRA/apache_hive/build/metastore/test
    [mkdir] Created dir: /usr/local/continuous_builds/HivePatch-JIRA/HivePatch_JIRA/apache_hive/build/metastore/test/src
    [mkdir] Created dir: /usr/local/continuous_builds/HivePatch-JIRA/HivePatch_JIRA/apache_hive/build/metastore/test/classes

model-compile:
    [javac] Compiling 8 source files to /usr/local/continuous_builds/HivePatch-JIRA/HivePatch_JIRA/apache_hive/build/metastore/classes
     [copy] Copying 1 file to /usr/local/continuous_builds/HivePatch-JIRA/HivePatch_JIRA/apache_hive/build/metastore/classes

core-compile:
     [echo] Compiling: 
    [javac] Compiling 28 source files to /usr/local/continuous_builds/HivePatch-JIRA/HivePatch_JIRA/apache_hive/build/metastore/classes
    [javac] Note: Some input files use unchecked or unsafe operations.
    [javac] Note: Recompile with -Xlint:unchecked for details.

model-enhance:
     [echo] Enhancing model classes with JPOX stuff....
     [java] JPOX Enhancer (version 1.2.2) : Enhancement of classes

     [java] JPOX Enhancer completed with success for 8 classes. Timings : input=247 ms, enhance=191
ms, total=438 ms. Consult the log for full details

compile:

jar:
     [echo] Jar: metastore
      [jar] Building jar: /usr/local/continuous_builds/HivePatch-JIRA/HivePatch_JIRA/apache_hive/build/metastore/hive_metastore.jar
Overriding previous definition of reference to test.classpath

init:
    [mkdir] Created dir: /usr/local/continuous_builds/HivePatch-JIRA/HivePatch_JIRA/apache_hive/build/ql
    [mkdir] Created dir: /usr/local/continuous_builds/HivePatch-JIRA/HivePatch_JIRA/apache_hive/build/ql/classes
    [mkdir] Created dir: /usr/local/continuous_builds/HivePatch-JIRA/HivePatch_JIRA/apache_hive/build/ql/test
    [mkdir] Created dir: /usr/local/continuous_builds/HivePatch-JIRA/HivePatch_JIRA/apache_hive/build/ql/test/src
    [mkdir] Created dir: /usr/local/continuous_builds/HivePatch-JIRA/HivePatch_JIRA/apache_hive/build/ql/test/classes

ql-init:
    [mkdir] Created dir: /usr/local/continuous_builds/HivePatch-JIRA/HivePatch_JIRA/apache_hive/build/ql/gen-java/org/apache/hadoop/hive/ql/parse

build-grammar:
     [echo] Building Grammar /usr/local/continuous_builds/HivePatch-JIRA/HivePatch_JIRA/apache_hive/ql/src/java/org/apache/hadoop/hive/ql/parse/Hive.g
 ....
     [java] ANTLR Parser Generator  Version 3.0.1 (August 13, 2007)  1989-2007

compile:
     [echo] Compiling: hive
    [javac] Compiling 348 source files to /usr/local/continuous_builds/HivePatch-JIRA/HivePatch_JIRA/apache_hive/build/ql/classes
    [javac] /usr/local/continuous_builds/HivePatch-JIRA/HivePatch_JIRA/apache_hive/ql/src/java/org/apache/hadoop/hive/ql/exec/FileSinkOperator.java:42:
warning: com.sun.corba.se.pept.encoding.InputObject is Sun proprietary API and may be removed
in a future release
    [javac] import com.sun.corba.se.pept.encoding.InputObject;
    [javac]                                      ^
    [javac] Note: Some input files use or override a deprecated API.
    [javac] Note: Recompile with -Xlint:deprecation for details.
    [javac] Note: Some input files use unchecked or unsafe operations.
    [javac] Note: Recompile with -Xlint:unchecked for details.
    [javac] 1 warning

jar:
     [echo] Jar: hive
    [unzip] Expanding: /usr/local/continuous_builds/HivePatch-JIRA/HivePatch_JIRA/apache_hive/lib/libthrift.jar
into /usr/local/continuous_builds/HivePatch-JIRA/HivePatch_JIRA/apache_hive/build/thrift/classes
    [unzip] Expanding: /usr/local/continuous_builds/HivePatch-JIRA/HivePatch_JIRA/apache_hive/lib/commons-lang-2.4.jar
into /usr/local/continuous_builds/HivePatch-JIRA/HivePatch_JIRA/apache_hive/build/commons-lang/classes
    [unzip] Expanding: /usr/local/continuous_builds/HivePatch-JIRA/HivePatch_JIRA/apache_hive/lib/json.jar
into /usr/local/continuous_builds/HivePatch-JIRA/HivePatch_JIRA/apache_hive/build/json/classes
      [jar] Building jar: /usr/local/continuous_builds/HivePatch-JIRA/HivePatch_JIRA/apache_hive/build/ql/hive_exec.jar

init:
    [mkdir] Created dir: /usr/local/continuous_builds/HivePatch-JIRA/HivePatch_JIRA/apache_hive/build/cli
    [mkdir] Created dir: /usr/local/continuous_builds/HivePatch-JIRA/HivePatch_JIRA/apache_hive/build/cli/classes
    [mkdir] Created dir: /usr/local/continuous_builds/HivePatch-JIRA/HivePatch_JIRA/apache_hive/build/cli/test
    [mkdir] Created dir: /usr/local/continuous_builds/HivePatch-JIRA/HivePatch_JIRA/apache_hive/build/cli/test/src
    [mkdir] Created dir: /usr/local/continuous_builds/HivePatch-JIRA/HivePatch_JIRA/apache_hive/build/cli/test/classes

install-hadoopcore:

install-hadoopcore-default:

download-ivy:

init-ivy:

settings-ivy:

resolve:
:: loading settings :: file = /usr/local/continuous_builds/HivePatch-JIRA/HivePatch_JIRA/apache_hive/ivy/ivysettings.xml
[ivy:retrieve] :: resolving dependencies :: org.apache.hadoop.hive#cli;working@devbuild002.snc1.facebook.com
[ivy:retrieve] 	confs: [default]
[ivy:retrieve] 	found hadoop#core;0.19.0 in hadoop-resolver
[ivy:retrieve] :: resolution report :: resolve 44ms :: artifacts dl 1ms
	---------------------------------------------------------------------
	|                  |            modules            ||   artifacts   |
	|       conf       | number| search|dwnlded|evicted|| number|dwnlded|
	---------------------------------------------------------------------
	|      default     |   1   |   0   |   0   |   0   ||   1   |   0   |
	---------------------------------------------------------------------
[ivy:retrieve] :: retrieving :: org.apache.hadoop.hive#cli
[ivy:retrieve] 	confs: [default]
[ivy:retrieve] 	0 artifacts copied, 1 already retrieved (0kB/3ms)

install-hadoopcore-internal:

compile:
     [echo] Compiling: cli
    [javac] Compiling 4 source files to /usr/local/continuous_builds/HivePatch-JIRA/HivePatch_JIRA/apache_hive/build/cli/classes
    [javac] Note: /usr/local/continuous_builds/HivePatch-JIRA/HivePatch_JIRA/apache_hive/cli/src/java/org/apache/hadoop/hive/cli/OptionsProcessor.java
uses unchecked or unsafe operations.
    [javac] Note: Recompile with -Xlint:unchecked for details.

jar:
     [echo] Jar: cli
      [jar] Building jar: /usr/local/continuous_builds/HivePatch-JIRA/HivePatch_JIRA/apache_hive/build/cli/hive_cli.jar
Overriding previous definition of reference to test.classpath

init:
    [mkdir] Created dir: /usr/local/continuous_builds/HivePatch-JIRA/HivePatch_JIRA/apache_hive/build/service
    [mkdir] Created dir: /usr/local/continuous_builds/HivePatch-JIRA/HivePatch_JIRA/apache_hive/build/service/classes
    [mkdir] Created dir: /usr/local/continuous_builds/HivePatch-JIRA/HivePatch_JIRA/apache_hive/build/service/test
    [mkdir] Created dir: /usr/local/continuous_builds/HivePatch-JIRA/HivePatch_JIRA/apache_hive/build/service/test/src
    [mkdir] Created dir: /usr/local/continuous_builds/HivePatch-JIRA/HivePatch_JIRA/apache_hive/build/service/test/classes

core-compile:
    [javac] Compiling 6 source files to /usr/local/continuous_builds/HivePatch-JIRA/HivePatch_JIRA/apache_hive/build/service/classes

compile:

jar:
     [echo] Jar: service
      [jar] Building jar: /usr/local/continuous_builds/HivePatch-JIRA/HivePatch_JIRA/apache_hive/build/service/hive_service.jar
Overriding previous definition of reference to test.classpath

init:
    [mkdir] Created dir: /usr/local/continuous_builds/HivePatch-JIRA/HivePatch_JIRA/apache_hive/build/jdbc
    [mkdir] Created dir: /usr/local/continuous_builds/HivePatch-JIRA/HivePatch_JIRA/apache_hive/build/jdbc/classes
    [mkdir] Created dir: /usr/local/continuous_builds/HivePatch-JIRA/HivePatch_JIRA/apache_hive/build/jdbc/test
    [mkdir] Created dir: /usr/local/continuous_builds/HivePatch-JIRA/HivePatch_JIRA/apache_hive/build/jdbc/test/src
    [mkdir] Created dir: /usr/local/continuous_builds/HivePatch-JIRA/HivePatch_JIRA/apache_hive/build/jdbc/test/classes

core-compile:
    [javac] Compiling 10 source files to /usr/local/continuous_builds/HivePatch-JIRA/HivePatch_JIRA/apache_hive/build/jdbc/classes
    [javac] Note: Some input files use or override a deprecated API.
    [javac] Note: Recompile with -Xlint:deprecation for details.

compile:

jar:
     [echo] Jar: jdbc
      [jar] Building jar: /usr/local/continuous_builds/HivePatch-JIRA/HivePatch_JIRA/apache_hive/build/jdbc/hive_jdbc.jar
Overriding previous definition of reference to test.classpath

hwi-init:
    [mkdir] Created dir: /usr/local/continuous_builds/HivePatch-JIRA/HivePatch_JIRA/apache_hive/build/hwi/classes
    [mkdir] Created dir: /usr/local/continuous_builds/HivePatch-JIRA/HivePatch_JIRA/apache_hive/build/hwi/test/classes
    [mkdir] Created dir: /usr/local/continuous_builds/HivePatch-JIRA/HivePatch_JIRA/apache_hive/build/hwi/test/src

compile:
     [echo] Compiling: hive
    [javac] Compiling 7 source files to /usr/local/continuous_builds/HivePatch-JIRA/HivePatch_JIRA/apache_hive/build/hwi/classes
    [javac] /usr/local/continuous_builds/HivePatch-JIRA/HivePatch_JIRA/apache_hive/hwi/src/java/org/apache/hadoop/hive/hwi/HWIServer.java:9:
cannot find symbol
    [javac] symbol  : class Connector
    [javac] location: package org.mortbay.jetty
    [javac] import org.mortbay.jetty.Connector;
    [javac]                         ^
    [javac] /usr/local/continuous_builds/HivePatch-JIRA/HivePatch_JIRA/apache_hive/hwi/src/java/org/apache/hadoop/hive/hwi/HWIServer.java:10:
package org.mortbay.jetty.bio does not exist
    [javac] import org.mortbay.jetty.bio.SocketConnector;
    [javac]                             ^
    [javac] /usr/local/continuous_builds/HivePatch-JIRA/HivePatch_JIRA/apache_hive/hwi/src/java/org/apache/hadoop/hive/hwi/HWIServer.java:11:
package org.mortbay.jetty.handler does not exist
    [javac] import org.mortbay.jetty.handler.RequestLogHandler;
    [javac]                                 ^
    [javac] /usr/local/continuous_builds/HivePatch-JIRA/HivePatch_JIRA/apache_hive/hwi/src/java/org/apache/hadoop/hive/hwi/HWIServer.java:13:
package org.mortbay.jetty.webapp does not exist
    [javac] import org.mortbay.jetty.webapp.WebAppContext;
    [javac]                                ^
    [javac] /usr/local/continuous_builds/HivePatch-JIRA/HivePatch_JIRA/apache_hive/hwi/src/java/org/apache/hadoop/hive/hwi/HWIServer.java:23:
cannot find symbol
    [javac] symbol  : class SocketConnector
    [javac] location: class org.apache.hadoop.hive.hwi.HWIServer
    [javac] 	  private SocketConnector connector;
    [javac] 	          ^
    [javac] /usr/local/continuous_builds/HivePatch-JIRA/HivePatch_JIRA/apache_hive/hwi/src/java/org/apache/hadoop/hive/hwi/HWIServer.java:42:
cannot find symbol
    [javac] symbol  : class SocketConnector
    [javac] location: class org.apache.hadoop.hive.hwi.HWIServer
    [javac] 	    connector = new SocketConnector();
    [javac] 	                    ^
    [javac] /usr/local/continuous_builds/HivePatch-JIRA/HivePatch_JIRA/apache_hive/hwi/src/java/org/apache/hadoop/hive/hwi/HWIServer.java:65:
cannot find symbol
    [javac] symbol  : class WebAppContext
    [javac] location: class org.apache.hadoop.hive.hwi.HWIServer
    [javac] 	    WebAppContext wac = new WebAppContext();
    [javac] 	    ^
    [javac] /usr/local/continuous_builds/HivePatch-JIRA/HivePatch_JIRA/apache_hive/hwi/src/java/org/apache/hadoop/hive/hwi/HWIServer.java:65:
cannot find symbol
    [javac] symbol  : class WebAppContext
    [javac] location: class org.apache.hadoop.hive.hwi.HWIServer
    [javac] 	    WebAppContext wac = new WebAppContext();
    [javac] 	                            ^
    [javac] /usr/local/continuous_builds/HivePatch-JIRA/HivePatch_JIRA/apache_hive/hwi/src/java/org/apache/hadoop/hive/hwi/HWIServer.java:84:
cannot find symbol
    [javac] symbol  : class RequestLogHandler
    [javac] location: class org.apache.hadoop.hive.hwi.HWIServer
    [javac] 	    RequestLogHandler rlh = new RequestLogHandler();
    [javac] 	    ^
    [javac] /usr/local/continuous_builds/HivePatch-JIRA/HivePatch_JIRA/apache_hive/hwi/src/java/org/apache/hadoop/hive/hwi/HWIServer.java:84:
cannot find symbol
    [javac] symbol  : class RequestLogHandler
    [javac] location: class org.apache.hadoop.hive.hwi.HWIServer
    [javac] 	    RequestLogHandler rlh = new RequestLogHandler();
    [javac] 	                                ^
    [javac] 10 errors

BUILD FAILED
/usr/local/continuous_builds/HivePatch-JIRA/HivePatch_JIRA/apache_hive/build.xml:114: The
following error occurred while executing this line:
/usr/local/continuous_builds/HivePatch-JIRA/HivePatch_JIRA/apache_hive/build.xml:73: The following
error occurred while executing this line:
/usr/local/continuous_builds/HivePatch-JIRA/HivePatch_JIRA/apache_hive/hwi/build.xml:33: Compile
failed; see the compiler error output for details.

Total time: 20 seconds

Mime
View raw message