hadoop-hive-dev mailing list archives

Site index · List index
Message view « Date » · « Thread »
Top « Date » · « Thread »
From mvaradach...@facebook.com (Murli Varadachari)
Subject *UNIT TEST FAILURE for apache HIVE* Hadoop.Version=0.17.1 based on SVN Rev# 765482.123
Date Thu, 16 Apr 2009 07:26:40 GMT
    [junit] < FAILED: Parse Error: line 1:32 cannot recognize input '.' in table column
identifier
    [junit] > FAILED: Parse Error: line 1:32 cannot recognize input '.' in expression specification
    [junit] Test org.apache.hadoop.hive.cli.TestNegativeCliDriver FAILED
BUILD FAILED
    [junit] Test org.apache.hadoop.hive.cli.TestCliDriver FAILED
    [junit] < FAILED: Parse Error: line 1:32 cannot recognize input '.' in table column
identifier
    [junit] > FAILED: Parse Error: line 1:32 cannot recognize input '.' in expression specification
    [junit] Test org.apache.hadoop.hive.cli.TestNegativeCliDriver FAILED
BUILD FAILED

Mime
View raw message