hadoop-hive-dev mailing list archives

Site index · List index
Message view « Date » · « Thread »
Top « Date » · « Thread »
From mvaradach...@facebook.com (Murli Varadachari)
Subject JIRA_hive-360-2009-04-08-3.patch_UNIT_TEST_FAILED
Date Wed, 08 Apr 2009 07:37:24 GMT

ERROR: UNIT TEST using PATCH hive-360-2009-04-08-3.patch FAILED!!

    [junit] Test org.apache.hadoop.hive.cli.TestCliDriver FAILED
    [junit] < FAILED: Error in semantic analysis: Output Format must implement HiveOutputFormat,
otherwise it should be either IgnoreKeyTextOutputFormat or SequenceFileOutputFormat
    [junit] > FAILED: Error in metadata: Class not found: ClassDoesNotExist
    [junit] > FAILED: Execution Error, return code 1 from org.apache.hadoop.hive.ql.exec.DDLTask
    [junit] < FAILED: Error in semantic analysis: Output Format must implement HiveOutputFormat,
otherwise it should be either IgnoreKeyTextOutputFormat or SequenceFileOutputFormat
    [junit] > FAILED: Error in semantic analysis: line 4:23 Output Format must implement
OutputFormat dest1
    [junit] Test org.apache.hadoop.hive.cli.TestNegativeCliDriver FAILED
    [junit] Test org.apache.hadoop.hive.ql.TestMTQueries FAILED
    [junit] Test org.apache.hadoop.hive.ql.metadata.TestHiveMetaStoreChecker FAILED
    [junit] Test org.apache.hadoop.hive.ql.parse.TestParse FAILED
BUILD FAILED

Mime
View raw message