hadoop-hive-dev mailing list archives

Site index · List index
Message view « Date » · « Thread »
Top « Date » · « Thread »
From mvaradach...@facebook.com (Murli Varadachari)
Subject JIRA_hive-360-2009-04-01.patch_BUILD_FAILED
Date Wed, 01 Apr 2009 16:03:00 GMT

ERROR: Build using PATCH hive-360-2009-04-01.patch FAILED!!
patching file ql/src/java/org/apache/hadoop/hive/ql/exec/FileSinkOperator.java
patching file ql/src/java/org/apache/hadoop/hive/ql/io/HiveIgnoreKeyTextOutputFormat.java
patching file ql/src/java/org/apache/hadoop/hive/ql/io/HiveOutputFormat.java
patching file ql/src/java/org/apache/hadoop/hive/ql/io/HiveOutputFormatUtils.java
patching file ql/src/java/org/apache/hadoop/hive/ql/io/HiveSequenceFileOutputFormat.java
patching file ql/src/java/org/apache/hadoop/hive/ql/io/IgnoreKeyTextOutputFormat.java
Buildfile: build.xml

deploy:

init:
    [mkdir] Created dir: /usr/local/continuous_builds/HivePatch-JIRA/HivePatch_JIRA/apache_hive/build
    [mkdir] Created dir: /usr/local/continuous_builds/HivePatch-JIRA/HivePatch_JIRA/apache_hive/build/common
    [mkdir] Created dir: /usr/local/continuous_builds/HivePatch-JIRA/HivePatch_JIRA/apache_hive/build/common/classes
    [mkdir] Created dir: /usr/local/continuous_builds/HivePatch-JIRA/HivePatch_JIRA/apache_hive/build/jexl/classes
    [mkdir] Created dir: /usr/local/continuous_builds/HivePatch-JIRA/HivePatch_JIRA/apache_hive/build/hadoopcore
    [mkdir] Created dir: /usr/local/continuous_builds/HivePatch-JIRA/HivePatch_JIRA/apache_hive/build/common/test
    [mkdir] Created dir: /usr/local/continuous_builds/HivePatch-JIRA/HivePatch_JIRA/apache_hive/build/common/test/src
    [mkdir] Created dir: /usr/local/continuous_builds/HivePatch-JIRA/HivePatch_JIRA/apache_hive/build/common/test/classes

download-ivy:

init-ivy:

settings-ivy:

resolve:
[ivy:retrieve] :: Ivy 2.0.0-rc2 - 20081028224207 :: http://ant.apache.org/ivy/ ::
:: loading settings :: file = /usr/local/continuous_builds/HivePatch-JIRA/HivePatch_JIRA/apache_hive/ivy/ivysettings.xml
[ivy:retrieve] :: resolving dependencies :: org.apache.hadoop.hive#common;working@devbuild002.snc1.facebook.com
[ivy:retrieve] 	confs: [default]
[ivy:retrieve] 	found hadoop#core;0.19.0 in hadoop-resolver
[ivy:retrieve] :: resolution report :: resolve 222ms :: artifacts dl 15ms
	---------------------------------------------------------------------
	|                  |            modules            ||   artifacts   |
	|       conf       | number| search|dwnlded|evicted|| number|dwnlded|
	---------------------------------------------------------------------
	|      default     |   1   |   0   |   0   |   0   ||   1   |   0   |
	---------------------------------------------------------------------
[ivy:retrieve] :: retrieving :: org.apache.hadoop.hive#common
[ivy:retrieve] 	confs: [default]
[ivy:retrieve] 	1 artifacts copied, 0 already retrieved (41275kB/478ms)

install-hadoopcore:
    [untar] Expanding: /usr/local/continuous_builds/HivePatch-JIRA/HivePatch_JIRA/apache_hive/build/hadoopcore/hadoop-0.19.0.tar.gz
into /usr/local/continuous_builds/HivePatch-JIRA/HivePatch_JIRA/apache_hive/build/hadoopcore
    [touch] Creating /usr/local/continuous_builds/HivePatch-JIRA/HivePatch_JIRA/apache_hive/build/hadoopcore/hadoop-0.19.0.installed

compile:
     [echo] Compiling: common
    [javac] Compiling 1 source file to /usr/local/continuous_builds/HivePatch-JIRA/HivePatch_JIRA/apache_hive/build/common/classes

jar:
     [echo] Jar: common
      [jar] Building jar: /usr/local/continuous_builds/HivePatch-JIRA/HivePatch_JIRA/apache_hive/build/common/hive_common.jar

deploy:
     [echo] hive: common
     [copy] Copying 1 file to /usr/local/continuous_builds/HivePatch-JIRA/HivePatch_JIRA/apache_hive/build

init:
    [mkdir] Created dir: /usr/local/continuous_builds/HivePatch-JIRA/HivePatch_JIRA/apache_hive/build/serde
    [mkdir] Created dir: /usr/local/continuous_builds/HivePatch-JIRA/HivePatch_JIRA/apache_hive/build/serde/classes
    [mkdir] Created dir: /usr/local/continuous_builds/HivePatch-JIRA/HivePatch_JIRA/apache_hive/build/serde/test
    [mkdir] Created dir: /usr/local/continuous_builds/HivePatch-JIRA/HivePatch_JIRA/apache_hive/build/serde/test/src
    [mkdir] Created dir: /usr/local/continuous_builds/HivePatch-JIRA/HivePatch_JIRA/apache_hive/build/serde/test/classes

dynamic-serde:

compile:
     [echo] Compiling: serde
    [javac] Compiling 130 source files to /usr/local/continuous_builds/HivePatch-JIRA/HivePatch_JIRA/apache_hive/build/serde/classes
    [javac] Note: Some input files use or override a deprecated API.
    [javac] Note: Recompile with -Xlint:deprecation for details.
    [javac] Note: Some input files use unchecked or unsafe operations.
    [javac] Note: Recompile with -Xlint:unchecked for details.

jar:
     [echo] Jar: serde
      [jar] Building jar: /usr/local/continuous_builds/HivePatch-JIRA/HivePatch_JIRA/apache_hive/build/serde/hive_serde.jar

deploy:
     [echo] hive: serde
     [copy] Copying 1 file to /usr/local/continuous_builds/HivePatch-JIRA/HivePatch_JIRA/apache_hive/build

init:
    [mkdir] Created dir: /usr/local/continuous_builds/HivePatch-JIRA/HivePatch_JIRA/apache_hive/build/metastore
    [mkdir] Created dir: /usr/local/continuous_builds/HivePatch-JIRA/HivePatch_JIRA/apache_hive/build/metastore/classes
    [mkdir] Created dir: /usr/local/continuous_builds/HivePatch-JIRA/HivePatch_JIRA/apache_hive/build/metastore/test
    [mkdir] Created dir: /usr/local/continuous_builds/HivePatch-JIRA/HivePatch_JIRA/apache_hive/build/metastore/test/src
    [mkdir] Created dir: /usr/local/continuous_builds/HivePatch-JIRA/HivePatch_JIRA/apache_hive/build/metastore/test/classes

model-compile:
    [javac] Compiling 8 source files to /usr/local/continuous_builds/HivePatch-JIRA/HivePatch_JIRA/apache_hive/build/metastore/classes
     [copy] Copying 1 file to /usr/local/continuous_builds/HivePatch-JIRA/HivePatch_JIRA/apache_hive/build/metastore/classes

core-compile:
     [echo] Compiling: 
    [javac] Compiling 38 source files to /usr/local/continuous_builds/HivePatch-JIRA/HivePatch_JIRA/apache_hive/build/metastore/classes
    [javac] Note: Some input files use unchecked or unsafe operations.
    [javac] Note: Recompile with -Xlint:unchecked for details.

model-enhance:
     [echo] Enhancing model classes with JPOX stuff....
     [java] JPOX Enhancer (version 1.2.2) : Enhancement of classes

     [java] JPOX Enhancer completed with success for 8 classes. Timings : input=219 ms, enhance=219
ms, total=438 ms. Consult the log for full details

compile:

jar:
     [echo] Jar: metastore
      [jar] Building jar: /usr/local/continuous_builds/HivePatch-JIRA/HivePatch_JIRA/apache_hive/build/metastore/hive_metastore.jar

deploy:
     [echo] hive: metastore
     [copy] Copying 1 file to /usr/local/continuous_builds/HivePatch-JIRA/HivePatch_JIRA/apache_hive/build
Overriding previous definition of reference to test.classpath

init:
    [mkdir] Created dir: /usr/local/continuous_builds/HivePatch-JIRA/HivePatch_JIRA/apache_hive/build/ql
    [mkdir] Created dir: /usr/local/continuous_builds/HivePatch-JIRA/HivePatch_JIRA/apache_hive/build/ql/classes
    [mkdir] Created dir: /usr/local/continuous_builds/HivePatch-JIRA/HivePatch_JIRA/apache_hive/build/ql/test
    [mkdir] Created dir: /usr/local/continuous_builds/HivePatch-JIRA/HivePatch_JIRA/apache_hive/build/ql/test/src
    [mkdir] Created dir: /usr/local/continuous_builds/HivePatch-JIRA/HivePatch_JIRA/apache_hive/build/ql/test/classes

ql-init:
    [mkdir] Created dir: /usr/local/continuous_builds/HivePatch-JIRA/HivePatch_JIRA/apache_hive/build/ql/gen-java/org/apache/hadoop/hive/ql/parse

build-grammar:
     [echo] Building Grammar /usr/local/continuous_builds/HivePatch-JIRA/HivePatch_JIRA/apache_hive/ql/src/java/org/apache/hadoop/hive/ql/parse/Hive.g
 ....
     [java] ANTLR Parser Generator  Version 3.0.1 (August 13, 2007)  1989-2007

compile-ant-tasks:

init:
    [mkdir] Created dir: /usr/local/continuous_builds/HivePatch-JIRA/HivePatch_JIRA/apache_hive/build/anttasks
    [mkdir] Created dir: /usr/local/continuous_builds/HivePatch-JIRA/HivePatch_JIRA/apache_hive/build/anttasks/classes
    [mkdir] Created dir: /usr/local/continuous_builds/HivePatch-JIRA/HivePatch_JIRA/apache_hive/build/anttasks/test
    [mkdir] Created dir: /usr/local/continuous_builds/HivePatch-JIRA/HivePatch_JIRA/apache_hive/build/anttasks/test/src
    [mkdir] Created dir: /usr/local/continuous_builds/HivePatch-JIRA/HivePatch_JIRA/apache_hive/build/anttasks/test/classes

download-ivy:

init-ivy:

settings-ivy:

resolve:
:: loading settings :: file = /usr/local/continuous_builds/HivePatch-JIRA/HivePatch_JIRA/apache_hive/ivy/ivysettings.xml
[ivy:retrieve] :: resolving dependencies :: org.apache.hadoop.hive#ant;working@devbuild002.snc1.facebook.com
[ivy:retrieve] 	confs: [default]
[ivy:retrieve] :: resolution report :: resolve 20ms :: artifacts dl 0ms
	---------------------------------------------------------------------
	|                  |            modules            ||   artifacts   |
	|       conf       | number| search|dwnlded|evicted|| number|dwnlded|
	---------------------------------------------------------------------
	|      default     |   0   |   0   |   0   |   0   ||   0   |   0   |
	---------------------------------------------------------------------
[ivy:retrieve] :: retrieving :: org.apache.hadoop.hive#ant
[ivy:retrieve] 	confs: [default]
[ivy:retrieve] 	0 artifacts copied, 0 already retrieved (0kB/3ms)

install-hadoopcore:

compile:
     [echo] Compiling: anttasks
    [javac] Compiling 2 source files to /usr/local/continuous_builds/HivePatch-JIRA/HivePatch_JIRA/apache_hive/build/anttasks/classes
    [javac] Note: /usr/local/continuous_builds/HivePatch-JIRA/HivePatch_JIRA/apache_hive/ant/src/org/apache/hadoop/hive/ant/QTestGenTask.java
uses or overrides a deprecated API.
    [javac] Note: Recompile with -Xlint:deprecation for details.

deploy-ant-tasks:

init:

download-ivy:

init-ivy:

settings-ivy:

resolve:
:: loading settings :: file = /usr/local/continuous_builds/HivePatch-JIRA/HivePatch_JIRA/apache_hive/ivy/ivysettings.xml
[ivy:retrieve] :: resolving dependencies :: org.apache.hadoop.hive#ant;working@devbuild002.snc1.facebook.com
[ivy:retrieve] 	confs: [default]
[ivy:retrieve] :: resolution report :: resolve 11ms :: artifacts dl 0ms
	---------------------------------------------------------------------
	|                  |            modules            ||   artifacts   |
	|       conf       | number| search|dwnlded|evicted|| number|dwnlded|
	---------------------------------------------------------------------
	|      default     |   0   |   0   |   0   |   0   ||   0   |   0   |
	---------------------------------------------------------------------
[ivy:retrieve] :: retrieving :: org.apache.hadoop.hive#ant
[ivy:retrieve] 	confs: [default]
[ivy:retrieve] 	0 artifacts copied, 0 already retrieved (0kB/4ms)

install-hadoopcore:

compile:
     [echo] Compiling: anttasks

jar:
     [copy] Copying 1 file to /usr/local/continuous_builds/HivePatch-JIRA/HivePatch_JIRA/apache_hive/build/anttasks/classes/org/apache/hadoop/hive/ant
      [jar] Building jar: /usr/local/continuous_builds/HivePatch-JIRA/HivePatch_JIRA/apache_hive/build/anttasks/hive_anttasks.jar

deploy:
     [echo] hive: anttasks
     [copy] Copying 1 file to /usr/local/continuous_builds/HivePatch-JIRA/HivePatch_JIRA/apache_hive/build

configure:
     [copy] Copying 262 files to /usr/local/continuous_builds/HivePatch-JIRA/HivePatch_JIRA/apache_hive/build/ql/java

compile:
     [echo] Compiling: ql
    [javac] Compiling 264 source files to /usr/local/continuous_builds/HivePatch-JIRA/HivePatch_JIRA/apache_hive/build/ql/classes
    [javac] /usr/local/continuous_builds/HivePatch-JIRA/HivePatch_JIRA/apache_hive/build/ql/java/org/apache/hadoop/hive/ql/io/HiveSequenceFileOutputFormat.java:37:
org.apache.hadoop.mapred.OutputFormat cannot be inherited with different arguments: <org.apache.hadoop.io.WritableComparable,org.apache.hadoop.io.Writable>
and <>
    [javac] public class HiveSequenceFileOutputFormat extends
    [javac]        ^
    [javac] Note: Some input files use or override a deprecated API.
    [javac] Note: Recompile with -Xlint:deprecation for details.
    [javac] Note: Some input files use unchecked or unsafe operations.
    [javac] Note: Recompile with -Xlint:unchecked for details.
    [javac] 1 error

BUILD FAILED
/usr/local/continuous_builds/HivePatch-JIRA/HivePatch_JIRA/apache_hive/build.xml:96: The following
error occurred while executing this line:
/usr/local/continuous_builds/HivePatch-JIRA/HivePatch_JIRA/apache_hive/ql/build.xml:135: Compile
failed; see the compiler error output for details.

Total time: 19 seconds

Mime
View raw message