hadoop-hive-dev mailing list archives

Site index · List index
Message view « Date » · « Thread »
Top « Date » · « Thread »
From mvaradach...@facebook.com (Murli Varadachari)
Subject JIRA_patch-251_1.txt_UNIT_TEST_FAILED
Date Tue, 17 Mar 2009 23:41:12 GMT

ERROR: UNIT TEST using PATCH patch-251_1.txt FAILED!!

    [junit] Test org.apache.hadoop.hive.cli.TestCliDriver FAILED
BUILD FAILED

Mime
View raw message