hadoop-hive-dev mailing list archives

Site index · List index
Message view « Date » · « Thread »
Top « Date » · « Thread »
From mvaradach...@facebook.com (Murli Varadachari)
Subject JIRA_hive.347.3.patch_UNIT_TEST_FAILED
Date Tue, 17 Mar 2009 01:54:04 GMT

ERROR: UNIT TEST using PATCH hive.347.3.patch FAILED!!

    [junit] Test org.apache.hadoop.hive.cli.TestCliDriver FAILED (timeout)
BUILD FAILED

Mime
View raw message