hadoop-hive-dev mailing list archives

Site index · List index
Message view « Date » · « Thread »
Top « Date » · « Thread »
From mvaradach...@facebook.com (Murli Varadachari)
Subject JIRA_hive-285.1.patch_UNIT_TEST_FAILED
Date Thu, 26 Feb 2009 15:24:22 GMT

ERROR: UNIT TEST using PATCH hive-285.1.patch FAILED!!

    [junit] < FAILED: Error in semantic analysis: line 3:50 Invalid Column Reference r
    [junit] > FAILED: Error in semantic analysis: Schema of both sides of union should
match: Column v is of type string on first table and type double on second table
    [junit] Test org.apache.hadoop.hive.cli.TestNegativeCliDriver FAILED
BUILD FAILED

Mime
View raw message