hadoop-hive-dev mailing list archives

Site index · List index
Message view « Date » · « Thread »
Top « Date » · « Thread »
From mvaradach...@facebook.com (Murli Varadachari)
Subject JIRA_patch-273_2.txt_UNIT_TEST_FAILED
Date Fri, 06 Feb 2009 08:51:33 GMT

ERROR: UNIT TEST using PATCH patch-273_2.txt FAILED!!

    [junit] Test org.apache.hadoop.hive.cli.TestCliDriver FAILED
BUILD FAILED

Mime
View raw message